automatic DPDK test reports
 help / color / mirror / Atom feed
From: sys_stv@intel.com
To: test-report@dpdk.org
Subject: [dpdk-test-report] |FAILURE| pw66515[01/10] doc: add generic atomic deprecation section
Date: 11 Mar 2020 00:43:21 -0700
Message-ID: <ee68f5$9j4fem@orsmga001.jf.intel.com> (raw)

[-- Attachment #1: Type: text/plain, Size: 46397 bytes --]

Test-Label: Intel-compilation
Test-Status: FAILURE
http://dpdk.org/patch/66515

_Compilation issues_

Submitter: Phil Yang <phil.yang@arm.com>
Date: 2020-03-10 17:49:02
Reply_mail: 1583862551-2049-2-git-send-email-phil.yang@arm.com
DPDK git baseline: Repo:dpdk, CommitID: 44c775feb491106d472c1a44433c6427a3fb3b3b

Makefile build Summary: 23 Builds Done, 23 Successful, 0 Failures

Meson build Summary: 8 Builds Done, 3 Successful, 5 Failures

               +==============================================+===========+==========+
               |                   Makefile                   |   Meson   | Document |
+----------------+------+-------+------+------------+-----------+-----------+----------+
| os             | gcc  | clang | icc  | gcc+shared | gcc+debug | gcc/clang | pdf/html |
+----------------+------+-------+------+------------+-----------+-----------+----------+
| RHEL80-64      | pass |       |      |            |           |           |          |
| UB1804-64      | pass | pass  | pass |            |           | FAIL      | pass     |
| UB1604-32      | pass |       |      |            |           | FAIL      |          |
| CENTOS77-64    | pass | pass  | pass | pass       | pass      | FAIL      |          |
| UB1604-64      | pass | pass  |      |            |           |           |          |
| WIN10-64       |      |       |      |            |           | pass      |          |
| UB1910-64      | pass |       |      |            |           |           |          |
| FC31-64        | pass | pass  |      |            |           | FAIL      |          |
| CENTOS80-64    | pass |       |      |            |           |           |          |
| FreeBSD1201-64 | pass | pass  |      | pass       | pass      | pass      |          |
| RHEL77-64      | pass |       |      |            |           |           |          |
| SUSE15-64      | pass | pass  |      |            |           | FAIL      |          |
+----------------+------+-------+------+------------+-----------+-----------+----------+

Test environment and configuration as below:

** Makefile build **


OS: UB1804-64
	Kernel Version: 4.15.0-20-generic
	CPU info: Intel(R) Xeon(R) CPU E5-2699 v3 @ 2.30GHz
	GCC Version: gcc (Ubuntu 7.3.0-16ubuntu3) 7.3.0
	Clang Version: 6.0.0-1ubuntu2 (tags/RELEASE_600/final)
	x86_64-native-linuxapp-clang
	x86_64-native-linuxapp-icc
	x86_64-native-linuxapp-gcc


OS: UB1604-32
	Kernel Version: 4.4.0-131-generic
	CPU info: Intel(R) Xeon(R) CPU E5-2699 v3 @ 2.30GHz
	GCC Version: gcc (Ubuntu 5.4.0-6ubuntu1~16.04.11) 5.4.0 20160609
	Clang Version: 3.8.0-2ubuntu4 (tags/RELEASE_380/final)
	i686-native-linuxapp-gcc


OS: CENTOS77-64
	Kernel Version: 3.10.0-1062.9.1.el7.x86_64
	CPU info: Intel(R) Xeon(R) CPU E5-2699 v4 @ 2.20GHz
	GCC Version: gcc (GCC) 4.8.5 20150623 (Red Hat 4.8.5-39)
	Clang Version: 3.4.2 (tags/RELEASE_34/dot2-final)
	x86_64-native-linuxapp-clang
	x86_64-native-linuxapp-gcc+debug
	x86_64-native-linuxapp-gcc+shared
	x86_64-native-linuxapp-gcc
	x86_64-native-linuxapp-icc


OS: UB1910-64
	Kernel Version: 5.3.0-18-generic
	CPU info: Intel(R) Xeon(R) CPU E5-2699 v3 @ 2.30GHz
	GCC Version: gcc (Ubuntu 9.2.1-9ubuntu2) 9.2.1 20191008
	Clang Version: 9.0.0-2 (tags/RELEASE_900/final)
	x86_64-native-linuxapp-gcc


OS: CENTOS80-64
	Kernel Version: 4.18.0-80.11.2.el8_0.x86_64
	CPU info: Intel(R) Xeon(R) CPU E5-2699 v4 @ 2.20GHz
	GCC Version: gcc (GCC) 8.2.1 20180905 (Red Hat 8.2.1-3)
	Clang Version: 7.0.1 (tags/RELEASE_701/final)
	x86_64-native-linuxapp-gcc


OS: UB1604-64
	Kernel Version: 4.4.0-170-generic
	CPU info: Intel(R) Xeon(R) CPU E5-2699 v3 @ 2.30GHz
	GCC Version: gcc (Ubuntu 5.4.0-6ubuntu1~16.04.12) 5.4.0 20160609
	Clang Version: 3.8.0-2ubuntu4 (tags/RELEASE_380/final)
	x86_64-native-linuxapp-clang
	x86_64-native-linuxapp-gcc


OS: FC31-64
	Kernel Version: 5.3.15-300.fc31.x86_64
	CPU info: Intel(R) Xeon(R) CPU E5-2699 v4 @ 2.20GHz
	GCC Version: gcc (GCC) 9.2.1 20190827 (Red Hat 9.2.1-1)
	Clang Version: 9.0.0 (Fedora 9.0.0-1.fc31)
	x86_64-native-linuxapp-gcc
	x86_64-native-linuxapp-clang


OS: RHEL80-64
	Kernel Version: 4.18.0-80.el8.x86_64
	CPU info: Intel(R) Xeon(R) CPU E5-2699 v4 @ 2.20GHz
	GCC Version: gcc (GCC) 8.2.1 20180905 (Red Hat 8.2.1-3)
	Clang Version: 6.0.1 (tags/RELEASE_601/final)
	x86_64-native-linuxapp-gcc


OS: FreeBSD1201-64
	Kernel Version: 12.1-RELEASE
	CPU info: Intel(R) Xeon(R) CPU E5-2699 v4 @ 2.20GHz (2194.95-MHz K8-class CPU)
	GCC Version: gcc (FreeBSD Ports Collection) 9.2.0
	Clang Version: 8.0.1 (tags/RELEASE_801/final 366581) (based on LLVM 8.0.1)
	x86_64-native-bsdapp-gcc
	x86_64-native-bsdapp-clang
	x86_64-native-bsdapp-gcc+debug
	x86_64-native-bsdapp-gcc+shared


OS: RHEL77-64
	Kernel Version: 3.10.0-1062.9.1.el7.x86_64
	CPU info: Intel(R) Xeon(R) CPU E5-2699 v4 @ 2.20GHz
	GCC Version: gcc (GCC) 4.8.5 20150623 (Red Hat 4.8.5-39)
	Clang Version: 3.4.2 (tags/RELEASE_34/dot2-final)
	x86_64-native-linuxapp-gcc


OS: SUSE15-64
	Kernel Version: 4.12.14-lp150.11-default
	CPU info: Intel(R) Xeon(R) CPU E5-2699 v4 @ 2.20GHz
	GCC Version: gcc (SUSE Linux) 7.3.1 20180323 [gcc-7-branch revision 258812]
	Clang Version: 5.0.1 (tags/RELEASE_501/final 312548)
	x86_64-native-linuxapp-gcc
	x86_64-native-linuxapp-clang


** Meson build **


OS: UB1804-64
	Kernel Version: 4.15.0-20-generic
	CPU info: Intel(R) Xeon(R) CPU E5-2699 v4 @ 2.20GHz
	GCC Version: gcc (Ubuntu 7.3.0-27ubuntu1~18.04) 7.3.0
	Clang Version: 6.0.0-1ubuntu2 (tags/RELEASE_600/final)
	x86_64-native-linuxapp-doc
	./build-gcc-static
	./build-gcc-shared
	./build-clang-static
	./build-clang-shared
	./build-x86-default


OS: UB1604-32
	Kernel Version: 4.4.0-131-generic
	CPU info: Intel(R) Xeon(R) CPU E5-2699 v4 @ 2.20GHz
	GCC Version: gcc (Ubuntu 5.4.0-6ubuntu1~16.04.11) 5.4.0 20160609
	Clang Version: 3.8.0-2ubuntu4 (tags/RELEASE_380/final)
	./build-gcc-static
	./build-gcc-shared
	./build-clang-static
	./build-clang-shared
	./build-x86-default


OS: CENTOS77-64
	Kernel Version: 3.10.0-1062.12.1.el7.x86_64
	CPU info: Intel(R) Xeon(R) CPU E5-2699 v4 @ 2.20GHz
	GCC Version: gcc (GCC) 4.8.5 20150623 (Red Hat 4.8.5-39)
	Clang Version: 3.4.2 (tags/RELEASE_34/dot2-final)
	./build-gcc-static
	./build-gcc-shared
	./build-clang-static
	./build-clang-shared
	./build-x86-default


OS: WIN10-64
	Kernel Version: N/A
	CPU info: N/A
	GCC Version: N/A
	Clang Version: Clang 8.0.0
	x86_64-windows-clang


OS: FC31-64
	Kernel Version: 5.4.18-200.fc31.x86_64
	CPU info: Intel(R) Xeon(R) CPU E5-2699 v4 @ 2.20GHz
	GCC Version: gcc (GCC) 9.2.1 20190827 (Red Hat 9.2.1-1)
	Clang Version: 9.0.0 (Fedora 9.0.0-1.fc31)
	./build-gcc-static
	./build-gcc-shared
	./build-clang-static
	./build-clang-shared
	./build-x86-default


OS: FreeBSD1201-64
	Kernel Version: 12.1-RELEASE
	CPU info: Intel(R) Xeon(R) CPU E5-2699 v4 @ 2.20GHz (2194.98-MHz K8-class CPU)
	GCC Version: gcc (FreeBSD Ports Collection) 9.2.0
	Clang Version: 8.0.1 (tags/RELEASE_801/final 366581) (based on LLVM 8.0.1)
	./build-gcc-static
	./build-gcc-shared
	./build-clang-static
	./build-clang-shared
	./build-x86-default


OS: SUSE15-64
	Kernel Version: 4.12.14-lp150.12.82-default
	CPU info: Intel(R) Xeon(R) CPU E5-2699 v4 @ 2.20GHz
	GCC Version: gcc (SUSE Linux) 7.4.1 20190905 [gcc-7-branch revision 275407]
	Clang Version: 5.0.1 (tags/RELEASE_501/final 312548)
	./build-gcc-static
	./build-gcc-shared
	./build-clang-static
	./build-clang-shared
	./build-x86-default


*Meson Build Failed #1:
OS: UB1604-32
Target:./build-gcc-static
[126/1972] Compiling C object 'lib/76b5a35@@rte_cryptodev@sta/librte_cryptodev_rte_cryptodev.c.o'.
[127/1972] Generating hash_def with a custom command.
[128/1972] Generating eal.exp_chk with a meson_exe.py custom command.
[129/1972] Compiling C object 'lib/76b5a35@@rte_distributor@sta/librte_distributor_rte_distributor.c.o'.
[130/1972] Linking target lib/librte_eal.so.20.0.2.
FAILED: lib/librte_eal.so.20.0.2 
clang  -o lib/librte_eal.so.20.0.2 'lib/76b5a35@@rte_eal@sta/librte_eal_common_eal_common_bus.c.o' 'lib/76b5a35@@rte_eal@sta/librte_eal_common_eal_common_cpuflags.c.o' 'lib/76b5a35@@rte_eal@sta/librte_eal_common_eal_common_class.c.o' 'lib/76b5a35@@rte_eal@sta/librte_eal_common_eal_common_devargs.c.o' 'lib/76b5a35@@rte_eal@sta/librte_eal_common_eal_common_dev.c.o' 'lib/76b5a35@@rte_eal@sta/librte_eal_common_eal_common_errno.c.o' 'lib/76b5a35@@rte_eal@sta/librte_eal_common_eal_common_fbarray.c.o' 'lib/76b5a35@@rte_eal@sta/librte_eal_common_eal_common_hexdump.c.o' 'lib/76b5a35@@rte_eal@sta/librte_eal_common_eal_common_hypervisor.c.o' 'lib/76b5a35@@rte_eal@sta/librte_eal_common_eal_common_launch.c.o' 'lib/76b5a35@@rte_eal@sta/librte_eal_common_eal_common_lcore.c.o' 'lib/76b5a35@@rte_eal@sta/librte_eal_common_eal_common_log.c.o' 'lib/76b5a35@@rte_eal@sta/librte_eal_common_eal_common_mcfg.c.o' 'lib/76b5a35@@rte_eal@sta/librte_eal_common_eal_common_memalloc.c.o' 'lib/76b5a35@@rte_eal@sta/librte_eal_common_eal_common_memory.c.o' 'lib/76b5a35@@rte_eal@sta/librte_eal_common_eal_common_memzone.c.o' 'lib/76b5a35@@rte_eal@sta/librte_eal_common_eal_common_options.c.o' 'lib/76b5a35@@rte_eal@sta/librte_eal_common_eal_common_proc.c.o' 'lib/76b5a35@@rte_eal@sta/librte_eal_common_eal_common_string_fns.c.o' 'lib/76b5a35@@rte_eal@sta/librte_eal_common_eal_common_tailqs.c.o' 'lib/76b5a35@@rte_eal@sta/librte_eal_common_eal_common_thread.c.o' 'lib/76b5a35@@rte_eal@sta/librte_eal_common_eal_common_timer.c.o' 'lib/76b5a35@@rte_eal@sta/librte_eal_common_eal_common_uuid.c.o' 'lib/76b5a35@@rte_eal@sta/librte_eal_common_hotplug_mp.c.o' 'lib/76b5a35@@rte_eal@sta/librte_eal_common_malloc_elem.c.o' 'lib/76b5a35@@rte_eal@sta/librte_eal_common_malloc_heap.c.o' 'lib/76b5a35@@rte_eal@sta/librte_eal_common_malloc_mp.c.o' 'lib/76b5a35@@rte_eal@sta/librte_eal_common_rte_keepalive.c.o' 'lib/76b5a35@@rte_eal@sta/librte_eal_common_rte_malloc.c.o' 'lib/76b5a35@@rte_eal@sta/librte_eal_common_rte_option.c.o' 'lib/76b5a35@@rte_eal@sta/librte_eal_common_rte_random.c.o' 'lib/76b5a35@@rte_eal@sta/librte_eal_common_rte_reciprocal.c.o' 'lib/76b5a35@@rte_eal@sta/librte_eal_common_rte_service.c.o' 'lib/76b5a35@@rte_eal@sta/librte_eal_common_arch_x86_rte_spinlock.c.o' 'lib/76b5a35@@rte_eal@sta/librte_eal_common_arch_x86_rte_cpuflags.c.o' 'lib/76b5a35@@rte_eal@sta/librte_eal_common_arch_x86_rte_cycles.c.o' 'lib/76b5a35@@rte_eal@sta/librte_eal_common_arch_x86_rte_hypervisor.c.o' 'lib/76b5a35@@rte_eal@sta/librte_eal_linux_eal_eal_alarm.c.o' 'lib/76b5a35@@rte_eal@sta/librte_eal_linux_eal_eal_cpuflags.c.o' 'lib/76b5a35@@rte_eal@sta/librte_eal_linux_eal_eal_debug.c.o' 'lib/76b5a35@@rte_eal@sta/librte_eal_linux_eal_eal_hugepage_info.c.o' 'lib/76b5a35@@rte_eal@sta/librte_eal_linux_eal_eal_interrupts.c.o' 'lib/76b5a35@@rte_eal@sta/librte_eal_linux_eal_eal_memalloc.c.o' 'lib/76b5a35@@rte_eal@sta/librte_eal_linux_eal_eal_lcore.c.o' 'lib/76b5a35@@rte_eal@sta/librte_eal_linux_eal_eal_log.c.o' 'lib/76b5a35@@rte_eal@sta/librte_eal_linux_eal_eal_thread.c.o' 'lib/76b5a35@@rte_eal@sta/librte_eal_linux_eal_eal_timer.c.o' 'lib/76b5a35@@rte_eal@sta/librte_eal_linux_eal_eal_vfio.c.o' 'lib/76b5a35@@rte_eal@sta/librte_eal_linux_eal_eal_vfio_mp_sync.c.o' 'lib/76b5a35@@rte_eal@sta/librte_eal_linux_eal_eal.c.o' 'lib/76b5a35@@rte_eal@sta/librte_eal_linux_eal_eal_memory.c.o' 'lib/76b5a35@@rte_eal@sta/librte_eal_linux_eal_eal_dev.c.o' -Wl,--no-undefined -Wl,--as-needed -shared -fPIC -Wl,--start-group -Wl,-soname,librte_eal.so.20.0 -Wl,--no-as-needed -pthread -lm -ldl -lnuma lib/librte_kvargs.so.20.0.2 -Wl,--end-group -Wl,--version-script=/root/UB1604-32_K4.4.0_GCC5.4.0/i686-native-linuxapp-gcc/3bc952ca1d5440afb00a4785b5438b30/dpdk/lib/librte_eal/rte_eal_version.map '-Wl,-rpath,$ORIGIN/' -Wl,-rpath-link,/root/UB1604-32_K4.4.0_GCC5.4.0/i686-native-linuxapp-gcc/3bc952ca1d5440afb00a4785b5438b30/dpdk/build-clang-static/lib 
lib/76b5a35@@rte_eal@sta/librte_eal_common_rte_service.c.o: In function `service_update':
/root/UB1604-32_K4.4.0_GCC5.4.0/i686-native-linuxapp-gcc/3bc952ca1d5440afb00a4785b5438b30/dpdk/build-clang-static/../lib/librte_eal/common/rte_service.c:575: undefined reference to `__atomic_load_8'
/root/UB1604-32_K4.4.0_GCC5.4.0/i686-native-linuxapp-gcc/3bc952ca1d5440afb00a4785b5438b30/dpdk/build-clang-static/../lib/librte_eal/common/rte_service.c:575: undefined reference to `__atomic_load_8'
clang: error: linker command failed with exit code 1 (use -v to see invocation)
[131/1972] Generating timer_def with a custom command.
[132/1972] Compiling C object 'lib/76b5a35@@rte_timer@sta/librte_timer_rte_timer.c.o'.
[133/1972] Generating ethdev.exp_chk with a meson_exe.py custom command.
[134/1972] Compiling C object 'lib/76b5a35@@rte_acl@sta/librte_acl_acl_bld.c.o'.
[135/1972] Compiling C object 'lib/76b5a35@@rte_hash@sta/librte_hash_rte_cuckoo_hash.c.o'.
ninja: build stopped: subcommand failed.
meson  --werror -Dexamples=all --buildtype=debugoptimized --default-library=shared /root/UB1604-32_K4.4.0_GCC5.4.0/i686-native-linuxapp-gcc/3bc952ca1d5440afb00a4785b5438b30/dpdk/devtools/.. ./build-clang-shared
The Meson build system
Version: 0.50.1
Source dir: /root/UB1604-32_K4.4.0_GCC5.4.0/i686-native-linuxapp-gcc/3bc952ca1d5440afb00a4785b5438b30/dpdk
Build dir: /root/UB1604-32_K4.4.0_GCC5.4.0/i686-native-linuxapp-gcc/3bc952ca1d5440afb00a4785b5438b30/dpdk/build-clang-shared
--
[129/2000] Generating eal.exp_chk with a meson_exe.py custom command.
[130/2000] Linking static target lib/librte_timer.a.
[131/2000] Compiling C object 'lib/76b5a35@@rte_distributor@sta/librte_distributor_rte_distributor.c.o'.
[132/2000] Generating timer_def with a custom command.
[133/2000] Linking target lib/librte_eal.so.20.0.2.
FAILED: lib/librte_eal.so.20.0.2 
clang  -o lib/librte_eal.so.20.0.2 'lib/76b5a35@@rte_eal@sta/librte_eal_common_eal_common_bus.c.o' 'lib/76b5a35@@rte_eal@sta/librte_eal_common_eal_common_cpuflags.c.o' 'lib/76b5a35@@rte_eal@sta/librte_eal_common_eal_common_class.c.o' 'lib/76b5a35@@rte_eal@sta/librte_eal_common_eal_common_devargs.c.o' 'lib/76b5a35@@rte_eal@sta/librte_eal_common_eal_common_dev.c.o' 'lib/76b5a35@@rte_eal@sta/librte_eal_common_eal_common_errno.c.o' 'lib/76b5a35@@rte_eal@sta/librte_eal_common_eal_common_fbarray.c.o' 'lib/76b5a35@@rte_eal@sta/librte_eal_common_eal_common_hexdump.c.o' 'lib/76b5a35@@rte_eal@sta/librte_eal_common_eal_common_hypervisor.c.o' 'lib/76b5a35@@rte_eal@sta/librte_eal_common_eal_common_launch.c.o' 'lib/76b5a35@@rte_eal@sta/librte_eal_common_eal_common_lcore.c.o' 'lib/76b5a35@@rte_eal@sta/librte_eal_common_eal_common_log.c.o' 'lib/76b5a35@@rte_eal@sta/librte_eal_common_eal_common_mcfg.c.o' 'lib/76b5a35@@rte_eal@sta/librte_eal_common_eal_common_memalloc.c.o' 'lib/76b5a35@@rte_eal@sta/librte_eal_common_eal_common_memory.c.o' 'lib/76b5a35@@rte_eal@sta/librte_eal_common_eal_common_memzone.c.o' 'lib/76b5a35@@rte_eal@sta/librte_eal_common_eal_common_options.c.o' 'lib/76b5a35@@rte_eal@sta/librte_eal_common_eal_common_proc.c.o' 'lib/76b5a35@@rte_eal@sta/librte_eal_common_eal_common_string_fns.c.o' 'lib/76b5a35@@rte_eal@sta/librte_eal_common_eal_common_tailqs.c.o' 'lib/76b5a35@@rte_eal@sta/librte_eal_common_eal_common_thread.c.o' 'lib/76b5a35@@rte_eal@sta/librte_eal_common_eal_common_timer.c.o' 'lib/76b5a35@@rte_eal@sta/librte_eal_common_eal_common_uuid.c.o' 'lib/76b5a35@@rte_eal@sta/librte_eal_common_hotplug_mp.c.o' 'lib/76b5a35@@rte_eal@sta/librte_eal_common_malloc_elem.c.o' 'lib/76b5a35@@rte_eal@sta/librte_eal_common_malloc_heap.c.o' 'lib/76b5a35@@rte_eal@sta/librte_eal_common_malloc_mp.c.o' 'lib/76b5a35@@rte_eal@sta/librte_eal_common_rte_keepalive.c.o' 'lib/76b5a35@@rte_eal@sta/librte_eal_common_rte_malloc.c.o' 'lib/76b5a35@@rte_eal@sta/librte_eal_common_rte_option.c.o' 'lib/76b5a35@@rte_eal@sta/librte_eal_common_rte_random.c.o' 'lib/76b5a35@@rte_eal@sta/librte_eal_common_rte_reciprocal.c.o' 'lib/76b5a35@@rte_eal@sta/librte_eal_common_rte_service.c.o' 'lib/76b5a35@@rte_eal@sta/librte_eal_common_arch_x86_rte_spinlock.c.o' 'lib/76b5a35@@rte_eal@sta/librte_eal_common_arch_x86_rte_cpuflags.c.o' 'lib/76b5a35@@rte_eal@sta/librte_eal_common_arch_x86_rte_cycles.c.o' 'lib/76b5a35@@rte_eal@sta/librte_eal_common_arch_x86_rte_hypervisor.c.o' 'lib/76b5a35@@rte_eal@sta/librte_eal_linux_eal_eal_alarm.c.o' 'lib/76b5a35@@rte_eal@sta/librte_eal_linux_eal_eal_cpuflags.c.o' 'lib/76b5a35@@rte_eal@sta/librte_eal_linux_eal_eal_debug.c.o' 'lib/76b5a35@@rte_eal@sta/librte_eal_linux_eal_eal_hugepage_info.c.o' 'lib/76b5a35@@rte_eal@sta/librte_eal_linux_eal_eal_interrupts.c.o' 'lib/76b5a35@@rte_eal@sta/librte_eal_linux_eal_eal_memalloc.c.o' 'lib/76b5a35@@rte_eal@sta/librte_eal_linux_eal_eal_lcore.c.o' 'lib/76b5a35@@rte_eal@sta/librte_eal_linux_eal_eal_log.c.o' 'lib/76b5a35@@rte_eal@sta/librte_eal_linux_eal_eal_thread.c.o' 'lib/76b5a35@@rte_eal@sta/librte_eal_linux_eal_eal_timer.c.o' 'lib/76b5a35@@rte_eal@sta/librte_eal_linux_eal_eal_vfio.c.o' 'lib/76b5a35@@rte_eal@sta/librte_eal_linux_eal_eal_vfio_mp_sync.c.o' 'lib/76b5a35@@rte_eal@sta/librte_eal_linux_eal_eal.c.o' 'lib/76b5a35@@rte_eal@sta/librte_eal_linux_eal_eal_memory.c.o' 'lib/76b5a35@@rte_eal@sta/librte_eal_linux_eal_eal_dev.c.o' -Wl,--no-undefined -Wl,--as-needed -shared -fPIC -Wl,--start-group -Wl,-soname,librte_eal.so.20.0 -Wl,--no-as-needed -pthread -lm -ldl -lnuma lib/librte_kvargs.so.20.0.2 -Wl,--end-group -Wl,--version-script=/root/UB1604-32_K4.4.0_GCC5.4.0/i686-native-linuxapp-gcc/3bc952ca1d5440afb00a4785b5438b30/dpdk/lib/librte_eal/rte_eal_version.map '-Wl,-rpath,$ORIGIN/' -Wl,-rpath-link,/root/UB1604-32_K4.4.0_GCC5.4.0/i686-native-linuxapp-gcc/3bc952ca1d5440afb00a4785b5438b30/dpdk/build-clang-shared/lib 
lib/76b5a35@@rte_eal@sta/librte_eal_common_rte_service.c.o: In function `service_update':
/root/UB1604-32_K4.4.0_GCC5.4.0/i686-native-linuxapp-gcc/3bc952ca1d5440afb00a4785b5438b30/dpdk/build-clang-shared/../lib/librte_eal/common/rte_service.c:575: undefined reference to `__atomic_load_8'
/root/UB1604-32_K4.4.0_GCC5.4.0/i686-native-linuxapp-gcc/3bc952ca1d5440afb00a4785b5438b30/dpdk/build-clang-shared/../lib/librte_eal/common/rte_service.c:575: undefined reference to `__atomic_load_8'
clang: error: linker command failed with exit code 1 (use -v to see invocation)
[134/2000] Generating timer.exp_chk with a meson_exe.py custom command.
[135/2000] Compiling C object 'lib/76b5a35@@rte_acl@sta/librte_acl_acl_gen.c.o'.
[136/2000] Generating ethdev.exp_chk with a meson_exe.py custom command.
[137/2000] Compiling C object 'lib/76b5a35@@rte_acl@sta/librte_acl_acl_bld.c.o'.
[138/2000] Compiling C object 'lib/76b5a35@@rte_hash@sta/librte_hash_rte_cuckoo_hash.c.o'.
ninja: build stopped: subcommand failed.
meson  --werror -Dexamples=all --buildtype=debugoptimized -Dlibdir=lib -Dmachine=nehalem --default-library=shared /root/UB1604-32_K4.4.0_GCC5.4.0/i686-native-linuxapp-gcc/3bc952ca1d5440afb00a4785b5438b30/dpdk/devtools/.. ./build-x86-default
The Meson build system
Version: 0.50.1
Source dir: /root/UB1604-32_K4.4.0_GCC5.4.0/i686-native-linuxapp-gcc/3bc952ca1d5440afb00a4785b5438b30/dpdk
Build dir: /root/UB1604-32_K4.4.0_GCC5.4.0/i686-native-linuxapp-gcc/3bc952ca1d5440afb00a4785b5438b30/dpdk/build-x86-default


*Meson Build Failed #2:
OS: FC31-64
Target:./build-gcc-static
[345/2247] Generating symbol file 'lib/76b5a35@@rte_sched@sha/librte_sched.so.20.0.2.symbols'.
[346/2247] Generating vhost_def with a custom command.
[347/2247] Compiling C object 'lib/76b5a35@@rte_vhost@sta/librte_vhost_socket.c.o'.
[348/2247] Generating symbol file 'lib/76b5a35@@rte_rib@sha/librte_rib.so.0.200.2.symbols'.
[349/2247] Compiling C object 'lib/76b5a35@@rte_vhost@sta/librte_vhost_virtio_net.c.o'.
FAILED: lib/76b5a35@@rte_vhost@sta/librte_vhost_virtio_net.c.o 
clang -Ilib/76b5a35@@rte_vhost@sta -Ilib -I../lib -Ilib/librte_vhost -I../lib/librte_vhost -I. -I../ -Iconfig -I../config -Ilib/librte_eal/common/include -I../lib/librte_eal/common/include -I../lib/librte_eal/linux/eal/include -Ilib/librte_eal/common -I../lib/librte_eal/common -Ilib/librte_eal/common/include/arch/x86 -I../lib/librte_eal/common/include/arch/x86 -Ilib/librte_eal -I../lib/librte_eal -Ilib/librte_kvargs -I../lib/librte_kvargs -Ilib/librte_ethdev -I../lib/librte_ethdev -Ilib/librte_net -I../lib/librte_net -Ilib/librte_mbuf -I../lib/librte_mbuf -Ilib/librte_mempool -I../lib/librte_mempool -Ilib/librte_ring -I../lib/librte_ring -Ilib/librte_meter -I../lib/librte_meter -Ilib/librte_cryptodev -I../lib/librte_cryptodev -Ilib/librte_hash -I../lib/librte_hash -Ilib/librte_pci -I../lib/librte_pci -Xclang -fcolor-diagnostics -pipe -D_FILE_OFFSET_BITS=64 -Wall -Winvalid-pch -Werror -O2 -g -include rte_config.h -Wextra -Wcast-qual -Wdeprecated -Wformat-nonliteral -Wformat-security -Wmissing-declarations -Wmissing-prototypes -Wnested-externs -Wold-style-definition -Wpointer-arith -Wsign-compare -Wstrict-prototypes -Wundef -Wwrite-strings -Wno-address-of-packed-member -Wno-missing-field-initializers -D_GNU_SOURCE -fPIC -march=native -DVHOST_CLANG_UNROLL_PRAGMA -fno-strict-aliasing -DALLOW_EXPERIMENTAL_API -MD -MQ 'lib/76b5a35@@rte_vhost@sta/librte_vhost_virtio_net.c.o' -MF 'lib/76b5a35@@rte_vhost@sta/librte_vhost_virtio_net.c.o.d' -o 'lib/76b5a35@@rte_vhost@sta/librte_vhost_virtio_net.c.o' -c ../lib/librte_vhost/virtio_net.c
../lib/librte_vhost/virtio_net.c:2263:4: error: incompatible pointer types passing 'int *' to parameter of type 'int16_t *' (aka 'short *') [-Werror,-Wincompatible-pointer-types]
                        &success, 0, 0, __ATOMIC_RELEASE, __ATOMIC_RELAXED))) {
                        ^~~~~~~~
../lib/librte_eal/common/include/rte_branch_prediction.h:38:41: note: expanded from macro 'unlikely'
--
[352/2247] Compiling C object 'lib/76b5a35@@rte_vhost@sta/librte_vhost_vhost_user.c.o'.
[353/2247] Compiling C object 'lib/76b5a35@@rte_ipsec@sta/librte_ipsec_sa.c.o'.
[354/2247] Compiling C object 'lib/76b5a35@@rte_ipsec@sta/librte_ipsec_esp_outb.c.o'.
[355/2247] Compiling C object 'lib/76b5a35@@rte_ipsec@sta/librte_ipsec_esp_inb.c.o'.
[356/2247] Compiling C object 'lib/76b5a35@@rte_vhost@sta/librte_vhost_vhost_crypto.c.o'.
ninja: build stopped: subcommand failed.
meson  --werror -Dexamples=all --buildtype=debugoptimized --default-library=shared /root/FC31-64_K5.3.14_GCC9.2.1/x86_64-native-linuxapp-gcc/3bc952ca1d5440afb00a4785b5438b30/dpdk/devtools/.. ./build-clang-shared
The Meson build system
Version: 0.52.1
Source dir: /root/FC31-64_K5.3.14_GCC9.2.1/x86_64-native-linuxapp-gcc/3bc952ca1d5440afb00a4785b5438b30/dpdk
Build dir: /root/FC31-64_K5.3.14_GCC9.2.1/x86_64-native-linuxapp-gcc/3bc952ca1d5440afb00a4785b5438b30/dpdk/build-clang-shared
--
[358/2275] Generating vhost_def with a custom command.
[359/2275] Compiling C object 'lib/76b5a35@@rte_vhost@sta/librte_vhost_socket.c.o'.
[360/2275] Generating symbol file 'lib/76b5a35@@rte_sched@sha/librte_sched.so.20.0.2.symbols'.
[361/2275] Generating symbol file 'lib/76b5a35@@rte_security@sha/librte_security.so.20.0.2.symbols'.
[362/2275] Compiling C object 'lib/76b5a35@@rte_vhost@sta/librte_vhost_virtio_net.c.o'.
FAILED: lib/76b5a35@@rte_vhost@sta/librte_vhost_virtio_net.c.o 
clang -Ilib/76b5a35@@rte_vhost@sta -Ilib -I../lib -Ilib/librte_vhost -I../lib/librte_vhost -I. -I../ -Iconfig -I../config -Ilib/librte_eal/common/include -I../lib/librte_eal/common/include -I../lib/librte_eal/linux/eal/include -Ilib/librte_eal/common -I../lib/librte_eal/common -Ilib/librte_eal/common/include/arch/x86 -I../lib/librte_eal/common/include/arch/x86 -Ilib/librte_eal -I../lib/librte_eal -Ilib/librte_kvargs -I../lib/librte_kvargs -Ilib/librte_ethdev -I../lib/librte_ethdev -Ilib/librte_net -I../lib/librte_net -Ilib/librte_mbuf -I../lib/librte_mbuf -Ilib/librte_mempool -I../lib/librte_mempool -Ilib/librte_ring -I../lib/librte_ring -Ilib/librte_meter -I../lib/librte_meter -Ilib/librte_cryptodev -I../lib/librte_cryptodev -Ilib/librte_hash -I../lib/librte_hash -Ilib/librte_pci -I../lib/librte_pci -Xclang -fcolor-diagnostics -pipe -D_FILE_OFFSET_BITS=64 -Wall -Winvalid-pch -Werror -O2 -g -include rte_config.h -Wextra -Wcast-qual -Wdeprecated -Wformat-nonliteral -Wformat-security -Wmissing-declarations -Wmissing-prototypes -Wnested-externs -Wold-style-definition -Wpointer-arith -Wsign-compare -Wstrict-prototypes -Wundef -Wwrite-strings -Wno-address-of-packed-member -Wno-missing-field-initializers -D_GNU_SOURCE -fPIC -march=native -DVHOST_CLANG_UNROLL_PRAGMA -fno-strict-aliasing -DALLOW_EXPERIMENTAL_API -MD -MQ 'lib/76b5a35@@rte_vhost@sta/librte_vhost_virtio_net.c.o' -MF 'lib/76b5a35@@rte_vhost@sta/librte_vhost_virtio_net.c.o.d' -o 'lib/76b5a35@@rte_vhost@sta/librte_vhost_virtio_net.c.o' -c ../lib/librte_vhost/virtio_net.c
../lib/librte_vhost/virtio_net.c:2263:4: error: incompatible pointer types passing 'int *' to parameter of type 'int16_t *' (aka 'short *') [-Werror,-Wincompatible-pointer-types]
                        &success, 0, 0, __ATOMIC_RELEASE, __ATOMIC_RELAXED))) {
                        ^~~~~~~~
../lib/librte_eal/common/include/rte_branch_prediction.h:38:41: note: expanded from macro 'unlikely'
--
[365/2275] Compiling C object 'lib/76b5a35@@rte_ipsec@sta/librte_ipsec_sa.c.o'.
[366/2275] Compiling C object 'lib/76b5a35@@rte_vhost@sta/librte_vhost_vhost_user.c.o'.
[367/2275] Compiling C object 'lib/76b5a35@@rte_ipsec@sta/librte_ipsec_esp_outb.c.o'.
[368/2275] Compiling C object 'lib/76b5a35@@rte_ipsec@sta/librte_ipsec_esp_inb.c.o'.
[369/2275] Compiling C object 'lib/76b5a35@@rte_vhost@sta/librte_vhost_vhost_crypto.c.o'.
ninja: build stopped: subcommand failed.
meson  --werror -Dexamples=all --buildtype=debugoptimized -Dlibdir=lib -Dmachine=nehalem --default-library=shared /root/FC31-64_K5.3.14_GCC9.2.1/x86_64-native-linuxapp-gcc/3bc952ca1d5440afb00a4785b5438b30/dpdk/devtools/.. ./build-x86-default
The Meson build system
Version: 0.52.1
Source dir: /root/FC31-64_K5.3.14_GCC9.2.1/x86_64-native-linuxapp-gcc/3bc952ca1d5440afb00a4785b5438b30/dpdk
Build dir: /root/FC31-64_K5.3.14_GCC9.2.1/x86_64-native-linuxapp-gcc/3bc952ca1d5440afb00a4785b5438b30/dpdk/build-x86-default


*Meson Build Failed #3:
OS: CENTOS77-64
Target:./build-gcc-static
[345/2243] Compiling C object 'lib/76b5a35@@rte_vhost@sta/librte_vhost_vdpa.c.o'.
[346/2243] Linking target lib/librte_security.so.20.0.2.
[347/2243] Linking target lib/librte_rib.so.0.200.2.
[348/2243] Generating symbol file 'lib/76b5a35@@rte_stack@sha/librte_stack.so.0.200.2.symbols'.
[349/2243] Compiling C object 'lib/76b5a35@@rte_vhost@sta/librte_vhost_virtio_net.c.o'.
FAILED: lib/76b5a35@@rte_vhost@sta/librte_vhost_virtio_net.c.o 
clang -Ilib/76b5a35@@rte_vhost@sta -Ilib -I../lib -Ilib/librte_vhost -I../lib/librte_vhost -I. -I../ -Iconfig -I../config -Ilib/librte_eal/common/include -I../lib/librte_eal/common/include -I../lib/librte_eal/linux/eal/include -Ilib/librte_eal/common -I../lib/librte_eal/common -Ilib/librte_eal/common/include/arch/x86 -I../lib/librte_eal/common/include/arch/x86 -Ilib/librte_eal -I../lib/librte_eal -Ilib/librte_kvargs -I../lib/librte_kvargs -Ilib/librte_ethdev -I../lib/librte_ethdev -Ilib/librte_net -I../lib/librte_net -Ilib/librte_mbuf -I../lib/librte_mbuf -Ilib/librte_mempool -I../lib/librte_mempool -Ilib/librte_ring -I../lib/librte_ring -Ilib/librte_meter -I../lib/librte_meter -Ilib/librte_cryptodev -I../lib/librte_cryptodev -Ilib/librte_hash -I../lib/librte_hash -Ilib/librte_pci -I../lib/librte_pci -Xclang -fcolor-diagnostics -pipe -D_FILE_OFFSET_BITS=64 -Wall -Winvalid-pch -Werror -O2 -g -include rte_config.h -Wextra -Wcast-qual -Wdeprecated -Wformat-nonliteral -Wformat-security -Wmissing-declarations -Wmissing-prototypes -Wnested-externs -Wold-style-definition -Wpointer-arith -Wsign-compare -Wstrict-prototypes -Wundef -Wwrite-strings -Wno-missing-field-initializers -D_GNU_SOURCE -fPIC -march=native -msse4 -fno-strict-aliasing -DALLOW_EXPERIMENTAL_API -MD -MQ 'lib/76b5a35@@rte_vhost@sta/librte_vhost_virtio_net.c.o' -MF 'lib/76b5a35@@rte_vhost@sta/librte_vhost_virtio_net.c.o.d' -o 'lib/76b5a35@@rte_vhost@sta/librte_vhost_virtio_net.c.o' -c ../lib/librte_vhost/virtio_net.c
../lib/librte_vhost/virtio_net.c:2263:4: error: incompatible pointer types passing 'int *' to parameter of type 'int16_t *' (aka 'short *') [-Werror,-Wincompatible-pointer-types]
                        &success, 0, 0, __ATOMIC_RELEASE, __ATOMIC_RELAXED))) {
                        ^~~~~~~~
../lib/librte_eal/common/include/rte_branch_prediction.h:38:41: note: expanded from macro 'unlikely'
--
[350/2243] Generating symbol file 'lib/76b5a35@@rte_sched@sha/librte_sched.so.20.0.2.symbols'.
[351/2243] Generating symbol file 'lib/76b5a35@@rte_security@sha/librte_security.so.20.0.2.symbols'.
[352/2243] Compiling C object 'lib/76b5a35@@rte_vhost@sta/librte_vhost_vhost_user.c.o'.
[353/2243] Generating symbol file 'lib/76b5a35@@rte_rib@sha/librte_rib.so.0.200.2.symbols'.
[354/2243] Compiling C object 'lib/76b5a35@@rte_vhost@sta/librte_vhost_vhost.c.o'.
ninja: build stopped: subcommand failed.
meson  --werror -Dexamples=all --buildtype=debugoptimized --default-library=shared /root/CENTOS77-64_K3.10.0_GCC4.8.5/x86_64-native-linuxapp-gcc/3bc952ca1d5440afb00a4785b5438b30/dpdk/devtools/.. ./build-clang-shared
The Meson build system
Version: 0.53.1
Source dir: /root/CENTOS77-64_K3.10.0_GCC4.8.5/x86_64-native-linuxapp-gcc/3bc952ca1d5440afb00a4785b5438b30/dpdk
Build dir: /root/CENTOS77-64_K3.10.0_GCC4.8.5/x86_64-native-linuxapp-gcc/3bc952ca1d5440afb00a4785b5438b30/dpdk/build-clang-shared
--
[358/2271] Generating symbol file 'lib/76b5a35@@rte_security@sha/librte_security.so.20.0.2.symbols'.
[359/2271] Generating rib.exp_chk with a meson_exe.py custom command.
[360/2271] Generating symbol file 'lib/76b5a35@@rte_stack@sha/librte_stack.so.0.200.2.symbols'.
[361/2271] Linking target lib/librte_rib.so.0.200.2.
[362/2271] Compiling C object 'lib/76b5a35@@rte_vhost@sta/librte_vhost_virtio_net.c.o'.
FAILED: lib/76b5a35@@rte_vhost@sta/librte_vhost_virtio_net.c.o 
clang -Ilib/76b5a35@@rte_vhost@sta -Ilib -I../lib -Ilib/librte_vhost -I../lib/librte_vhost -I. -I../ -Iconfig -I../config -Ilib/librte_eal/common/include -I../lib/librte_eal/common/include -I../lib/librte_eal/linux/eal/include -Ilib/librte_eal/common -I../lib/librte_eal/common -Ilib/librte_eal/common/include/arch/x86 -I../lib/librte_eal/common/include/arch/x86 -Ilib/librte_eal -I../lib/librte_eal -Ilib/librte_kvargs -I../lib/librte_kvargs -Ilib/librte_ethdev -I../lib/librte_ethdev -Ilib/librte_net -I../lib/librte_net -Ilib/librte_mbuf -I../lib/librte_mbuf -Ilib/librte_mempool -I../lib/librte_mempool -Ilib/librte_ring -I../lib/librte_ring -Ilib/librte_meter -I../lib/librte_meter -Ilib/librte_cryptodev -I../lib/librte_cryptodev -Ilib/librte_hash -I../lib/librte_hash -Ilib/librte_pci -I../lib/librte_pci -Xclang -fcolor-diagnostics -pipe -D_FILE_OFFSET_BITS=64 -Wall -Winvalid-pch -Werror -O2 -g -include rte_config.h -Wextra -Wcast-qual -Wdeprecated -Wformat-nonliteral -Wformat-security -Wmissing-declarations -Wmissing-prototypes -Wnested-externs -Wold-style-definition -Wpointer-arith -Wsign-compare -Wstrict-prototypes -Wundef -Wwrite-strings -Wno-missing-field-initializers -D_GNU_SOURCE -fPIC -march=native -msse4 -fno-strict-aliasing -DALLOW_EXPERIMENTAL_API -MD -MQ 'lib/76b5a35@@rte_vhost@sta/librte_vhost_virtio_net.c.o' -MF 'lib/76b5a35@@rte_vhost@sta/librte_vhost_virtio_net.c.o.d' -o 'lib/76b5a35@@rte_vhost@sta/librte_vhost_virtio_net.c.o' -c ../lib/librte_vhost/virtio_net.c
../lib/librte_vhost/virtio_net.c:2263:4: error: incompatible pointer types passing 'int *' to parameter of type 'int16_t *' (aka 'short *') [-Werror,-Wincompatible-pointer-types]
                        &success, 0, 0, __ATOMIC_RELEASE, __ATOMIC_RELAXED))) {
                        ^~~~~~~~
../lib/librte_eal/common/include/rte_branch_prediction.h:38:41: note: expanded from macro 'unlikely'
--
[363/2271] Compiling C object 'lib/76b5a35@@rte_vhost@sta/librte_vhost_vhost.c.o'.
[364/2271] Compiling C object 'lib/76b5a35@@rte_vhost@sta/librte_vhost_vhost_user.c.o'.
[365/2271] Generating symbol file 'lib/76b5a35@@rte_sched@sha/librte_sched.so.20.0.2.symbols'.
[366/2271] Generating symbol file 'lib/76b5a35@@rte_rib@sha/librte_rib.so.0.200.2.symbols'.
[367/2271] Compiling C object 'lib/76b5a35@@rte_vhost@sta/librte_vhost_vhost_crypto.c.o'.
ninja: build stopped: subcommand failed.
meson  --werror -Dexamples=all --buildtype=debugoptimized -Dlibdir=lib -Dmachine=corei7 --default-library=shared /root/CENTOS77-64_K3.10.0_GCC4.8.5/x86_64-native-linuxapp-gcc/3bc952ca1d5440afb00a4785b5438b30/dpdk/devtools/.. ./build-x86-default
The Meson build system
Version: 0.53.1
Source dir: /root/CENTOS77-64_K3.10.0_GCC4.8.5/x86_64-native-linuxapp-gcc/3bc952ca1d5440afb00a4785b5438b30/dpdk
Build dir: /root/CENTOS77-64_K3.10.0_GCC4.8.5/x86_64-native-linuxapp-gcc/3bc952ca1d5440afb00a4785b5438b30/dpdk/build-x86-default


*Meson Build Failed #4:
OS: UB1804-64
Target:./build-gcc-static
[342/2160] Generating sched.exp_chk with a meson_exe.py custom command.
[343/2160] Generating symbol file 'lib/76b5a35@@rte_rib@sha/librte_rib.so.0.200.2.symbols'.
[344/2160] Linking target lib/librte_sched.so.20.0.2.
[345/2160] Compiling C object 'lib/76b5a35@@rte_vhost@sta/librte_vhost_socket.c.o'.
[346/2160] Compiling C object 'lib/76b5a35@@rte_vhost@sta/librte_vhost_virtio_net.c.o'.
FAILED: lib/76b5a35@@rte_vhost@sta/librte_vhost_virtio_net.c.o 
clang -Ilib/76b5a35@@rte_vhost@sta -Ilib -I../lib -Ilib/librte_vhost -I../lib/librte_vhost -I. -I../ -Iconfig -I../config -Ilib/librte_eal/common/include -I../lib/librte_eal/common/include -I../lib/librte_eal/linux/eal/include -Ilib/librte_eal/common -I../lib/librte_eal/common -Ilib/librte_eal/common/include/arch/x86 -I../lib/librte_eal/common/include/arch/x86 -Ilib/librte_eal -I../lib/librte_eal -Ilib/librte_kvargs -I../lib/librte_kvargs -Ilib/librte_ethdev -I../lib/librte_ethdev -Ilib/librte_net -I../lib/librte_net -Ilib/librte_mbuf -I../lib/librte_mbuf -Ilib/librte_mempool -I../lib/librte_mempool -Ilib/librte_ring -I../lib/librte_ring -Ilib/librte_meter -I../lib/librte_meter -Ilib/librte_cryptodev -I../lib/librte_cryptodev -Ilib/librte_hash -I../lib/librte_hash -Ilib/librte_pci -I../lib/librte_pci -Xclang -fcolor-diagnostics -pipe -D_FILE_OFFSET_BITS=64 -Wall -Winvalid-pch -Werror -O2 -g -include rte_config.h -Wextra -Wcast-qual -Wdeprecated -Wformat-nonliteral -Wformat-security -Wmissing-declarations -Wmissing-prototypes -Wnested-externs -Wold-style-definition -Wpointer-arith -Wsign-compare -Wstrict-prototypes -Wundef -Wwrite-strings -Wno-address-of-packed-member -Wno-missing-field-initializers -D_GNU_SOURCE -fPIC -march=native -mno-avx512f -DVHOST_CLANG_UNROLL_PRAGMA -fno-strict-aliasing -DALLOW_EXPERIMENTAL_API -MD -MQ 'lib/76b5a35@@rte_vhost@sta/librte_vhost_virtio_net.c.o' -MF 'lib/76b5a35@@rte_vhost@sta/librte_vhost_virtio_net.c.o.d' -o 'lib/76b5a35@@rte_vhost@sta/librte_vhost_virtio_net.c.o' -c ../lib/librte_vhost/virtio_net.c
../lib/librte_vhost/virtio_net.c:2263:4: error: incompatible pointer types passing 'int *' to parameter of type 'int16_t *' (aka 'short *') [-Werror,-Wincompatible-pointer-types]
                        &success, 0, 0, __ATOMIC_RELEASE, __ATOMIC_RELAXED))) {
                        ^~~~~~~~
../lib/librte_eal/common/include/rte_branch_prediction.h:38:41: note: expanded from macro 'unlikely'
--
[347/2160] Generating vhost_def with a custom command.
[348/2160] Generating symbol file 'lib/76b5a35@@rte_sched@sha/librte_sched.so.20.0.2.symbols'.
[349/2160] Compiling C object 'lib/76b5a35@@rte_vhost@sta/librte_vhost_vhost.c.o'.
[350/2160] Compiling C object 'lib/76b5a35@@rte_vhost@sta/librte_vhost_vhost_user.c.o'.
[351/2160] Compiling C object 'lib/76b5a35@@rte_vhost@sta/librte_vhost_vhost_crypto.c.o'.
ninja: build stopped: subcommand failed.
meson  --werror -Dexamples=all --buildtype=debugoptimized --default-library=shared /root/UB1804-64_K4.15.0_GCC7.3.0/x86_64-native-linuxapp-gcc/3bc952ca1d5440afb00a4785b5438b30/dpdk/devtools/.. ./build-clang-shared
The Meson build system
Version: 0.50.0
Source dir: /root/UB1804-64_K4.15.0_GCC7.3.0/x86_64-native-linuxapp-gcc/3bc952ca1d5440afb00a4785b5438b30/dpdk
Build dir: /root/UB1804-64_K4.15.0_GCC7.3.0/x86_64-native-linuxapp-gcc/3bc952ca1d5440afb00a4785b5438b30/dpdk/build-clang-shared
--
[355/2188] Generating symbol file 'lib/76b5a35@@rte_security@sha/librte_security.so.20.0.2.symbols'.
[356/2188] Linking target lib/librte_sched.so.20.0.2.
[357/2188] Generating symbol file 'lib/76b5a35@@rte_rib@sha/librte_rib.so.0.200.2.symbols'.
[358/2188] Generating vhost_def with a custom command.
[359/2188] Compiling C object 'lib/76b5a35@@rte_vhost@sta/librte_vhost_virtio_net.c.o'.
FAILED: lib/76b5a35@@rte_vhost@sta/librte_vhost_virtio_net.c.o 
clang -Ilib/76b5a35@@rte_vhost@sta -Ilib -I../lib -Ilib/librte_vhost -I../lib/librte_vhost -I. -I../ -Iconfig -I../config -Ilib/librte_eal/common/include -I../lib/librte_eal/common/include -I../lib/librte_eal/linux/eal/include -Ilib/librte_eal/common -I../lib/librte_eal/common -Ilib/librte_eal/common/include/arch/x86 -I../lib/librte_eal/common/include/arch/x86 -Ilib/librte_eal -I../lib/librte_eal -Ilib/librte_kvargs -I../lib/librte_kvargs -Ilib/librte_ethdev -I../lib/librte_ethdev -Ilib/librte_net -I../lib/librte_net -Ilib/librte_mbuf -I../lib/librte_mbuf -Ilib/librte_mempool -I../lib/librte_mempool -Ilib/librte_ring -I../lib/librte_ring -Ilib/librte_meter -I../lib/librte_meter -Ilib/librte_cryptodev -I../lib/librte_cryptodev -Ilib/librte_hash -I../lib/librte_hash -Ilib/librte_pci -I../lib/librte_pci -Xclang -fcolor-diagnostics -pipe -D_FILE_OFFSET_BITS=64 -Wall -Winvalid-pch -Werror -O2 -g -include rte_config.h -Wextra -Wcast-qual -Wdeprecated -Wformat-nonliteral -Wformat-security -Wmissing-declarations -Wmissing-prototypes -Wnested-externs -Wold-style-definition -Wpointer-arith -Wsign-compare -Wstrict-prototypes -Wundef -Wwrite-strings -Wno-address-of-packed-member -Wno-missing-field-initializers -D_GNU_SOURCE -fPIC -march=native -mno-avx512f -DVHOST_CLANG_UNROLL_PRAGMA -fno-strict-aliasing -DALLOW_EXPERIMENTAL_API -MD -MQ 'lib/76b5a35@@rte_vhost@sta/librte_vhost_virtio_net.c.o' -MF 'lib/76b5a35@@rte_vhost@sta/librte_vhost_virtio_net.c.o.d' -o 'lib/76b5a35@@rte_vhost@sta/librte_vhost_virtio_net.c.o' -c ../lib/librte_vhost/virtio_net.c
../lib/librte_vhost/virtio_net.c:2263:4: error: incompatible pointer types passing 'int *' to parameter of type 'int16_t *' (aka 'short *') [-Werror,-Wincompatible-pointer-types]
                        &success, 0, 0, __ATOMIC_RELEASE, __ATOMIC_RELAXED))) {
                        ^~~~~~~~
../lib/librte_eal/common/include/rte_branch_prediction.h:38:41: note: expanded from macro 'unlikely'
--
[360/2188] Generating symbol file 'lib/76b5a35@@rte_sched@sha/librte_sched.so.20.0.2.symbols'.
[361/2188] Compiling C object 'lib/76b5a35@@rte_vhost@sta/librte_vhost_vhost.c.o'.
[362/2188] Compiling C object 'lib/76b5a35@@rte_vhost@sta/librte_vhost_vhost_user.c.o'.
[363/2188] Compiling C object 'lib/76b5a35@@rte_ipsec@sta/librte_ipsec_esp_inb.c.o'.
[364/2188] Compiling C object 'lib/76b5a35@@rte_vhost@sta/librte_vhost_vhost_crypto.c.o'.
ninja: build stopped: subcommand failed.
meson  --werror -Dexamples=all --buildtype=debugoptimized -Dlibdir=lib -Dmachine=nehalem --default-library=shared /root/UB1804-64_K4.15.0_GCC7.3.0/x86_64-native-linuxapp-gcc/3bc952ca1d5440afb00a4785b5438b30/dpdk/devtools/.. ./build-x86-default
The Meson build system
Version: 0.50.0
Source dir: /root/UB1804-64_K4.15.0_GCC7.3.0/x86_64-native-linuxapp-gcc/3bc952ca1d5440afb00a4785b5438b30/dpdk
Build dir: /root/UB1804-64_K4.15.0_GCC7.3.0/x86_64-native-linuxapp-gcc/3bc952ca1d5440afb00a4785b5438b30/dpdk/build-x86-default


*Meson Build Failed #5:
OS: SUSE15-64
Target:./build-gcc-static
[347/2150] Generating vhost_def with a custom command.
[348/2150] Linking target lib/librte_rib.so.0.200.2.
[349/2150] Compiling C object 'lib/76b5a35@@rte_vhost@sta/librte_vhost_vhost.c.o'.
[350/2150] Generating symbol file 'lib/76b5a35@@rte_security@sha/librte_security.so.20.0.2.symbols'.
[351/2150] Compiling C object 'lib/76b5a35@@rte_vhost@sta/librte_vhost_virtio_net.c.o'.
FAILED: lib/76b5a35@@rte_vhost@sta/librte_vhost_virtio_net.c.o 
clang -Ilib/76b5a35@@rte_vhost@sta -Ilib -I../lib -Ilib/librte_vhost -I../lib/librte_vhost -I. -I../ -Iconfig -I../config -Ilib/librte_eal/common/include -I../lib/librte_eal/common/include -I../lib/librte_eal/linux/eal/include -Ilib/librte_eal/common -I../lib/librte_eal/common -Ilib/librte_eal/common/include/arch/x86 -I../lib/librte_eal/common/include/arch/x86 -Ilib/librte_eal -I../lib/librte_eal -Ilib/librte_kvargs -I../lib/librte_kvargs -Ilib/librte_ethdev -I../lib/librte_ethdev -Ilib/librte_net -I../lib/librte_net -Ilib/librte_mbuf -I../lib/librte_mbuf -Ilib/librte_mempool -I../lib/librte_mempool -Ilib/librte_ring -I../lib/librte_ring -Ilib/librte_meter -I../lib/librte_meter -Ilib/librte_cryptodev -I../lib/librte_cryptodev -Ilib/librte_hash -I../lib/librte_hash -Ilib/librte_pci -I../lib/librte_pci -Xclang -fcolor-diagnostics -pipe -D_FILE_OFFSET_BITS=64 -Wall -Winvalid-pch -Werror -O2 -g -include rte_config.h -Wextra -Wcast-qual -Wdeprecated -Wformat-nonliteral -Wformat-security -Wmissing-declarations -Wmissing-prototypes -Wnested-externs -Wold-style-definition -Wpointer-arith -Wsign-compare -Wstrict-prototypes -Wundef -Wwrite-strings -Wno-address-of-packed-member -Wno-missing-field-initializers -D_GNU_SOURCE -fPIC -march=native -DVHOST_CLANG_UNROLL_PRAGMA -fno-strict-aliasing -DALLOW_EXPERIMENTAL_API -MD -MQ 'lib/76b5a35@@rte_vhost@sta/librte_vhost_virtio_net.c.o' -MF 'lib/76b5a35@@rte_vhost@sta/librte_vhost_virtio_net.c.o.d' -o 'lib/76b5a35@@rte_vhost@sta/librte_vhost_virtio_net.c.o' -c ../lib/librte_vhost/virtio_net.c
../lib/librte_vhost/virtio_net.c:2263:4: error: incompatible pointer types passing 'int *' to parameter of type 'int16_t *' (aka 'short *') [-Werror,-Wincompatible-pointer-types]
                        &success, 0, 0, __ATOMIC_RELEASE, __ATOMIC_RELAXED))) {
                        ^~~~~~~~
../lib/librte_eal/common/include/rte_branch_prediction.h:38:41: note: expanded from macro 'unlikely'
--
[354/2150] Compiling C object 'lib/76b5a35@@rte_ipsec@sta/librte_ipsec_ses.c.o'.
[355/2150] Compiling C object 'lib/76b5a35@@rte_vhost@sta/librte_vhost_vhost_user.c.o'.
[356/2150] Compiling C object 'lib/76b5a35@@rte_ipsec@sta/librte_ipsec_esp_inb.c.o'.
[357/2150] Compiling C object 'lib/76b5a35@@rte_ipsec@sta/librte_ipsec_esp_outb.c.o'.
[358/2150] Compiling C object 'lib/76b5a35@@rte_vhost@sta/librte_vhost_vhost_crypto.c.o'.
ninja: build stopped: subcommand failed.
meson  --werror -Dexamples=all --buildtype=debugoptimized --default-library=shared /root/SUSE15-64_K4.12.14_GCC7.3.1/x86_64-native-linuxapp-gcc/3bc952ca1d5440afb00a4785b5438b30/dpdk/devtools/.. ./build-clang-shared
The Meson build system
Version: 0.50.1
Source dir: /root/SUSE15-64_K4.12.14_GCC7.3.1/x86_64-native-linuxapp-gcc/3bc952ca1d5440afb00a4785b5438b30/dpdk
Build dir: /root/SUSE15-64_K4.12.14_GCC7.3.1/x86_64-native-linuxapp-gcc/3bc952ca1d5440afb00a4785b5438b30/dpdk/build-clang-shared
--
[358/2178] Generating vhost_def with a custom command.
[359/2178] Generating symbol file 'lib/76b5a35@@rte_stack@sha/librte_stack.so.0.200.2.symbols'.
[360/2178] Generating sched.exp_chk with a meson_exe.py custom command.
[361/2178] Compiling C object 'lib/76b5a35@@rte_vhost@sta/librte_vhost_vhost_user.c.o'.
[362/2178] Compiling C object 'lib/76b5a35@@rte_vhost@sta/librte_vhost_virtio_net.c.o'.
FAILED: lib/76b5a35@@rte_vhost@sta/librte_vhost_virtio_net.c.o 
clang -Ilib/76b5a35@@rte_vhost@sta -Ilib -I../lib -Ilib/librte_vhost -I../lib/librte_vhost -I. -I../ -Iconfig -I../config -Ilib/librte_eal/common/include -I../lib/librte_eal/common/include -I../lib/librte_eal/linux/eal/include -Ilib/librte_eal/common -I../lib/librte_eal/common -Ilib/librte_eal/common/include/arch/x86 -I../lib/librte_eal/common/include/arch/x86 -Ilib/librte_eal -I../lib/librte_eal -Ilib/librte_kvargs -I../lib/librte_kvargs -Ilib/librte_ethdev -I../lib/librte_ethdev -Ilib/librte_net -I../lib/librte_net -Ilib/librte_mbuf -I../lib/librte_mbuf -Ilib/librte_mempool -I../lib/librte_mempool -Ilib/librte_ring -I../lib/librte_ring -Ilib/librte_meter -I../lib/librte_meter -Ilib/librte_cryptodev -I../lib/librte_cryptodev -Ilib/librte_hash -I../lib/librte_hash -Ilib/librte_pci -I../lib/librte_pci -Xclang -fcolor-diagnostics -pipe -D_FILE_OFFSET_BITS=64 -Wall -Winvalid-pch -Werror -O2 -g -include rte_config.h -Wextra -Wcast-qual -Wdeprecated -Wformat-nonliteral -Wformat-security -Wmissing-declarations -Wmissing-prototypes -Wnested-externs -Wold-style-definition -Wpointer-arith -Wsign-compare -Wstrict-prototypes -Wundef -Wwrite-strings -Wno-address-of-packed-member -Wno-missing-field-initializers -D_GNU_SOURCE -fPIC -march=native -DVHOST_CLANG_UNROLL_PRAGMA -fno-strict-aliasing -DALLOW_EXPERIMENTAL_API -MD -MQ 'lib/76b5a35@@rte_vhost@sta/librte_vhost_virtio_net.c.o' -MF 'lib/76b5a35@@rte_vhost@sta/librte_vhost_virtio_net.c.o.d' -o 'lib/76b5a35@@rte_vhost@sta/librte_vhost_virtio_net.c.o' -c ../lib/librte_vhost/virtio_net.c
../lib/librte_vhost/virtio_net.c:2263:4: error: incompatible pointer types passing 'int *' to parameter of type 'int16_t *' (aka 'short *') [-Werror,-Wincompatible-pointer-types]
                        &success, 0, 0, __ATOMIC_RELEASE, __ATOMIC_RELAXED))) {
                        ^~~~~~~~
../lib/librte_eal/common/include/rte_branch_prediction.h:38:41: note: expanded from macro 'unlikely'
--
[365/2178] Compiling C object 'lib/76b5a35@@rte_vhost@sta/librte_vhost_vhost.c.o'.
[366/2178] Compiling C object 'lib/76b5a35@@rte_ipsec@sta/librte_ipsec_ses.c.o'.
[367/2178] Compiling C object 'lib/76b5a35@@rte_ipsec@sta/librte_ipsec_esp_inb.c.o'.
[368/2178] Compiling C object 'lib/76b5a35@@rte_vhost@sta/librte_vhost_vhost_crypto.c.o'.
[369/2178] Compiling C object 'lib/76b5a35@@rte_ipsec@sta/librte_ipsec_esp_outb.c.o'.
ninja: build stopped: subcommand failed.
meson  --werror -Dexamples=all --buildtype=debugoptimized -Dlibdir=lib -Dmachine=nehalem --default-library=shared /root/SUSE15-64_K4.12.14_GCC7.3.1/x86_64-native-linuxapp-gcc/3bc952ca1d5440afb00a4785b5438b30/dpdk/devtools/.. ./build-x86-default
The Meson build system
Version: 0.50.1
Source dir: /root/SUSE15-64_K4.12.14_GCC7.3.1/x86_64-native-linuxapp-gcc/3bc952ca1d5440afb00a4785b5438b30/dpdk
Build dir: /root/SUSE15-64_K4.12.14_GCC7.3.1/x86_64-native-linuxapp-gcc/3bc952ca1d5440afb00a4785b5438b30/dpdk/build-x86-default

DPDK STV team

                 reply	other threads:[~2020-03-11  7:43 UTC|newest]

Thread overview: [no followups] expand[flat|nested]  mbox.gz  Atom feed

Reply instructions:

You may reply publicly to this message via plain-text email
using any one of the following methods:

* Save the following mbox file, import it into your mail client,
  and reply-to-all from there: mbox

  Avoid top-posting and favor interleaved quoting:
  https://en.wikipedia.org/wiki/Posting_style#Interleaved_style

* Reply using the --to, --cc, and --in-reply-to
  switches of git-send-email(1):

  git send-email \
    --in-reply-to='ee68f5$9j4fem@orsmga001.jf.intel.com' \
    --to=sys_stv@intel.com \
    --cc=test-report@dpdk.org \
    /path/to/YOUR_REPLY

  https://kernel.org/pub/software/scm/git/docs/git-send-email.html

* If your mail client supports setting the In-Reply-To header
  via mailto: links, try the mailto: link

automatic DPDK test reports

This inbox may be cloned and mirrored by anyone:

	git clone --mirror https://inbox.dpdk.org/test-report/0 test-report/git/0.git

	# If you have public-inbox 1.1+ installed, you may
	# initialize and index your mirror using the following commands:
	public-inbox-init -V2 test-report test-report/ https://inbox.dpdk.org/test-report \
		test-report@dpdk.org
	public-inbox-index test-report

Example config snippet for mirrors.
Newsgroup available over NNTP:
	nntp://inbox.dpdk.org/inbox.dpdk.test-report


AGPL code for this site: git clone https://public-inbox.org/public-inbox.git