automatic DPDK test reports
 help / color / mirror / Atom feed
* [dpdk-test-report] |FAILURE| pw66536[7/9] net/cxgbe: add rte_flow support for Source MAC Rewrite
@ 2020-03-11 10:25 sys_stv
  0 siblings, 0 replies; only message in thread
From: sys_stv @ 2020-03-11 10:25 UTC (permalink / raw)
  To: test-report

[-- Attachment #1: Type: text/plain, Size: 21196 bytes --]

Test-Label: Intel-compilation
Test-Status: FAILURE
http://dpdk.org/patch/66536

_Compilation issues_

Submitter: Rahul Lakkireddy <rahul.lakkireddy@chelsio.com>
Date: 2020-03-11 09:05:49
Reply_mail: 922dac5cf352f830d98d89016e253caf37fdfcc6.1583906144.git.kaara.satwik@chelsio.com
DPDK git baseline: Repo:dpdk-next-net, CommitID: 602f9dd0ad0668442d20b4f7a19cfff8ada2c09a

Makefile build Summary: 23 Builds Done, 23 Successful, 0 Failures

Meson build Summary: 8 Builds Done, 6 Successful, 2 Failures

               +==============================================+===========+==========+
               |                   Makefile                   |   Meson   | Document |
+----------------+------+-------+------+------------+-----------+-----------+----------+
| os             | gcc  | clang | icc  | gcc+shared | gcc+debug | gcc/clang | pdf/html |
+----------------+------+-------+------+------------+-----------+-----------+----------+
| RHEL80-64      | pass |       |      |            |           |           |          |
| UB1804-64      | pass | pass  | pass |            |           | pass      | pass     |
| UB1604-32      | pass |       |      |            |           | FAIL      |          |
| CENTOS77-64    | pass | pass  | pass | pass       | pass      | FAIL      |          |
| UB1604-64      | pass | pass  |      |            |           |           |          |
| WIN10-64       |      |       |      |            |           | pass      |          |
| UB1910-64      | pass |       |      |            |           |           |          |
| FC31-64        | pass | pass  |      |            |           | pass      |          |
| CENTOS80-64    | pass |       |      |            |           |           |          |
| FreeBSD1201-64 | pass | pass  |      | pass       | pass      | pass      |          |
| RHEL77-64      | pass |       |      |            |           |           |          |
| SUSE15-64      | pass | pass  |      |            |           | pass      |          |
+----------------+------+-------+------+------------+-----------+-----------+----------+

Test environment and configuration as below:

** Makefile build **


OS: UB1804-64
	Kernel Version: 4.15.0-20-generic
	CPU info: Intel(R) Xeon(R) CPU E5-2699 v3 @ 2.30GHz
	GCC Version: gcc (Ubuntu 7.3.0-16ubuntu3) 7.3.0
	Clang Version: 6.0.0-1ubuntu2 (tags/RELEASE_600/final)
	x86_64-native-linuxapp-clang
	x86_64-native-linuxapp-icc
	x86_64-native-linuxapp-gcc


OS: UB1604-32
	Kernel Version: 4.4.0-131-generic
	CPU info: Intel(R) Xeon(R) CPU E5-2699 v3 @ 2.30GHz
	GCC Version: gcc (Ubuntu 5.4.0-6ubuntu1~16.04.11) 5.4.0 20160609
	Clang Version: 3.8.0-2ubuntu4 (tags/RELEASE_380/final)
	i686-native-linuxapp-gcc


OS: CENTOS77-64
	Kernel Version: 3.10.0-1062.9.1.el7.x86_64
	CPU info: Intel(R) Xeon(R) CPU E5-2699 v4 @ 2.20GHz
	GCC Version: gcc (GCC) 4.8.5 20150623 (Red Hat 4.8.5-39)
	Clang Version: 3.4.2 (tags/RELEASE_34/dot2-final)
	x86_64-native-linuxapp-clang
	x86_64-native-linuxapp-gcc
	x86_64-native-linuxapp-gcc+shared
	x86_64-native-linuxapp-gcc+debug
	x86_64-native-linuxapp-icc


OS: UB1910-64
	Kernel Version: 5.3.0-18-generic
	CPU info: Intel(R) Xeon(R) CPU E5-2699 v3 @ 2.30GHz
	GCC Version: gcc (Ubuntu 9.2.1-9ubuntu2) 9.2.1 20191008
	Clang Version: 9.0.0-2 (tags/RELEASE_900/final)
	x86_64-native-linuxapp-gcc


OS: CENTOS80-64
	Kernel Version: 4.18.0-80.11.2.el8_0.x86_64
	CPU info: Intel(R) Xeon(R) CPU E5-2699 v4 @ 2.20GHz
	GCC Version: gcc (GCC) 8.2.1 20180905 (Red Hat 8.2.1-3)
	Clang Version: 7.0.1 (tags/RELEASE_701/final)
	x86_64-native-linuxapp-gcc


OS: UB1604-64
	Kernel Version: 4.4.0-170-generic
	CPU info: Intel(R) Xeon(R) CPU E5-2699 v3 @ 2.30GHz
	GCC Version: gcc (Ubuntu 5.4.0-6ubuntu1~16.04.12) 5.4.0 20160609
	Clang Version: 3.8.0-2ubuntu4 (tags/RELEASE_380/final)
	x86_64-native-linuxapp-clang
	x86_64-native-linuxapp-gcc


OS: FC31-64
	Kernel Version: 5.3.15-300.fc31.x86_64
	CPU info: Intel(R) Xeon(R) CPU E5-2699 v4 @ 2.20GHz
	GCC Version: gcc (GCC) 9.2.1 20190827 (Red Hat 9.2.1-1)
	Clang Version: 9.0.0 (Fedora 9.0.0-1.fc31)
	x86_64-native-linuxapp-gcc
	x86_64-native-linuxapp-clang


OS: RHEL80-64
	Kernel Version: 4.18.0-80.el8.x86_64
	CPU info: Intel(R) Xeon(R) CPU E5-2699 v4 @ 2.20GHz
	GCC Version: gcc (GCC) 8.2.1 20180905 (Red Hat 8.2.1-3)
	Clang Version: 6.0.1 (tags/RELEASE_601/final)
	x86_64-native-linuxapp-gcc


OS: FreeBSD1201-64
	Kernel Version: 12.1-RELEASE
	CPU info: Intel(R) Xeon(R) CPU E5-2699 v4 @ 2.20GHz (2194.95-MHz K8-class CPU)
	GCC Version: gcc (FreeBSD Ports Collection) 9.2.0
	Clang Version: 8.0.1 (tags/RELEASE_801/final 366581) (based on LLVM 8.0.1)
	x86_64-native-bsdapp-gcc
	x86_64-native-bsdapp-clang
	x86_64-native-bsdapp-gcc+shared
	x86_64-native-bsdapp-gcc+debug


OS: RHEL77-64
	Kernel Version: 3.10.0-1062.9.1.el7.x86_64
	CPU info: Intel(R) Xeon(R) CPU E5-2699 v4 @ 2.20GHz
	GCC Version: gcc (GCC) 4.8.5 20150623 (Red Hat 4.8.5-39)
	Clang Version: 3.4.2 (tags/RELEASE_34/dot2-final)
	x86_64-native-linuxapp-gcc


OS: SUSE15-64
	Kernel Version: 4.12.14-lp150.11-default
	CPU info: Intel(R) Xeon(R) CPU E5-2699 v4 @ 2.20GHz
	GCC Version: gcc (SUSE Linux) 7.3.1 20180323 [gcc-7-branch revision 258812]
	Clang Version: 5.0.1 (tags/RELEASE_501/final 312548)
	x86_64-native-linuxapp-gcc
	x86_64-native-linuxapp-clang


** Meson build **


OS: UB1804-64
	Kernel Version: 4.15.0-20-generic
	CPU info: Intel(R) Xeon(R) CPU E5-2699 v4 @ 2.20GHz
	GCC Version: gcc (Ubuntu 7.3.0-27ubuntu1~18.04) 7.3.0
	Clang Version: 6.0.0-1ubuntu2 (tags/RELEASE_600/final)
	x86_64-native-linuxapp-doc
	./build-gcc-static
	./build-gcc-shared
	./build-clang-static
	./build-clang-shared
	./build-x86-default


OS: UB1604-32
	Kernel Version: 4.4.0-131-generic
	CPU info: Intel(R) Xeon(R) CPU E5-2699 v4 @ 2.20GHz
	GCC Version: gcc (Ubuntu 5.4.0-6ubuntu1~16.04.11) 5.4.0 20160609
	Clang Version: 3.8.0-2ubuntu4 (tags/RELEASE_380/final)
	./build-gcc-static
	./build-gcc-shared
	./build-clang-static
	./build-clang-shared
	./build-x86-default


OS: CENTOS77-64
	Kernel Version: 3.10.0-1062.12.1.el7.x86_64
	CPU info: Intel(R) Xeon(R) CPU E5-2699 v4 @ 2.20GHz
	GCC Version: gcc (GCC) 4.8.5 20150623 (Red Hat 4.8.5-39)
	Clang Version: 3.4.2 (tags/RELEASE_34/dot2-final)
	./build-gcc-static
	./build-gcc-shared
	./build-clang-static
	./build-clang-shared
	./build-x86-default


OS: WIN10-64
	Kernel Version: N/A
	CPU info: N/A
	GCC Version: N/A
	Clang Version: Clang 8.0.0
	x86_64-windows-clang


OS: FC31-64
	Kernel Version: 5.4.18-200.fc31.x86_64
	CPU info: Intel(R) Xeon(R) CPU E5-2699 v4 @ 2.20GHz
	GCC Version: gcc (GCC) 9.2.1 20190827 (Red Hat 9.2.1-1)
	Clang Version: 9.0.0 (Fedora 9.0.0-1.fc31)
	./build-gcc-static
	./build-gcc-shared
	./build-clang-static
	./build-clang-shared
	./build-x86-default


OS: FreeBSD1201-64
	Kernel Version: 12.1-RELEASE
	CPU info: Intel(R) Xeon(R) CPU E5-2699 v4 @ 2.20GHz (2194.98-MHz K8-class CPU)
	GCC Version: gcc (FreeBSD Ports Collection) 9.2.0
	Clang Version: 8.0.1 (tags/RELEASE_801/final 366581) (based on LLVM 8.0.1)
	./build-gcc-static
	./build-gcc-shared
	./build-clang-static
	./build-clang-shared
	./build-x86-default


OS: SUSE15-64
	Kernel Version: 4.12.14-lp150.12.82-default
	CPU info: Intel(R) Xeon(R) CPU E5-2699 v4 @ 2.20GHz
	GCC Version: gcc (SUSE Linux) 7.4.1 20190905 [gcc-7-branch revision 275407]
	Clang Version: 5.0.1 (tags/RELEASE_501/final 312548)
	./build-gcc-static
	./build-gcc-shared
	./build-clang-static
	./build-clang-shared
	./build-x86-default


*Meson Build Failed #1:
OS: CENTOS77-64
Target:./build-gcc-static
[767/2244] Compiling C object 'drivers/a715181@@rte_pmd_bnx2x@sha/meson-generated_.._rte_pmd_bnx2x.pmd.c.o'.
[768/2244] Compiling C object 'drivers/a715181@@tmp_rte_pmd_cxgbe@sta/net_cxgbe_cxgbevf_main.c.o'.
[769/2244] Compiling C object 'drivers/a715181@@tmp_rte_pmd_bnxt@sta/net_bnxt_bnxt_rxtx_vec_sse.c.o'.
[770/2244] Linking static target drivers/libtmp_rte_pmd_bnxt.a.
[771/2244] Compiling C object 'drivers/a715181@@tmp_rte_pmd_cxgbe@sta/net_cxgbe_cxgbe_flow.c.o'.
FAILED: drivers/a715181@@tmp_rte_pmd_cxgbe@sta/net_cxgbe_cxgbe_flow.c.o 
clang -Idrivers/a715181@@tmp_rte_pmd_cxgbe@sta -Idrivers -I../drivers -Idrivers/net/cxgbe -I../drivers/net/cxgbe -I../drivers/net/cxgbe/base -Ilib/librte_ethdev -I../lib/librte_ethdev -I. -I../ -Iconfig -I../config -Ilib/librte_eal/common/include -I../lib/librte_eal/common/include -I../lib/librte_eal/linux/eal/include -Ilib/librte_eal/common -I../lib/librte_eal/common -Ilib/librte_eal/common/include/arch/x86 -I../lib/librte_eal/common/include/arch/x86 -Ilib/librte_eal -I../lib/librte_eal -Ilib/librte_kvargs -I../lib/librte_kvargs -Ilib/librte_net -I../lib/librte_net -Ilib/librte_mbuf -I../lib/librte_mbuf -Ilib/librte_mempool -I../lib/librte_mempool -Ilib/librte_ring -I../lib/librte_ring -Ilib/librte_meter -I../lib/librte_meter -Idrivers/bus/pci -I../drivers/bus/pci -I../drivers/bus/pci/linux -Ilib/librte_pci -I../lib/librte_pci -Idrivers/bus/vdev -I../drivers/bus/vdev -Xclang -fcolor-diagnostics -pipe -D_FILE_OFFSET_BITS=64 -Wall -Winvalid-pch -Werror -O2 -g -include rte_config.h -Wextra -Wcast-qual -Wdeprecated -Wformat-nonliteral -Wformat-security -Wmissing-declarations -Wmissing-prototypes -Wnested-externs -Wold-style-definition -Wpointer-arith -Wsign-compare -Wstrict-prototypes -Wundef -Wwrite-strings -Wno-missing-field-initializers -D_GNU_SOURCE -fPIC -march=native -msse4 -MD -MQ 'drivers/a715181@@tmp_rte_pmd_cxgbe@sta/net_cxgbe_cxgbe_flow.c.o' -MF 'drivers/a715181@@tmp_rte_pmd_cxgbe@sta/net_cxgbe_cxgbe_flow.c.o.d' -o 'drivers/a715181@@tmp_rte_pmd_cxgbe@sta/net_cxgbe_cxgbe_flow.c.o' -c ../drivers/net/cxgbe/cxgbe_flow.c
../drivers/net/cxgbe/cxgbe_flow.c:315:2: error: implicit truncation from 'int' to bitfield changes value from -1 to 7 [-Werror,-Wbitfield-constant-conversion]
        CXGBE_FILL_FS(adap->pf, ~0, pf);
        ^~~~~~~~~~~~~~~~~~~~~~~~~~~~~~~
../drivers/net/cxgbe/cxgbe_flow.c:25:2: note: expanded from macro 'CXGBE_FILL_FS'
--
[772/2244] Compiling C object 'drivers/a715181@@tmp_rte_pmd_cxgbe@sta/net_cxgbe_sge.c.o'.
[773/2244] Compiling C object 'drivers/a715181@@tmp_rte_pmd_cxgbe@sta/net_cxgbe_cxgbe_main.c.o'.
[774/2244] Generating rte_pmd_bnxt.pmd.c with a custom command.
[775/2244] Generating rte_pmd_bnx2x.exp_chk with a meson_exe.py custom command.
[776/2244] Compiling C object 'lib/76b5a35@@rte_pipeline@sta/librte_pipeline_rte_table_action.c.o'.
ninja: build stopped: subcommand failed.
meson  --werror -Dexamples=all --buildtype=debugoptimized --default-library=shared /root/CENTOS77-64_K3.10.0_GCC4.8.5/x86_64-native-linuxapp-gcc/b74bf686fbf04f57971fc1f3a560407b/dpdk/devtools/.. ./build-clang-shared
The Meson build system
Version: 0.53.1
Source dir: /root/CENTOS77-64_K3.10.0_GCC4.8.5/x86_64-native-linuxapp-gcc/b74bf686fbf04f57971fc1f3a560407b/dpdk
Build dir: /root/CENTOS77-64_K3.10.0_GCC4.8.5/x86_64-native-linuxapp-gcc/b74bf686fbf04f57971fc1f3a560407b/dpdk/build-clang-shared
--
[787/2272] Compiling C object 'drivers/a715181@@tmp_rte_pmd_cxgbe@sta/net_cxgbe_cxgbevf_ethdev.c.o'.
[788/2272] Linking static target drivers/libtmp_rte_pmd_bnxt.a.
[789/2272] Compiling C object 'drivers/a715181@@tmp_rte_pmd_cxgbe@sta/net_cxgbe_cxgbevf_main.c.o'.
[790/2272] Generating rte_pmd_bnx2x.exp_chk with a meson_exe.py custom command.
[791/2272] Compiling C object 'drivers/a715181@@tmp_rte_pmd_cxgbe@sta/net_cxgbe_cxgbe_flow.c.o'.
FAILED: drivers/a715181@@tmp_rte_pmd_cxgbe@sta/net_cxgbe_cxgbe_flow.c.o 
clang -Idrivers/a715181@@tmp_rte_pmd_cxgbe@sta -Idrivers -I../drivers -Idrivers/net/cxgbe -I../drivers/net/cxgbe -I../drivers/net/cxgbe/base -Ilib/librte_ethdev -I../lib/librte_ethdev -I. -I../ -Iconfig -I../config -Ilib/librte_eal/common/include -I../lib/librte_eal/common/include -I../lib/librte_eal/linux/eal/include -Ilib/librte_eal/common -I../lib/librte_eal/common -Ilib/librte_eal/common/include/arch/x86 -I../lib/librte_eal/common/include/arch/x86 -Ilib/librte_eal -I../lib/librte_eal -Ilib/librte_kvargs -I../lib/librte_kvargs -Ilib/librte_net -I../lib/librte_net -Ilib/librte_mbuf -I../lib/librte_mbuf -Ilib/librte_mempool -I../lib/librte_mempool -Ilib/librte_ring -I../lib/librte_ring -Ilib/librte_meter -I../lib/librte_meter -Idrivers/bus/pci -I../drivers/bus/pci -I../drivers/bus/pci/linux -Ilib/librte_pci -I../lib/librte_pci -Idrivers/bus/vdev -I../drivers/bus/vdev -Xclang -fcolor-diagnostics -pipe -D_FILE_OFFSET_BITS=64 -Wall -Winvalid-pch -Werror -O2 -g -include rte_config.h -Wextra -Wcast-qual -Wdeprecated -Wformat-nonliteral -Wformat-security -Wmissing-declarations -Wmissing-prototypes -Wnested-externs -Wold-style-definition -Wpointer-arith -Wsign-compare -Wstrict-prototypes -Wundef -Wwrite-strings -Wno-missing-field-initializers -D_GNU_SOURCE -fPIC -march=native -msse4 -MD -MQ 'drivers/a715181@@tmp_rte_pmd_cxgbe@sta/net_cxgbe_cxgbe_flow.c.o' -MF 'drivers/a715181@@tmp_rte_pmd_cxgbe@sta/net_cxgbe_cxgbe_flow.c.o.d' -o 'drivers/a715181@@tmp_rte_pmd_cxgbe@sta/net_cxgbe_cxgbe_flow.c.o' -c ../drivers/net/cxgbe/cxgbe_flow.c
../drivers/net/cxgbe/cxgbe_flow.c:315:2: error: implicit truncation from 'int' to bitfield changes value from -1 to 7 [-Werror,-Wbitfield-constant-conversion]
        CXGBE_FILL_FS(adap->pf, ~0, pf);
        ^~~~~~~~~~~~~~~~~~~~~~~~~~~~~~~
../drivers/net/cxgbe/cxgbe_flow.c:25:2: note: expanded from macro 'CXGBE_FILL_FS'
--
[792/2272] Linking target drivers/librte_pmd_bnx2x.so.20.0.2.
[793/2272] Generating rte_pmd_bnxt.pmd.c with a custom command.
[794/2272] Compiling C object 'drivers/a715181@@tmp_rte_pmd_cxgbe@sta/net_cxgbe_cxgbe_main.c.o'.
[795/2272] Compiling C object 'drivers/a715181@@tmp_rte_pmd_cxgbe@sta/net_cxgbe_sge.c.o'.
[796/2272] Compiling C object 'lib/76b5a35@@rte_pipeline@sta/librte_pipeline_rte_table_action.c.o'.
ninja: build stopped: subcommand failed.
meson  --werror -Dexamples=all --buildtype=debugoptimized -Dlibdir=lib -Dmachine=corei7 --default-library=shared /root/CENTOS77-64_K3.10.0_GCC4.8.5/x86_64-native-linuxapp-gcc/b74bf686fbf04f57971fc1f3a560407b/dpdk/devtools/.. ./build-x86-default
The Meson build system
Version: 0.53.1
Source dir: /root/CENTOS77-64_K3.10.0_GCC4.8.5/x86_64-native-linuxapp-gcc/b74bf686fbf04f57971fc1f3a560407b/dpdk
Build dir: /root/CENTOS77-64_K3.10.0_GCC4.8.5/x86_64-native-linuxapp-gcc/b74bf686fbf04f57971fc1f3a560407b/dpdk/build-x86-default


*Meson Build Failed #2:
OS: UB1604-32
Target:./build-gcc-static
[750/1973] Compiling C object 'drivers/a715181@@tmp_rte_pmd_bnxt@sta/net_bnxt_bnxt_hwrm.c.o'.
[751/1973] Linking static target drivers/libtmp_rte_pmd_bnxt.a.
[752/1973] Compiling C object 'drivers/a715181@@tmp_rte_pmd_cxgbe@sta/net_cxgbe_cxgbe_ethdev.c.o'.
[753/1973] Generating rte_pmd_bnxt.pmd.c with a custom command.
[754/1973] Compiling C object 'drivers/a715181@@tmp_rte_pmd_cxgbe@sta/net_cxgbe_cxgbe_flow.c.o'.
FAILED: drivers/a715181@@tmp_rte_pmd_cxgbe@sta/net_cxgbe_cxgbe_flow.c.o 
clang -Idrivers/a715181@@tmp_rte_pmd_cxgbe@sta -Idrivers -I../drivers -Idrivers/net/cxgbe -I../drivers/net/cxgbe -I../drivers/net/cxgbe/base -Ilib/librte_ethdev -I../lib/librte_ethdev -I. -I../ -Iconfig -I../config -Ilib/librte_eal/common/include -I../lib/librte_eal/common/include -I../lib/librte_eal/linux/eal/include -Ilib/librte_eal/common -I../lib/librte_eal/common -Ilib/librte_eal/common/include/arch/x86 -I../lib/librte_eal/common/include/arch/x86 -Ilib/librte_eal -I../lib/librte_eal -Ilib/librte_kvargs -I../lib/librte_kvargs -Ilib/librte_net -I../lib/librte_net -Ilib/librte_mbuf -I../lib/librte_mbuf -Ilib/librte_mempool -I../lib/librte_mempool -Ilib/librte_ring -I../lib/librte_ring -Ilib/librte_meter -I../lib/librte_meter -Idrivers/bus/pci -I../drivers/bus/pci -I../drivers/bus/pci/linux -Ilib/librte_pci -I../lib/librte_pci -Idrivers/bus/vdev -I../drivers/bus/vdev -Xclang -fcolor-diagnostics -pipe -D_FILE_OFFSET_BITS=64 -Wall -Winvalid-pch -Werror -O2 -g -include rte_config.h -Wextra -Wcast-qual -Wdeprecated -Wformat-nonliteral -Wformat-security -Wmissing-declarations -Wmissing-prototypes -Wnested-externs -Wold-style-definition -Wpointer-arith -Wsign-compare -Wstrict-prototypes -Wundef -Wwrite-strings -Wno-missing-field-initializers -Wno-pointer-to-int-cast -D_GNU_SOURCE -fPIC -march=native -MD -MQ 'drivers/a715181@@tmp_rte_pmd_cxgbe@sta/net_cxgbe_cxgbe_flow.c.o' -MF 'drivers/a715181@@tmp_rte_pmd_cxgbe@sta/net_cxgbe_cxgbe_flow.c.o.d' -o 'drivers/a715181@@tmp_rte_pmd_cxgbe@sta/net_cxgbe_cxgbe_flow.c.o' -c ../drivers/net/cxgbe/cxgbe_flow.c
../drivers/net/cxgbe/cxgbe_flow.c:315:2: error: implicit truncation from 'int' to bitfield changes value from -1 to 7 [-Werror,-Wbitfield-constant-conversion]
        CXGBE_FILL_FS(adap->pf, ~0, pf);
        ^~~~~~~~~~~~~~~~~~~~~~~~~~~~~~~
../drivers/net/cxgbe/cxgbe_flow.c:25:2: note: expanded from macro 'CXGBE_FILL_FS'
--
[755/1973] Compiling C object 'drivers/a715181@@rte_pmd_bnxt@sha/meson-generated_.._rte_pmd_bnxt.pmd.c.o'.
[756/1973] Compiling C object 'drivers/a715181@@tmp_rte_pmd_cxgbe@sta/net_cxgbe_cxgbe_main.c.o'.
[757/1973] Compiling C object 'drivers/a715181@@tmp_rte_pmd_cxgbe@sta/net_cxgbe_cxgbevf_main.c.o'.
[758/1973] Compiling C object 'drivers/a715181@@tmp_rte_pmd_cxgbe@sta/net_cxgbe_clip_tbl.c.o'.
[759/1973] Compiling C object 'drivers/a715181@@tmp_rte_pmd_cxgbe@sta/net_cxgbe_sge.c.o'.
ninja: build stopped: subcommand failed.
meson  --werror -Dexamples=all --buildtype=debugoptimized --default-library=shared /root/UB1604-32_K4.4.0_GCC5.4.0/i686-native-linuxapp-gcc/b74bf686fbf04f57971fc1f3a560407b/dpdk/devtools/.. ./build-clang-shared
The Meson build system
Version: 0.50.1
Source dir: /root/UB1604-32_K4.4.0_GCC5.4.0/i686-native-linuxapp-gcc/b74bf686fbf04f57971fc1f3a560407b/dpdk
Build dir: /root/UB1604-32_K4.4.0_GCC5.4.0/i686-native-linuxapp-gcc/b74bf686fbf04f57971fc1f3a560407b/dpdk/build-clang-shared
--
[769/2001] Compiling C object 'drivers/a715181@@tmp_rte_pmd_bnxt@sta/net_bnxt_bnxt_hwrm.c.o'.
[770/2001] Linking static target drivers/libtmp_rte_pmd_bnxt.a.
[771/2001] Compiling C object 'drivers/a715181@@tmp_rte_pmd_cxgbe@sta/net_cxgbe_cxgbevf_main.c.o'.
[772/2001] Generating rte_pmd_bnxt.pmd.c with a custom command.
[773/2001] Compiling C object 'drivers/a715181@@tmp_rte_pmd_cxgbe@sta/net_cxgbe_cxgbe_flow.c.o'.
FAILED: drivers/a715181@@tmp_rte_pmd_cxgbe@sta/net_cxgbe_cxgbe_flow.c.o 
clang -Idrivers/a715181@@tmp_rte_pmd_cxgbe@sta -Idrivers -I../drivers -Idrivers/net/cxgbe -I../drivers/net/cxgbe -I../drivers/net/cxgbe/base -Ilib/librte_ethdev -I../lib/librte_ethdev -I. -I../ -Iconfig -I../config -Ilib/librte_eal/common/include -I../lib/librte_eal/common/include -I../lib/librte_eal/linux/eal/include -Ilib/librte_eal/common -I../lib/librte_eal/common -Ilib/librte_eal/common/include/arch/x86 -I../lib/librte_eal/common/include/arch/x86 -Ilib/librte_eal -I../lib/librte_eal -Ilib/librte_kvargs -I../lib/librte_kvargs -Ilib/librte_net -I../lib/librte_net -Ilib/librte_mbuf -I../lib/librte_mbuf -Ilib/librte_mempool -I../lib/librte_mempool -Ilib/librte_ring -I../lib/librte_ring -Ilib/librte_meter -I../lib/librte_meter -Idrivers/bus/pci -I../drivers/bus/pci -I../drivers/bus/pci/linux -Ilib/librte_pci -I../lib/librte_pci -Idrivers/bus/vdev -I../drivers/bus/vdev -Xclang -fcolor-diagnostics -pipe -D_FILE_OFFSET_BITS=64 -Wall -Winvalid-pch -Werror -O2 -g -include rte_config.h -Wextra -Wcast-qual -Wdeprecated -Wformat-nonliteral -Wformat-security -Wmissing-declarations -Wmissing-prototypes -Wnested-externs -Wold-style-definition -Wpointer-arith -Wsign-compare -Wstrict-prototypes -Wundef -Wwrite-strings -Wno-missing-field-initializers -Wno-pointer-to-int-cast -D_GNU_SOURCE -fPIC -march=native -MD -MQ 'drivers/a715181@@tmp_rte_pmd_cxgbe@sta/net_cxgbe_cxgbe_flow.c.o' -MF 'drivers/a715181@@tmp_rte_pmd_cxgbe@sta/net_cxgbe_cxgbe_flow.c.o.d' -o 'drivers/a715181@@tmp_rte_pmd_cxgbe@sta/net_cxgbe_cxgbe_flow.c.o' -c ../drivers/net/cxgbe/cxgbe_flow.c
../drivers/net/cxgbe/cxgbe_flow.c:315:2: error: implicit truncation from 'int' to bitfield changes value from -1 to 7 [-Werror,-Wbitfield-constant-conversion]
        CXGBE_FILL_FS(adap->pf, ~0, pf);
        ^~~~~~~~~~~~~~~~~~~~~~~~~~~~~~~
../drivers/net/cxgbe/cxgbe_flow.c:25:2: note: expanded from macro 'CXGBE_FILL_FS'
--
[774/2001] Compiling C object 'drivers/a715181@@rte_pmd_bnxt@sha/meson-generated_.._rte_pmd_bnxt.pmd.c.o'.
[775/2001] Compiling C object 'drivers/a715181@@tmp_rte_pmd_cxgbe@sta/net_cxgbe_cxgbe_main.c.o'.
[776/2001] Compiling C object 'drivers/a715181@@tmp_rte_pmd_cxgbe@sta/net_cxgbe_cxgbe_ethdev.c.o'.
[777/2001] Compiling C object 'drivers/a715181@@tmp_rte_pmd_cxgbe@sta/net_cxgbe_clip_tbl.c.o'.
[778/2001] Compiling C object 'drivers/a715181@@tmp_rte_pmd_cxgbe@sta/net_cxgbe_sge.c.o'.
ninja: build stopped: subcommand failed.
meson  --werror -Dexamples=all --buildtype=debugoptimized -Dlibdir=lib -Dmachine=nehalem --default-library=shared /root/UB1604-32_K4.4.0_GCC5.4.0/i686-native-linuxapp-gcc/b74bf686fbf04f57971fc1f3a560407b/dpdk/devtools/.. ./build-x86-default
The Meson build system
Version: 0.50.1
Source dir: /root/UB1604-32_K4.4.0_GCC5.4.0/i686-native-linuxapp-gcc/b74bf686fbf04f57971fc1f3a560407b/dpdk
Build dir: /root/UB1604-32_K4.4.0_GCC5.4.0/i686-native-linuxapp-gcc/b74bf686fbf04f57971fc1f3a560407b/dpdk/build-x86-default

DPDK STV team

^ permalink raw reply	[flat|nested] only message in thread

only message in thread, other threads:[~2020-03-11 10:25 UTC | newest]

Thread overview: (only message) (download: mbox.gz / follow: Atom feed)
-- links below jump to the message on this page --
2020-03-11 10:25 [dpdk-test-report] |FAILURE| pw66536[7/9] net/cxgbe: add rte_flow support for Source MAC Rewrite sys_stv

automatic DPDK test reports

This inbox may be cloned and mirrored by anyone:

	git clone --mirror https://inbox.dpdk.org/test-report/0 test-report/git/0.git

	# If you have public-inbox 1.1+ installed, you may
	# initialize and index your mirror using the following commands:
	public-inbox-init -V2 test-report test-report/ https://inbox.dpdk.org/test-report \
		test-report@dpdk.org
	public-inbox-index test-report

Example config snippet for mirrors.
Newsgroup available over NNTP:
	nntp://inbox.dpdk.org/inbox.dpdk.test-report


AGPL code for this site: git clone https://public-inbox.org/public-inbox.git