automatic DPDK test reports
 help / color / mirror / Atom feed
* [dpdk-test-report]  |FAILURE| pw66568[v2, 06/10] service: remove redundant code
@ 2020-03-12  8:46 sys_stv
  0 siblings, 0 replies; only message in thread
From: sys_stv @ 2020-03-12  8:46 UTC (permalink / raw)
  To: test-report

[-- Attachment #1: Type: text/plain, Size: 19104 bytes --]

Test-Label: Intel-compilation
Test-Status: FAILURE
http://dpdk.org/patch/66568

_Compilation issues_

Submitter: Phil Yang <phil.yang@arm.com>
Date: 2020-03-12 07:44:27
Reply_mail: 1583999071-22872-7-git-send-email-phil.yang@arm.com
DPDK git baseline: Repo:dpdk, CommitID: 2a860943b847fbd44e08ef4f1ca66de759875c9e

Makefile build Summary: 23 Builds Done, 23 Successful, 0 Failures

Meson build Summary: 8 Builds Done, 7 Successful, 1 Failures

               +==============================================+===========+==========+
               |                   Makefile                   |   Meson   | Document |
+----------------+------+-------+------+------------+-----------+-----------+----------+
| os             | gcc  | clang | icc  | gcc+shared | gcc+debug | gcc/clang | pdf/html |
+----------------+------+-------+------+------------+-----------+-----------+----------+
| RHEL80-64      | pass |       |      |            |           |           |          |
| UB1804-64      | pass | pass  | pass |            |           | pass      | pass     |
| UB1604-32      | pass |       |      |            |           | FAIL      |          |
| CENTOS77-64    | pass | pass  | pass | pass       | pass      | pass      |          |
| UB1604-64      | pass | pass  |      |            |           |           |          |
| WIN10-64       |      |       |      |            |           | pass      |          |
| UB1910-64      | pass |       |      |            |           |           |          |
| FC31-64        | pass | pass  |      |            |           | pass      |          |
| CENTOS80-64    | pass |       |      |            |           |           |          |
| FreeBSD1201-64 | pass | pass  |      | pass       | pass      | pass      |          |
| RHEL77-64      | pass |       |      |            |           |           |          |
| SUSE15-64      | pass | pass  |      |            |           | pass      |          |
+----------------+------+-------+------+------------+-----------+-----------+----------+

Test environment and configuration as below:

** Makefile build **


OS: UB1804-64
	Kernel Version: 4.15.0-20-generic
	CPU info: Intel(R) Xeon(R) CPU E5-2699 v3 @ 2.30GHz
	GCC Version: gcc (Ubuntu 7.3.0-16ubuntu3) 7.3.0
	Clang Version: 6.0.0-1ubuntu2 (tags/RELEASE_600/final)
	x86_64-native-linuxapp-clang
	x86_64-native-linuxapp-icc
	x86_64-native-linuxapp-gcc


OS: UB1604-32
	Kernel Version: 4.4.0-131-generic
	CPU info: Intel(R) Xeon(R) CPU E5-2699 v3 @ 2.30GHz
	GCC Version: gcc (Ubuntu 5.4.0-6ubuntu1~16.04.11) 5.4.0 20160609
	Clang Version: 3.8.0-2ubuntu4 (tags/RELEASE_380/final)
	i686-native-linuxapp-gcc


OS: CENTOS77-64
	Kernel Version: 3.10.0-1062.9.1.el7.x86_64
	CPU info: Intel(R) Xeon(R) CPU E5-2699 v3 @ 2.30GHz
	GCC Version: gcc (GCC) 4.8.5 20150623 (Red Hat 4.8.5-39)
	Clang Version: 3.4.2 (tags/RELEASE_34/dot2-final)
	x86_64-native-linuxapp-clang
	x86_64-native-linuxapp-gcc+debug
	x86_64-native-linuxapp-gcc+shared
	x86_64-native-linuxapp-gcc
	x86_64-native-linuxapp-icc


OS: UB1910-64
	Kernel Version: 5.3.0-18-generic
	CPU info: Intel(R) Xeon(R) CPU E5-2699 v3 @ 2.30GHz
	GCC Version: gcc (Ubuntu 9.2.1-9ubuntu2) 9.2.1 20191008
	Clang Version: 9.0.0-2 (tags/RELEASE_900/final)
	x86_64-native-linuxapp-gcc


OS: CENTOS80-64
	Kernel Version: 4.18.0-80.11.2.el8_0.x86_64
	CPU info: Intel(R) Xeon(R) CPU E5-2699 v3 @ 2.30GHz
	GCC Version: gcc (GCC) 8.2.1 20180905 (Red Hat 8.2.1-3)
	Clang Version: 7.0.1 (tags/RELEASE_701/final)
	x86_64-native-linuxapp-gcc


OS: UB1604-64
	Kernel Version: 4.4.0-170-generic
	CPU info: Intel(R) Xeon(R) CPU E5-2699 v3 @ 2.30GHz
	GCC Version: gcc (Ubuntu 5.4.0-6ubuntu1~16.04.12) 5.4.0 20160609
	Clang Version: 3.8.0-2ubuntu4 (tags/RELEASE_380/final)
	x86_64-native-linuxapp-clang
	x86_64-native-linuxapp-gcc


OS: FC31-64
	Kernel Version: 5.3.15-300.fc31.x86_64
	CPU info: Intel(R) Xeon(R) CPU E5-2699 v4 @ 2.20GHz
	GCC Version: gcc (GCC) 9.2.1 20190827 (Red Hat 9.2.1-1)
	Clang Version: 9.0.0 (Fedora 9.0.0-1.fc31)
	x86_64-native-linuxapp-gcc
	x86_64-native-linuxapp-clang


OS: RHEL80-64
	Kernel Version: 4.18.0-80.el8.x86_64
	CPU info: Intel(R) Xeon(R) CPU E5-2699 v4 @ 2.20GHz
	GCC Version: gcc (GCC) 8.2.1 20180905 (Red Hat 8.2.1-3)
	Clang Version: 6.0.1 (tags/RELEASE_601/final)
	x86_64-native-linuxapp-gcc


OS: FreeBSD1201-64
	Kernel Version: 12.1-RELEASE
	CPU info: Intel(R) Xeon(R) CPU E5-2699 v4 @ 2.20GHz (2194.95-MHz K8-class CPU)
	GCC Version: gcc (FreeBSD Ports Collection) 9.2.0
	Clang Version: 8.0.1 (tags/RELEASE_801/final 366581) (based on LLVM 8.0.1)
	x86_64-native-bsdapp-gcc
	x86_64-native-bsdapp-clang
	x86_64-native-bsdapp-gcc+debug
	x86_64-native-bsdapp-gcc+shared


OS: RHEL77-64
	Kernel Version: 3.10.0-1062.9.1.el7.x86_64
	CPU info: Intel(R) Xeon(R) CPU E5-2699 v4 @ 2.20GHz
	GCC Version: gcc (GCC) 4.8.5 20150623 (Red Hat 4.8.5-39)
	Clang Version: 3.4.2 (tags/RELEASE_34/dot2-final)
	x86_64-native-linuxapp-gcc


OS: SUSE15-64
	Kernel Version: 4.12.14-lp150.11-default
	CPU info: Intel(R) Xeon(R) CPU E5-2699 v4 @ 2.20GHz
	GCC Version: gcc (SUSE Linux) 7.3.1 20180323 [gcc-7-branch revision 258812]
	Clang Version: 5.0.1 (tags/RELEASE_501/final 312548)
	x86_64-native-linuxapp-gcc
	x86_64-native-linuxapp-clang


** Meson build **


OS: UB1804-64
	Kernel Version: 4.15.0-20-generic
	CPU info: Intel(R) Xeon(R) CPU E5-2699 v4 @ 2.20GHz
	GCC Version: gcc (Ubuntu 7.3.0-27ubuntu1~18.04) 7.3.0
	Clang Version: 6.0.0-1ubuntu2 (tags/RELEASE_600/final)
	x86_64-native-linuxapp-doc
	./build-gcc-static
	./build-gcc-shared
	./build-clang-static
	./build-clang-shared
	./build-x86-default


OS: UB1604-32
	Kernel Version: 4.4.0-131-generic
	CPU info: Intel(R) Xeon(R) CPU E5-2699 v4 @ 2.20GHz
	GCC Version: gcc (Ubuntu 5.4.0-6ubuntu1~16.04.11) 5.4.0 20160609
	Clang Version: 3.8.0-2ubuntu4 (tags/RELEASE_380/final)
	./build-gcc-static
	./build-gcc-shared
	./build-clang-static
	./build-clang-shared
	./build-x86-default


OS: CENTOS77-64
	Kernel Version: 3.10.0-1062.12.1.el7.x86_64
	CPU info: Intel(R) Xeon(R) CPU E5-2699 v4 @ 2.20GHz
	GCC Version: gcc (GCC) 4.8.5 20150623 (Red Hat 4.8.5-39)
	Clang Version: 3.4.2 (tags/RELEASE_34/dot2-final)
	./build-gcc-static
	./build-gcc-shared
	./build-clang-static
	./build-clang-shared
	./build-x86-default


OS: WIN10-64
	Kernel Version: N/A
	CPU info: N/A
	GCC Version: N/A
	Clang Version: Clang 8.0.0
	x86_64-windows-clang


OS: FC31-64
	Kernel Version: 5.4.18-200.fc31.x86_64
	CPU info: Intel(R) Xeon(R) CPU E5-2699 v4 @ 2.20GHz
	GCC Version: gcc (GCC) 9.2.1 20190827 (Red Hat 9.2.1-1)
	Clang Version: 9.0.0 (Fedora 9.0.0-1.fc31)
	./build-gcc-static
	./build-gcc-shared
	./build-clang-static
	./build-clang-shared
	./build-x86-default


OS: FreeBSD1201-64
	Kernel Version: 12.1-RELEASE
	CPU info: Intel(R) Xeon(R) CPU E5-2699 v4 @ 2.20GHz (2194.98-MHz K8-class CPU)
	GCC Version: gcc (FreeBSD Ports Collection) 9.2.0
	Clang Version: 8.0.1 (tags/RELEASE_801/final 366581) (based on LLVM 8.0.1)
	./build-gcc-static
	./build-gcc-shared
	./build-clang-static
	./build-clang-shared
	./build-x86-default


OS: SUSE15-64
	Kernel Version: 4.12.14-lp150.12.82-default
	CPU info: Intel(R) Xeon(R) CPU E5-2699 v4 @ 2.20GHz
	GCC Version: gcc (SUSE Linux) 7.4.1 20190905 [gcc-7-branch revision 275407]
	Clang Version: 5.0.1 (tags/RELEASE_501/final 312548)
	./build-gcc-static
	./build-gcc-shared
	./build-clang-static
	./build-clang-shared
	./build-x86-default


*Meson Build Failed #1:
OS: UB1604-32
Target:./build-gcc-static
[119/1972] Linking static target lib/librte_metrics.a.
[120/1972] Linking static target lib/librte_cmdline.a.
[121/1972] Compiling C object 'lib/76b5a35@@rte_hash@sta/librte_hash_rte_fbk_hash.c.o'.
[122/1972] Generating eal.exp_chk with a meson_exe.py custom command.
[123/1972] Linking target lib/librte_eal.so.20.0.2.
FAILED: lib/librte_eal.so.20.0.2 
clang  -o lib/librte_eal.so.20.0.2 'lib/76b5a35@@rte_eal@sta/librte_eal_common_eal_common_bus.c.o' 'lib/76b5a35@@rte_eal@sta/librte_eal_common_eal_common_cpuflags.c.o' 'lib/76b5a35@@rte_eal@sta/librte_eal_common_eal_common_class.c.o' 'lib/76b5a35@@rte_eal@sta/librte_eal_common_eal_common_devargs.c.o' 'lib/76b5a35@@rte_eal@sta/librte_eal_common_eal_common_dev.c.o' 'lib/76b5a35@@rte_eal@sta/librte_eal_common_eal_common_errno.c.o' 'lib/76b5a35@@rte_eal@sta/librte_eal_common_eal_common_fbarray.c.o' 'lib/76b5a35@@rte_eal@sta/librte_eal_common_eal_common_hexdump.c.o' 'lib/76b5a35@@rte_eal@sta/librte_eal_common_eal_common_hypervisor.c.o' 'lib/76b5a35@@rte_eal@sta/librte_eal_common_eal_common_launch.c.o' 'lib/76b5a35@@rte_eal@sta/librte_eal_common_eal_common_lcore.c.o' 'lib/76b5a35@@rte_eal@sta/librte_eal_common_eal_common_log.c.o' 'lib/76b5a35@@rte_eal@sta/librte_eal_common_eal_common_mcfg.c.o' 'lib/76b5a35@@rte_eal@sta/librte_eal_common_eal_common_memalloc.c.o' 'lib/76b5a35@@rte_eal@sta/librte_eal_common_eal_common_memory.c.o' 'lib/76b5a35@@rte_eal@sta/librte_eal_common_eal_common_memzone.c.o' 'lib/76b5a35@@rte_eal@sta/librte_eal_common_eal_common_options.c.o' 'lib/76b5a35@@rte_eal@sta/librte_eal_common_eal_common_proc.c.o' 'lib/76b5a35@@rte_eal@sta/librte_eal_common_eal_common_string_fns.c.o' 'lib/76b5a35@@rte_eal@sta/librte_eal_common_eal_common_tailqs.c.o' 'lib/76b5a35@@rte_eal@sta/librte_eal_common_eal_common_thread.c.o' 'lib/76b5a35@@rte_eal@sta/librte_eal_common_eal_common_timer.c.o' 'lib/76b5a35@@rte_eal@sta/librte_eal_common_eal_common_uuid.c.o' 'lib/76b5a35@@rte_eal@sta/librte_eal_common_hotplug_mp.c.o' 'lib/76b5a35@@rte_eal@sta/librte_eal_common_malloc_elem.c.o' 'lib/76b5a35@@rte_eal@sta/librte_eal_common_malloc_heap.c.o' 'lib/76b5a35@@rte_eal@sta/librte_eal_common_malloc_mp.c.o' 'lib/76b5a35@@rte_eal@sta/librte_eal_common_rte_keepalive.c.o' 'lib/76b5a35@@rte_eal@sta/librte_eal_common_rte_malloc.c.o' 'lib/76b5a35@@rte_eal@sta/librte_eal_common_rte_option.c.o' 'lib/76b5a35@@rte_eal@sta/librte_eal_common_rte_random.c.o' 'lib/76b5a35@@rte_eal@sta/librte_eal_common_rte_reciprocal.c.o' 'lib/76b5a35@@rte_eal@sta/librte_eal_common_rte_service.c.o' 'lib/76b5a35@@rte_eal@sta/librte_eal_common_arch_x86_rte_spinlock.c.o' 'lib/76b5a35@@rte_eal@sta/librte_eal_common_arch_x86_rte_cpuflags.c.o' 'lib/76b5a35@@rte_eal@sta/librte_eal_common_arch_x86_rte_cycles.c.o' 'lib/76b5a35@@rte_eal@sta/librte_eal_common_arch_x86_rte_hypervisor.c.o' 'lib/76b5a35@@rte_eal@sta/librte_eal_linux_eal_eal_alarm.c.o' 'lib/76b5a35@@rte_eal@sta/librte_eal_linux_eal_eal_cpuflags.c.o' 'lib/76b5a35@@rte_eal@sta/librte_eal_linux_eal_eal_debug.c.o' 'lib/76b5a35@@rte_eal@sta/librte_eal_linux_eal_eal_hugepage_info.c.o' 'lib/76b5a35@@rte_eal@sta/librte_eal_linux_eal_eal_interrupts.c.o' 'lib/76b5a35@@rte_eal@sta/librte_eal_linux_eal_eal_memalloc.c.o' 'lib/76b5a35@@rte_eal@sta/librte_eal_linux_eal_eal_lcore.c.o' 'lib/76b5a35@@rte_eal@sta/librte_eal_linux_eal_eal_log.c.o' 'lib/76b5a35@@rte_eal@sta/librte_eal_linux_eal_eal_thread.c.o' 'lib/76b5a35@@rte_eal@sta/librte_eal_linux_eal_eal_timer.c.o' 'lib/76b5a35@@rte_eal@sta/librte_eal_linux_eal_eal_vfio.c.o' 'lib/76b5a35@@rte_eal@sta/librte_eal_linux_eal_eal_vfio_mp_sync.c.o' 'lib/76b5a35@@rte_eal@sta/librte_eal_linux_eal_eal.c.o' 'lib/76b5a35@@rte_eal@sta/librte_eal_linux_eal_eal_memory.c.o' 'lib/76b5a35@@rte_eal@sta/librte_eal_linux_eal_eal_dev.c.o' -Wl,--no-undefined -Wl,--as-needed -shared -fPIC -Wl,--start-group -Wl,-soname,librte_eal.so.20.0 -Wl,--no-as-needed -pthread -lm -ldl -lnuma lib/librte_kvargs.so.20.0.2 -Wl,--end-group -Wl,--version-script=/root/UB1604-32_K4.4.0_GCC5.4.0/i686-native-linuxapp-gcc/505f47253e5e41e7951d916083a44f84/dpdk/lib/librte_eal/rte_eal_version.map '-Wl,-rpath,$ORIGIN/' -Wl,-rpath-link,/root/UB1604-32_K4.4.0_GCC5.4.0/i686-native-linuxapp-gcc/505f47253e5e41e7951d916083a44f84/dpdk/build-clang-static/lib 
lib/76b5a35@@rte_eal@sta/librte_eal_common_rte_service.c.o: In function `service_update':
/root/UB1604-32_K4.4.0_GCC5.4.0/i686-native-linuxapp-gcc/505f47253e5e41e7951d916083a44f84/dpdk/build-clang-static/../lib/librte_eal/common/rte_service.c:575: undefined reference to `__atomic_load_8'
/root/UB1604-32_K4.4.0_GCC5.4.0/i686-native-linuxapp-gcc/505f47253e5e41e7951d916083a44f84/dpdk/build-clang-static/../lib/librte_eal/common/rte_service.c:575: undefined reference to `__atomic_load_8'
clang: error: linker command failed with exit code 1 (use -v to see invocation)
[124/1972] Generating cmdline.exp_chk with a meson_exe.py custom command.
[125/1972] Generating metrics.exp_chk with a meson_exe.py custom command.
[126/1972] Compiling C object 'lib/76b5a35@@rte_ethdev@sta/librte_ethdev_rte_ethdev.c.o'.
[127/1972] Compiling C object 'lib/76b5a35@@rte_cryptodev@sta/librte_cryptodev_rte_cryptodev.c.o'.
[128/1972] Compiling C object 'lib/76b5a35@@rte_hash@sta/librte_hash_rte_cuckoo_hash.c.o'.
ninja: build stopped: subcommand failed.
meson  --werror -Dexamples=all --buildtype=debugoptimized --default-library=shared /root/UB1604-32_K4.4.0_GCC5.4.0/i686-native-linuxapp-gcc/505f47253e5e41e7951d916083a44f84/dpdk/devtools/.. ./build-clang-shared
The Meson build system
Version: 0.50.1
Source dir: /root/UB1604-32_K4.4.0_GCC5.4.0/i686-native-linuxapp-gcc/505f47253e5e41e7951d916083a44f84/dpdk
Build dir: /root/UB1604-32_K4.4.0_GCC5.4.0/i686-native-linuxapp-gcc/505f47253e5e41e7951d916083a44f84/dpdk/build-clang-shared
--
[126/2000] Compiling C object 'lib/76b5a35@@rte_cryptodev@sta/librte_cryptodev_rte_cryptodev.c.o'.
[127/2000] Linking static target lib/librte_ethdev.a.
[128/2000] Generating eal.exp_chk with a meson_exe.py custom command.
[129/2000] Compiling C object 'lib/76b5a35@@rte_distributor@sta/librte_distributor_rte_distributor.c.o'.
[130/2000] Linking target lib/librte_eal.so.20.0.2.
FAILED: lib/librte_eal.so.20.0.2 
clang  -o lib/librte_eal.so.20.0.2 'lib/76b5a35@@rte_eal@sta/librte_eal_common_eal_common_bus.c.o' 'lib/76b5a35@@rte_eal@sta/librte_eal_common_eal_common_cpuflags.c.o' 'lib/76b5a35@@rte_eal@sta/librte_eal_common_eal_common_class.c.o' 'lib/76b5a35@@rte_eal@sta/librte_eal_common_eal_common_devargs.c.o' 'lib/76b5a35@@rte_eal@sta/librte_eal_common_eal_common_dev.c.o' 'lib/76b5a35@@rte_eal@sta/librte_eal_common_eal_common_errno.c.o' 'lib/76b5a35@@rte_eal@sta/librte_eal_common_eal_common_fbarray.c.o' 'lib/76b5a35@@rte_eal@sta/librte_eal_common_eal_common_hexdump.c.o' 'lib/76b5a35@@rte_eal@sta/librte_eal_common_eal_common_hypervisor.c.o' 'lib/76b5a35@@rte_eal@sta/librte_eal_common_eal_common_launch.c.o' 'lib/76b5a35@@rte_eal@sta/librte_eal_common_eal_common_lcore.c.o' 'lib/76b5a35@@rte_eal@sta/librte_eal_common_eal_common_log.c.o' 'lib/76b5a35@@rte_eal@sta/librte_eal_common_eal_common_mcfg.c.o' 'lib/76b5a35@@rte_eal@sta/librte_eal_common_eal_common_memalloc.c.o' 'lib/76b5a35@@rte_eal@sta/librte_eal_common_eal_common_memory.c.o' 'lib/76b5a35@@rte_eal@sta/librte_eal_common_eal_common_memzone.c.o' 'lib/76b5a35@@rte_eal@sta/librte_eal_common_eal_common_options.c.o' 'lib/76b5a35@@rte_eal@sta/librte_eal_common_eal_common_proc.c.o' 'lib/76b5a35@@rte_eal@sta/librte_eal_common_eal_common_string_fns.c.o' 'lib/76b5a35@@rte_eal@sta/librte_eal_common_eal_common_tailqs.c.o' 'lib/76b5a35@@rte_eal@sta/librte_eal_common_eal_common_thread.c.o' 'lib/76b5a35@@rte_eal@sta/librte_eal_common_eal_common_timer.c.o' 'lib/76b5a35@@rte_eal@sta/librte_eal_common_eal_common_uuid.c.o' 'lib/76b5a35@@rte_eal@sta/librte_eal_common_hotplug_mp.c.o' 'lib/76b5a35@@rte_eal@sta/librte_eal_common_malloc_elem.c.o' 'lib/76b5a35@@rte_eal@sta/librte_eal_common_malloc_heap.c.o' 'lib/76b5a35@@rte_eal@sta/librte_eal_common_malloc_mp.c.o' 'lib/76b5a35@@rte_eal@sta/librte_eal_common_rte_keepalive.c.o' 'lib/76b5a35@@rte_eal@sta/librte_eal_common_rte_malloc.c.o' 'lib/76b5a35@@rte_eal@sta/librte_eal_common_rte_option.c.o' 'lib/76b5a35@@rte_eal@sta/librte_eal_common_rte_random.c.o' 'lib/76b5a35@@rte_eal@sta/librte_eal_common_rte_reciprocal.c.o' 'lib/76b5a35@@rte_eal@sta/librte_eal_common_rte_service.c.o' 'lib/76b5a35@@rte_eal@sta/librte_eal_common_arch_x86_rte_spinlock.c.o' 'lib/76b5a35@@rte_eal@sta/librte_eal_common_arch_x86_rte_cpuflags.c.o' 'lib/76b5a35@@rte_eal@sta/librte_eal_common_arch_x86_rte_cycles.c.o' 'lib/76b5a35@@rte_eal@sta/librte_eal_common_arch_x86_rte_hypervisor.c.o' 'lib/76b5a35@@rte_eal@sta/librte_eal_linux_eal_eal_alarm.c.o' 'lib/76b5a35@@rte_eal@sta/librte_eal_linux_eal_eal_cpuflags.c.o' 'lib/76b5a35@@rte_eal@sta/librte_eal_linux_eal_eal_debug.c.o' 'lib/76b5a35@@rte_eal@sta/librte_eal_linux_eal_eal_hugepage_info.c.o' 'lib/76b5a35@@rte_eal@sta/librte_eal_linux_eal_eal_interrupts.c.o' 'lib/76b5a35@@rte_eal@sta/librte_eal_linux_eal_eal_memalloc.c.o' 'lib/76b5a35@@rte_eal@sta/librte_eal_linux_eal_eal_lcore.c.o' 'lib/76b5a35@@rte_eal@sta/librte_eal_linux_eal_eal_log.c.o' 'lib/76b5a35@@rte_eal@sta/librte_eal_linux_eal_eal_thread.c.o' 'lib/76b5a35@@rte_eal@sta/librte_eal_linux_eal_eal_timer.c.o' 'lib/76b5a35@@rte_eal@sta/librte_eal_linux_eal_eal_vfio.c.o' 'lib/76b5a35@@rte_eal@sta/librte_eal_linux_eal_eal_vfio_mp_sync.c.o' 'lib/76b5a35@@rte_eal@sta/librte_eal_linux_eal_eal.c.o' 'lib/76b5a35@@rte_eal@sta/librte_eal_linux_eal_eal_memory.c.o' 'lib/76b5a35@@rte_eal@sta/librte_eal_linux_eal_eal_dev.c.o' -Wl,--no-undefined -Wl,--as-needed -shared -fPIC -Wl,--start-group -Wl,-soname,librte_eal.so.20.0 -Wl,--no-as-needed -pthread -lm -ldl -lnuma lib/librte_kvargs.so.20.0.2 -Wl,--end-group -Wl,--version-script=/root/UB1604-32_K4.4.0_GCC5.4.0/i686-native-linuxapp-gcc/505f47253e5e41e7951d916083a44f84/dpdk/lib/librte_eal/rte_eal_version.map '-Wl,-rpath,$ORIGIN/' -Wl,-rpath-link,/root/UB1604-32_K4.4.0_GCC5.4.0/i686-native-linuxapp-gcc/505f47253e5e41e7951d916083a44f84/dpdk/build-clang-shared/lib 
lib/76b5a35@@rte_eal@sta/librte_eal_common_rte_service.c.o: In function `service_update':
/root/UB1604-32_K4.4.0_GCC5.4.0/i686-native-linuxapp-gcc/505f47253e5e41e7951d916083a44f84/dpdk/build-clang-shared/../lib/librte_eal/common/rte_service.c:575: undefined reference to `__atomic_load_8'
/root/UB1604-32_K4.4.0_GCC5.4.0/i686-native-linuxapp-gcc/505f47253e5e41e7951d916083a44f84/dpdk/build-clang-shared/../lib/librte_eal/common/rte_service.c:575: undefined reference to `__atomic_load_8'
clang: error: linker command failed with exit code 1 (use -v to see invocation)
[131/2000] Generating timer_def with a custom command.
[132/2000] Compiling C object 'lib/76b5a35@@rte_timer@sta/librte_timer_rte_timer.c.o'.
[133/2000] Generating ethdev.exp_chk with a meson_exe.py custom command.
[134/2000] Compiling C object 'lib/76b5a35@@rte_acl@sta/librte_acl_acl_bld.c.o'.
[135/2000] Compiling C object 'lib/76b5a35@@rte_hash@sta/librte_hash_rte_cuckoo_hash.c.o'.
ninja: build stopped: subcommand failed.
meson  --werror -Dexamples=all --buildtype=debugoptimized -Dlibdir=lib -Dmachine=nehalem --default-library=shared /root/UB1604-32_K4.4.0_GCC5.4.0/i686-native-linuxapp-gcc/505f47253e5e41e7951d916083a44f84/dpdk/devtools/.. ./build-x86-default
The Meson build system
Version: 0.50.1
Source dir: /root/UB1604-32_K4.4.0_GCC5.4.0/i686-native-linuxapp-gcc/505f47253e5e41e7951d916083a44f84/dpdk
Build dir: /root/UB1604-32_K4.4.0_GCC5.4.0/i686-native-linuxapp-gcc/505f47253e5e41e7951d916083a44f84/dpdk/build-x86-default

DPDK STV team

^ permalink raw reply	[flat|nested] only message in thread

only message in thread, other threads:[~2020-03-12  8:46 UTC | newest]

Thread overview: (only message) (download: mbox.gz / follow: Atom feed)
-- links below jump to the message on this page --
2020-03-12  8:46 [dpdk-test-report] |FAILURE| pw66568[v2, 06/10] service: remove redundant code sys_stv

automatic DPDK test reports

This inbox may be cloned and mirrored by anyone:

	git clone --mirror https://inbox.dpdk.org/test-report/0 test-report/git/0.git

	# If you have public-inbox 1.1+ installed, you may
	# initialize and index your mirror using the following commands:
	public-inbox-init -V2 test-report test-report/ https://inbox.dpdk.org/test-report \
		test-report@dpdk.org
	public-inbox-index test-report

Example config snippet for mirrors.
Newsgroup available over NNTP:
	nntp://inbox.dpdk.org/inbox.dpdk.test-report


AGPL code for this site: git clone https://public-inbox.org/public-inbox.git