automatic DPDK test reports
 help / color / mirror / Atom feed
* [dpdk-test-report] |FAILURE| pw(93898) sid(17238) [v2, 20/20] net/sfc: support flow API query for count actions
@ 2021-06-10 10:37 sys_stv
  0 siblings, 0 replies; 3+ messages in thread
From: sys_stv @ 2021-06-10 10:37 UTC (permalink / raw)
  To: test-report

[-- Attachment #1: Type: text/plain, Size: 64196 bytes --]


Test-Label: Intel-compilation
Test-Status: FAILURE
http://dpdk.org/patch/93898

_Compilation issues_

Submitter: Andrew Rybchenko <Andrew.Rybchenko@oktetlabs.ru>
Date: 2021-06-04 14:24:14
Reply_mail: 20210604142414.283611-21-andrew.rybchenko@oktetlabs.ru

DPDK git baseline: Repo:dpdk, CommitID: 469d5c02159ddf0746ddbb9822c034556422515f


Meson Build Summary: 22 Builds Done, 2 Successful, 20 Failures, 0 Blocked

+------------------+------------+--------------+------------+------------+-----------+----------+
| os               | gcc-static | clang-static | icc-static | gcc-shared | gcc-debug | document |
+------------------+------------+--------------+------------+------------+-----------+----------+
| UB2004-64        | fail       | fail         | fail       |            |           | fail     |
| RHEL83-64        | fail       |              |            |            |           |          |
| FC34-64          | fail       | fail         |            |            |           |          |
| CentOsStream8-64 | fail       |              |            |            |           |          |
| UB2104-64        | fail       |              |            |            |           |          |
| WIN10-64         |            | pass         |            |            |           |          |
| UB2004-32        | pass       |              |            |            |           |          |
| CENTOS83-64      | fail       | fail         | fail       | fail       | fail      |          |
| FreeBSD1201-64   | fail       | fail         |            | fail       | fail      |          |
| SUSE15-64        | fail       | fail         |            |            |           |          |
+------------------+------------+--------------+------------+------------+-----------+----------+
Test environment and configuration as below:


OS: UB2004-64
	Kernel Version: 5.8.0-48-generic
	GCC Version: gcc (Ubuntu 10.2.0-5ubuntu1~20.04) 10.2.0
	Clang Version: 10.0.0-4ubuntu1
	x86_64-native-linuxapp-clang
	x86_64-native-linuxapp-gcc
	x86_64-native-linuxapp-icc
	x86_64-native-linuxapp-doc

OS: RHEL83-64
	Kernel Version: 4.18.0-240.el8.x86_64
	GCC Version: gcc (GCC) 8.3.1 20191121 (Red Hat 8.3.1-5)
	Clang Version: 10.0.1 (Red Hat 10.0.1-1.module+el8.3.0+7459+90c24896)
	x86_64-native-linuxapp-gcc

OS: FC34-64
	Kernel Version: 5.11.15-300.fc34.x86_64
	GCC Version: gcc (GCC) 11.0.1 20210324 (Red Hat 11.0.1-0)
	Clang Version: 12.0.0 (Fedora 12.0.0-0.3.rc1.fc34)
	x86_64-native-linuxapp-gcc
	x86_64-native-linuxapp-clang

OS: CentOsStream8-64
	Kernel Version: 4.18.0-257.el8.x86_64
	GCC Version: gcc (GCC) 8.4.1 20200928 (Red Hat 8.4.1-1)
	Clang Version: 11.0.0 (Red Hat 11.0.0-0.2.rc2.module_el8.4.0+533+50191577)
	x86_64-native-linuxapp-gcc

OS: UB2104-64
	Kernel Version: 5.11.0-16-generic
	GCC Version: gcc (Ubuntu 10.3.0-1ubuntu1) 10.3.0
	Clang Version: 12.0.0-1ubuntu1
	x86_64-native-linuxapp-gcc

OS: WIN10-64
	Kernel Version: N/A
	GCC Version: N/A
	Clang Version: Clang 8.0.0
	x86_64-windows-clang

OS: UB2004-32
	Kernel Version: 5.8.0-48-generic
	GCC Version: gcc (Ubuntu 10.2.0-5ubuntu1~20.04) 10.2.0
	Clang Version: 10.0.0-4ubuntu1
	i686-native-linuxapp-gcc

OS: CENTOS83-64
	Kernel Version: 4.18.0-240.1.1.el8_3.x86_64
	GCC Version: gcc (GCC) 8.3.1 20191121 (Red Hat 8.3.1-5)
	Clang Version: 10.0.1 (Red Hat 10.0.1-1.module_el8.3.0+467+cb298d5b)
	x86_64-native-linuxapp-gcc
	x86_64-native-linuxapp-clang
	x86_64-native-linuxapp-icc
	x86_64-native-linuxapp-gcc+shared
	x86_64-native-linuxapp-gcc+debug

OS: FreeBSD1201-64
	Kernel Version: 12.1-RELEASE
	GCC Version: gcc (FreeBSD Ports Collection) 9.2.0
	Clang Version: 8.0.1 (tags/RELEASE_801/final 366581) (based on LLVM 8.0.1)
	x86_64-native-bsdapp-gcc
	x86_64-native-bsdapp-clang
	x86_64-native-bsdapp-gcc+shared
	x86_64-native-bsdapp-gcc+debug

OS: SUSE15-64
	Kernel Version: 5.3.18-lp152.57-default
	GCC Version: gcc (SUSE Linux) 7.5.0
	Clang Version: 9.0.1
	x86_64-native-linuxapp-clang
	x86_64-native-linuxapp-gcc



*Build Failed #1:
OS: CENTOS83-64
Target: x86_64-native-linuxapp-gcc
FAILED: drivers/libtmp_rte_net_sfc.a.p/net_sfc_sfc_flow.c.o 
gcc -Idrivers/libtmp_rte_net_sfc.a.p -Idrivers -I../drivers -Idrivers/net/sfc -I../drivers/net/sfc -Ilib/ethdev -I../lib/ethdev -I. -I.. -Iconfig -I../config -Ilib/eal/include -I../lib/eal/include -Ilib/eal/linux/include -I../lib/eal/linux/include -Ilib/eal/x86/include -I../lib/eal/x86/include -Ilib/eal/common -I../lib/eal/common -Ilib/eal -I../lib/eal -Ilib/kvargs -I../lib/kvargs -Ilib/metrics -I../lib/metrics -Ilib/telemetry -I../lib/telemetry -Ilib/net -I../lib/net -Ilib/mbuf -I../lib/mbuf -Ilib/mempool -I../lib/mempool -Ilib/ring -I../lib/ring -Ilib/meter -I../lib/meter -Idrivers/bus/pci -I../drivers/bus/pci -I../drivers/bus/pci/linux -Ilib/pci -I../lib/pci -Idrivers/bus/vdev -I../drivers/bus/vdev -Idrivers/common/sfc_efx -I../drivers/common/sfc_efx -Idrivers/common/sfc_efx/base -I../drivers/common/sfc_efx/base -fdiagnostics-color=always -pipe -D_FILE_OFFSET_BITS=64 -Wall -Winvalid-pch -Werror -O3 -include rte_config.h -Wextra -Wcast-qual -Wdeprecated -Wformat -Wformat-nonliteral -Wformat-security -Wmissing-declarations -Wmissing-prototypes -Wnested-externs -Wold-style-definition -Wpointer-arith -Wsign-compare -Wstrict-prototypes -Wundef -Wwrite-strings -Wno-packed-not-aligned -Wno-missing-field-initializers -D_GNU_SOURCE -fPIC -march=native -DALLOW_EXPERIMENTAL_API -DALLOW_INTERNAL_API -Wno-format-truncation -Wno-strict-aliasing -Wdisabled-optimization -Waggregate-return -Wbad-function-cast -DRTE_LOG_DEFAULT_LOGTYPE=pmd.net.sfc -MD -MQ drivers/libtmp_rte_net_sfc.a.p/net_sfc_sfc_flow.c.o -MF drivers/libtmp_rte_net_sfc.a.p/net_sfc_sfc_flow.c.o.d -o drivers/libtmp_rte_net_sfc.a.p/net_sfc_sfc_flow.c.o -c ../drivers/net/sfc/sfc_flow.c
../drivers/net/sfc/sfc_flow.c: In function ‘sfc_flow_query’:
../drivers/net/sfc/sfc_flow.c:2815:19: error: ‘SFC_ETHDEV_STARTED’ undeclared (first use in this function); did you mean ‘SFC_ADAPTER_STARTED’?
  if (sa->state != SFC_ETHDEV_STARTED) {
                   ^~~~~~~~~~~~~~~~~~
                   SFC_ADAPTER_STARTED
../drivers/net/sfc/sfc_flow.c:2815:19: note: each undeclared identifier is reported only once for each function it appears in
[1630/2751] Linking static target drivers/libtmp_rte_net_qede.a
[1631/2751] Compiling C object drivers/libtmp_rte_net_sfc.a.p/net_sfc_sfc_switch.c.o
[1632/2751] Compiling C object drivers/libtmp_rte_net_sfc.a.p/net_sfc_sfc_filter.c.o
[1633/2751] Compiling C object drivers/libtmp_rte_net_sfc.a.p/net_sfc_sfc_mae_counter.c.o
[1634/2751] Compiling C object drivers/libtmp_rte_net_sfc.a.p/net_sfc_sfc_rx.c.o
[1635/2751] Compiling C object drivers/libtmp_rte_net_sfc.a.p/net_sfc_sfc_ef10_essb_rx.c.o
[1636/2751] Compiling C object drivers/libtmp_rte_net_sfc.a.p/net_sfc_sfc_mae.c.o
[1637/2751] Compiling C object drivers/libtmp_rte_net_sfc.a.p/net_sfc_sfc_ef10_rx.c.o
[1638/2751] Compiling C object drivers/libtmp_rte_net_sfc.a.p/net_sfc_sfc_ef10_tx.c.o
[1639/2751] Compiling C object drivers/libtmp_rte_net_octeontx2.a.p/net_octeontx2_otx2_tx.c.o
[1640/2751] Compiling C object drivers/libtmp_rte_net_octeontx2.a.p/net_octeontx2_otx2_rx.c.o
ninja: build stopped




*Build Failed #2:
OS: CENTOS83-64
Target: x86_64-native-linuxapp-clang
FAILED: drivers/libtmp_rte_net_sfc.a.p/net_sfc_sfc_flow.c.o 
clang -Idrivers/libtmp_rte_net_sfc.a.p -Idrivers -I../drivers -Idrivers/net/sfc -I../drivers/net/sfc -Ilib/ethdev -I../lib/ethdev -I. -I.. -Iconfig -I../config -Ilib/eal/include -I../lib/eal/include -Ilib/eal/linux/include -I../lib/eal/linux/include -Ilib/eal/x86/include -I../lib/eal/x86/include -Ilib/eal/common -I../lib/eal/common -Ilib/eal -I../lib/eal -Ilib/kvargs -I../lib/kvargs -Ilib/metrics -I../lib/metrics -Ilib/telemetry -I../lib/telemetry -Ilib/net -I../lib/net -Ilib/mbuf -I../lib/mbuf -Ilib/mempool -I../lib/mempool -Ilib/ring -I../lib/ring -Ilib/meter -I../lib/meter -Idrivers/bus/pci -I../drivers/bus/pci -I../drivers/bus/pci/linux -Ilib/pci -I../lib/pci -Idrivers/bus/vdev -I../drivers/bus/vdev -Idrivers/common/sfc_efx -I../drivers/common/sfc_efx -Idrivers/common/sfc_efx/base -I../drivers/common/sfc_efx/base -Xclang -fcolor-diagnostics -pipe -D_FILE_OFFSET_BITS=64 -Wall -Winvalid-pch -Werror -O3 -include rte_config.h -Wextra -Wcast-qual -Wdeprecated -Wformat -Wformat-nonliteral -Wformat-security -Wmissing-declarations -Wmissing-prototypes -Wnested-externs -Wold-style-definition -Wpointer-arith -Wsign-compare -Wstrict-prototypes -Wundef -Wwrite-strings -Wno-address-of-packed-member -Wno-missing-field-initializers -D_GNU_SOURCE -fPIC -march=native -DALLOW_EXPERIMENTAL_API -DALLOW_INTERNAL_API -Wno-strict-aliasing -Wdisabled-optimization -Waggregate-return -Wbad-function-cast -DRTE_LOG_DEFAULT_LOGTYPE=pmd.net.sfc -MD -MQ drivers/libtmp_rte_net_sfc.a.p/net_sfc_sfc_flow.c.o -MF drivers/libtmp_rte_net_sfc.a.p/net_sfc_sfc_flow.c.o.d -o drivers/libtmp_rte_net_sfc.a.p/net_sfc_sfc_flow.c.o -c ../drivers/net/sfc/sfc_flow.c
../drivers/net/sfc/sfc_flow.c:2815:19: error: use of undeclared identifier 'SFC_ETHDEV_STARTED'; did you mean 'SFC_ADAPTER_STARTED'?
        if (sa->state != SFC_ETHDEV_STARTED) {
                         ^~~~~~~~~~~~~~~~~~
                         SFC_ADAPTER_STARTED
../drivers/net/sfc/sfc.h:83:2: note: 'SFC_ADAPTER_STARTED' declared here
        SFC_ADAPTER_STARTED,
        ^
1 error generated.
[1648/2754] Compiling C object drivers/libtmp_rte_net_sfc.a.p/net_sfc_sfc_ef10_rx.c.o
[1649/2754] Compiling C object drivers/libtmp_rte_net_softnic.a.p/net_softnic_parser.c.o
[1650/2754] Compiling C object drivers/libtmp_rte_net_sfc.a.p/net_sfc_sfc_ef100_rx.c.o
[1651/2754] Compiling C object drivers/libtmp_rte_net_sfc.a.p/net_sfc_sfc_ef10_essb_rx.c.o
[1652/2754] Compiling C object drivers/libtmp_rte_net_sfc.a.p/net_sfc_sfc_ef100_tx.c.o
[1653/2754] Compiling C object drivers/libtmp_rte_net_sfc.a.p/net_sfc_sfc_ef10_tx.c.o
[1654/2754] Compiling C object drivers/libtmp_rte_net_softnic.a.p/net_softnic_rte_eth_softnic.c.o
[1655/2754] Compiling C object drivers/libtmp_rte_net_softnic.a.p/net_softnic_rte_eth_softnic_cli.c.o
[1656/2754] Compiling C object drivers/libtmp_rte_net_octeontx2.a.p/net_octeontx2_otx2_rx.c.o
ninja: build stopped




*Build Failed #3:
OS: CENTOS83-64
Target: x86_64-native-linuxapp-icc
FAILED: drivers/libtmp_rte_net_sfc.a.p/net_sfc_sfc_flow.c.o 
icc -Idrivers/libtmp_rte_net_sfc.a.p -Idrivers -I../drivers -Idrivers/net/sfc -I../drivers/net/sfc -Ilib/ethdev -I../lib/ethdev -I. -I.. -Iconfig -I../config -Ilib/eal/include -I../lib/eal/include -Ilib/eal/linux/include -I../lib/eal/linux/include -Ilib/eal/x86/include -I../lib/eal/x86/include -Ilib/eal/common -I../lib/eal/common -Ilib/eal -I../lib/eal -Ilib/kvargs -I../lib/kvargs -Ilib/metrics -I../lib/metrics -Ilib/telemetry -I../lib/telemetry -Ilib/net -I../lib/net -Ilib/mbuf -I../lib/mbuf -Ilib/mempool -I../lib/mempool -Ilib/ring -I../lib/ring -Ilib/meter -I../lib/meter -Idrivers/bus/pci -I../drivers/bus/pci -I../drivers/bus/pci/linux -Ilib/pci -I../lib/pci -Idrivers/bus/vdev -I../drivers/bus/vdev -Idrivers/common/sfc_efx -I../drivers/common/sfc_efx -Idrivers/common/sfc_efx/base -I../drivers/common/sfc_efx/base -pipe -D_FILE_OFFSET_BITS=64 -Wall -w3 -diag-disable:remark -Werror -O3 -include rte_config.h -Wextra -Wcast-qual -Wdeprecated -Wformat -Wformat-security -Wmissing-declarations -Wmissing-prototypes -Wold-style-definition -Wpointer-arith -Wsign-compare -Wstrict-prototypes -Wundef -Wwrite-strings -Wno-missing-field-initializers -diag-disable=181 -diag-disable=188 -diag-disable=2203 -diag-disable=2279 -diag-disable=2557 -diag-disable=3179 -diag-disable=3656 -D_GNU_SOURCE -fPIC -march=native -DALLOW_EXPERIMENTAL_API -DALLOW_INTERNAL_API -Wno-strict-aliasing -Wdisabled-optimization -DRTE_LOG_DEFAULT_LOGTYPE=pmd.net.sfc -MD -MQ drivers/libtmp_rte_net_sfc.a.p/net_sfc_sfc_flow.c.o -MF drivers/libtmp_rte_net_sfc.a.p/net_sfc_sfc_flow.c.o.d -o drivers/libtmp_rte_net_sfc.a.p/net_sfc_sfc_flow.c.o -c ../drivers/net/sfc/sfc_flow.c
../drivers/net/sfc/sfc_flow.c(2815): error: identifier "SFC_ETHDEV_STARTED" is undefined
  	if (sa->state != SFC_ETHDEV_STARTED) {
  	                 ^

compilation aborted for ../drivers/net/sfc/sfc_flow.c (code 2)
[1619/2751] Compiling C object drivers/libtmp_rte_net_sfc.a.p/net_sfc_sfc_tso.c.o
[1620/2751] Compiling C object drivers/librte_net_ring.so.21.3.p/meson-generated_.._rte_net_ring.pmd.c.o
[1621/2751] Compiling C object drivers/libtmp_rte_net_sfc.a.p/net_sfc_sfc_rx.c.o
[1622/2751] Compiling C object drivers/libtmp_rte_net_qede.a.p/net_qede_qede_debug.c.o
[1623/2751] Compiling C object drivers/libtmp_rte_net_sfc.a.p/net_sfc_sfc_tx.c.o
[1624/2751] Compiling C object drivers/libtmp_rte_net_sfc.a.p/net_sfc_sfc_mae_counter.c.o
[1625/2751] Compiling C object drivers/libtmp_rte_net_sfc.a.p/net_sfc_sfc_mae.c.o
[1626/2751] Compiling C object drivers/libtmp_rte_net_pcap.a.p/net_pcap_pcap_ethdev.c.o
[1627/2751] Compiling C object drivers/libtmp_rte_net_qede.a.p/net_qede_qede_rxtx.c.o
[1628/2751] Compiling C object drivers/libtmp_rte_net_octeontx2.a.p/net_octeontx2_otx2_rx.c.o
[1629/2751] Compiling C object drivers/libtmp_rte_net_octeontx2.a.p/net_octeontx2_otx2_tx.c.o
ninja: build stopped




*Build Failed #4:
OS: CENTOS83-64
Target: x86_64-native-linuxapp-gcc+shared
FAILED: drivers/libtmp_rte_net_sfc.a.p/net_sfc_sfc_flow.c.o 
gcc -Idrivers/libtmp_rte_net_sfc.a.p -Idrivers -I../drivers -Idrivers/net/sfc -I../drivers/net/sfc -Ilib/ethdev -I../lib/ethdev -I. -I.. -Iconfig -I../config -Ilib/eal/include -I../lib/eal/include -Ilib/eal/linux/include -I../lib/eal/linux/include -Ilib/eal/x86/include -I../lib/eal/x86/include -Ilib/eal/common -I../lib/eal/common -Ilib/eal -I../lib/eal -Ilib/kvargs -I../lib/kvargs -Ilib/metrics -I../lib/metrics -Ilib/telemetry -I../lib/telemetry -Ilib/net -I../lib/net -Ilib/mbuf -I../lib/mbuf -Ilib/mempool -I../lib/mempool -Ilib/ring -I../lib/ring -Ilib/meter -I../lib/meter -Idrivers/bus/pci -I../drivers/bus/pci -I../drivers/bus/pci/linux -Ilib/pci -I../lib/pci -Idrivers/bus/vdev -I../drivers/bus/vdev -Idrivers/common/sfc_efx -I../drivers/common/sfc_efx -Idrivers/common/sfc_efx/base -I../drivers/common/sfc_efx/base -fdiagnostics-color=always -pipe -D_FILE_OFFSET_BITS=64 -Wall -Winvalid-pch -Werror -O3 -include rte_config.h -Wextra -Wcast-qual -Wdeprecated -Wformat -Wformat-nonliteral -Wformat-security -Wmissing-declarations -Wmissing-prototypes -Wnested-externs -Wold-style-definition -Wpointer-arith -Wsign-compare -Wstrict-prototypes -Wundef -Wwrite-strings -Wno-packed-not-aligned -Wno-missing-field-initializers -D_GNU_SOURCE -fPIC -march=native -DALLOW_EXPERIMENTAL_API -DALLOW_INTERNAL_API -Wno-format-truncation -Wno-strict-aliasing -Wdisabled-optimization -Waggregate-return -Wbad-function-cast -DRTE_LOG_DEFAULT_LOGTYPE=pmd.net.sfc -MD -MQ drivers/libtmp_rte_net_sfc.a.p/net_sfc_sfc_flow.c.o -MF drivers/libtmp_rte_net_sfc.a.p/net_sfc_sfc_flow.c.o.d -o drivers/libtmp_rte_net_sfc.a.p/net_sfc_sfc_flow.c.o -c ../drivers/net/sfc/sfc_flow.c
../drivers/net/sfc/sfc_flow.c: In function ‘sfc_flow_query’:
../drivers/net/sfc/sfc_flow.c:2815:19: error: ‘SFC_ETHDEV_STARTED’ undeclared (first use in this function); did you mean ‘SFC_ADAPTER_STARTED’?
  if (sa->state != SFC_ETHDEV_STARTED) {
                   ^~~~~~~~~~~~~~~~~~
                   SFC_ADAPTER_STARTED
../drivers/net/sfc/sfc_flow.c:2815:19: note: each undeclared identifier is reported only once for each function it appears in
[1659/2586] Generating rte_net_softnic_mingw with a custom command
[1660/2586] Compiling C object drivers/libtmp_rte_net_sfc.a.p/net_sfc_sfc_service.c.o
[1661/2586] Compiling C object drivers/libtmp_rte_net_sfc.a.p/net_sfc_sfc_mae.c.o
[1662/2586] Compiling C object drivers/libtmp_rte_net_sfc.a.p/net_sfc_sfc_ef10_rx.c.o
[1663/2586] Generating rte_net_qede.pmd.c with a custom command
[1664/2586] Compiling C object drivers/libtmp_rte_net_sfc.a.p/net_sfc_sfc_ef10_essb_rx.c.o
[1665/2586] Compiling C object drivers/libtmp_rte_net_sfc.a.p/net_sfc_sfc_ef100_rx.c.o
[1666/2586] Compiling C object drivers/libtmp_rte_net_sfc.a.p/net_sfc_sfc_ef100_tx.c.o
[1667/2586] Compiling C object drivers/libtmp_rte_net_sfc.a.p/net_sfc_sfc_ef10_tx.c.o
[1668/2586] Compiling C object drivers/libtmp_rte_net_octeontx2.a.p/net_octeontx2_otx2_rx.c.o
[1669/2586] Compiling C object drivers/libtmp_rte_net_octeontx2.a.p/net_octeontx2_otx2_tx.c.o
ninja: build stopped




*Build Failed #5:
OS: CENTOS83-64
Target: x86_64-native-linuxapp-gcc+debug
FAILED: drivers/libtmp_rte_net_sfc.a.p/net_sfc_sfc_flow.c.o 
gcc -Idrivers/libtmp_rte_net_sfc.a.p -Idrivers -I../drivers -Idrivers/net/sfc -I../drivers/net/sfc -Ilib/ethdev -I../lib/ethdev -I. -I.. -Iconfig -I../config -Ilib/eal/include -I../lib/eal/include -Ilib/eal/linux/include -I../lib/eal/linux/include -Ilib/eal/x86/include -I../lib/eal/x86/include -Ilib/eal/common -I../lib/eal/common -Ilib/eal -I../lib/eal -Ilib/kvargs -I../lib/kvargs -Ilib/metrics -I../lib/metrics -Ilib/telemetry -I../lib/telemetry -Ilib/net -I../lib/net -Ilib/mbuf -I../lib/mbuf -Ilib/mempool -I../lib/mempool -Ilib/ring -I../lib/ring -Ilib/meter -I../lib/meter -Idrivers/bus/pci -I../drivers/bus/pci -I../drivers/bus/pci/linux -Ilib/pci -I../lib/pci -Idrivers/bus/vdev -I../drivers/bus/vdev -Idrivers/common/sfc_efx -I../drivers/common/sfc_efx -Idrivers/common/sfc_efx/base -I../drivers/common/sfc_efx/base -fdiagnostics-color=always -pipe -D_FILE_OFFSET_BITS=64 -Wall -Winvalid-pch -Werror -O2 -g -include rte_config.h -Wextra -Wcast-qual -Wdeprecated -Wformat -Wformat-nonliteral -Wformat-security -Wmissing-declarations -Wmissing-prototypes -Wnested-externs -Wold-style-definition -Wpointer-arith -Wsign-compare -Wstrict-prototypes -Wundef -Wwrite-strings -Wno-packed-not-aligned -Wno-missing-field-initializers -D_GNU_SOURCE -fPIC -march=native -DALLOW_EXPERIMENTAL_API -DALLOW_INTERNAL_API -Wno-format-truncation -Wno-strict-aliasing -Wdisabled-optimization -Waggregate-return -Wbad-function-cast -DRTE_LOG_DEFAULT_LOGTYPE=pmd.net.sfc -MD -MQ drivers/libtmp_rte_net_sfc.a.p/net_sfc_sfc_flow.c.o -MF drivers/libtmp_rte_net_sfc.a.p/net_sfc_sfc_flow.c.o.d -o drivers/libtmp_rte_net_sfc.a.p/net_sfc_sfc_flow.c.o -c ../drivers/net/sfc/sfc_flow.c
../drivers/net/sfc/sfc_flow.c: In function ‘sfc_flow_query’:
../drivers/net/sfc/sfc_flow.c:2815:19: error: ‘SFC_ETHDEV_STARTED’ undeclared (first use in this function); did you mean ‘SFC_ADAPTER_STARTED’?
  if (sa->state != SFC_ETHDEV_STARTED) {
                   ^~~~~~~~~~~~~~~~~~
                   SFC_ADAPTER_STARTED
../drivers/net/sfc/sfc_flow.c:2815:19: note: each undeclared identifier is reported only once for each function it appears in
[1634/2754] Linking static target drivers/libtmp_rte_net_qede.a
[1635/2754] Compiling C object drivers/libtmp_rte_net_sfc.a.p/net_sfc_sfc_mae_counter.c.o
[1636/2754] Compiling C object drivers/libtmp_rte_net_sfc.a.p/net_sfc_sfc_mae.c.o
[1637/2754] Compiling C object drivers/libtmp_rte_net_sfc.a.p/net_sfc_sfc_ef10_essb_rx.c.o
[1638/2754] Compiling C object drivers/libtmp_rte_net_sfc.a.p/net_sfc_sfc_ef100_rx.c.o
[1639/2754] Compiling C object drivers/libtmp_rte_net_sfc.a.p/net_sfc_sfc_ef10_rx.c.o
[1640/2754] Compiling C object drivers/libtmp_rte_net_sfc.a.p/net_sfc_sfc_ef10_tx.c.o
[1641/2754] Compiling C object drivers/libtmp_rte_net_octeontx2.a.p/net_octeontx2_otx2_tx.c.o
[1642/2754] Compiling C object drivers/libtmp_rte_net_octeontx2.a.p/net_octeontx2_otx2_rx.c.o
ninja: build stopped




*Build Failed #6:
OS: FreeBSD1201-64
Target: x86_64-native-bsdapp-gcc
FAILED: drivers/libtmp_rte_net_sfc.a.p/net_sfc_sfc_flow.c.o 
gcc -Idrivers/libtmp_rte_net_sfc.a.p -Idrivers -I../drivers -Idrivers/net/sfc -I../drivers/net/sfc -Ilib/ethdev -I../lib/ethdev -I. -I.. -Iconfig -I../config -Ilib/eal/include -I../lib/eal/include -Ilib/eal/freebsd/include -I../lib/eal/freebsd/include -Ilib/eal/x86/include -I../lib/eal/x86/include -Ilib/eal/common -I../lib/eal/common -Ilib/eal -I../lib/eal -Ilib/kvargs -I../lib/kvargs -Ilib/metrics -I../lib/metrics -Ilib/telemetry -I../lib/telemetry -Ilib/net -I../lib/net -Ilib/mbuf -I../lib/mbuf -Ilib/mempool -I../lib/mempool -Ilib/ring -I../lib/ring -Ilib/meter -I../lib/meter -Idrivers/bus/pci -I../drivers/bus/pci -I../drivers/bus/pci/bsd -Ilib/pci -I../lib/pci -Idrivers/bus/vdev -I../drivers/bus/vdev -Idrivers/common/sfc_efx -I../drivers/common/sfc_efx -Idrivers/common/sfc_efx/base -I../drivers/common/sfc_efx/base -fdiagnostics-color=always -pipe -D_FILE_OFFSET_BITS=64 -Wall -Winvalid-pch -Werror -O3 -include rte_config.h -Wextra -Wcast-qual -Wdeprecated -Wformat -Wformat-nonliteral -Wformat-security -Wmissing-declarations -Wmissing-prototypes -Wnested-externs -Wold-style-definition -Wpointer-arith -Wsign-compare -Wstrict-prototypes -Wundef -Wwrite-strings -Wno-address-of-packed-member -Wno-packed-not-aligned -Wno-missing-field-initializers -D_GNU_SOURCE -D__BSD_VISIBLE -fPIC -march=native -mno-avx512f -DALLOW_EXPERIMENTAL_API -DALLOW_INTERNAL_API -Wno-format-truncation -Wno-strict-aliasing -Wdisabled-optimization -Waggregate-return -Wbad-function-cast -DRTE_LOG_DEFAULT_LOGTYPE=pmd.net.sfc -MD -MQ drivers/libtmp_rte_net_sfc.a.p/net_sfc_sfc_flow.c.o -MF drivers/libtmp_rte_net_sfc.a.p/net_sfc_sfc_flow.c.o.d -o drivers/libtmp_rte_net_sfc.a.p/net_sfc_sfc_flow.c.o -c ../drivers/net/sfc/sfc_flow.c
../drivers/net/sfc/sfc_flow.c: In function 'sfc_flow_query':
../drivers/net/sfc/sfc_flow.c:2815:19: error: 'SFC_ETHDEV_STARTED' undeclared (first use in this function); did you mean 'SFC_ADAPTER_STARTED'?
 2815 |  if (sa->state != SFC_ETHDEV_STARTED) {
      |                   ^~~~~~~~~~~~~~~~~~
      |                   SFC_ADAPTER_STARTED
../drivers/net/sfc/sfc_flow.c:2815:19: note: each undeclared identifier is reported only once for each function it appears in
[1242/1951] Compiling C object drivers/libtmp_rte_net_sfc.a.p/net_sfc_sfc_ef10_essb_rx.c.o
[1243/1951] Compiling C object drivers/libtmp_rte_net_sfc.a.p/net_sfc_sfc_ef10_rx.c.o
[1244/1951] Compiling C object drivers/libtmp_rte_net_sfc.a.p/net_sfc_sfc_mae.c.o
[1245/1951] Compiling C object drivers/libtmp_rte_net_sfc.a.p/net_sfc_sfc_ef100_rx.c.o
[1246/1951] Compiling C object drivers/libtmp_rte_net_sfc.a.p/net_sfc_sfc_ef10_tx.c.o
ninja: build stopped




*Build Failed #7:
OS: FreeBSD1201-64
Target: x86_64-native-bsdapp-clang
FAILED: drivers/libtmp_rte_net_sfc.a.p/net_sfc_sfc_flow.c.o 
clang -Idrivers/libtmp_rte_net_sfc.a.p -Idrivers -I../drivers -Idrivers/net/sfc -I../drivers/net/sfc -Ilib/ethdev -I../lib/ethdev -I. -I.. -Iconfig -I../config -Ilib/eal/include -I../lib/eal/include -Ilib/eal/freebsd/include -I../lib/eal/freebsd/include -Ilib/eal/x86/include -I../lib/eal/x86/include -Ilib/eal/common -I../lib/eal/common -Ilib/eal -I../lib/eal -Ilib/kvargs -I../lib/kvargs -Ilib/metrics -I../lib/metrics -Ilib/telemetry -I../lib/telemetry -Ilib/net -I../lib/net -Ilib/mbuf -I../lib/mbuf -Ilib/mempool -I../lib/mempool -Ilib/ring -I../lib/ring -Ilib/meter -I../lib/meter -Idrivers/bus/pci -I../drivers/bus/pci -I../drivers/bus/pci/bsd -Ilib/pci -I../lib/pci -Idrivers/bus/vdev -I../drivers/bus/vdev -Idrivers/common/sfc_efx -I../drivers/common/sfc_efx -Idrivers/common/sfc_efx/base -I../drivers/common/sfc_efx/base -Xclang -fcolor-diagnostics -pipe -D_FILE_OFFSET_BITS=64 -Wall -Winvalid-pch -Werror -O3 -include rte_config.h -Wextra -Wcast-qual -Wdeprecated -Wformat -Wformat-nonliteral -Wformat-security -Wmissing-declarations -Wmissing-prototypes -Wnested-externs -Wold-style-definition -Wpointer-arith -Wsign-compare -Wstrict-prototypes -Wundef -Wwrite-strings -Wno-address-of-packed-member -Wno-missing-field-initializers -D_GNU_SOURCE -D__BSD_VISIBLE -fPIC -march=native -mno-avx512f -DALLOW_EXPERIMENTAL_API -DALLOW_INTERNAL_API -Wno-strict-aliasing -Wdisabled-optimization -Waggregate-return -Wbad-function-cast -DRTE_LOG_DEFAULT_LOGTYPE=pmd.net.sfc -MD -MQ drivers/libtmp_rte_net_sfc.a.p/net_sfc_sfc_flow.c.o -MF drivers/libtmp_rte_net_sfc.a.p/net_sfc_sfc_flow.c.o.d -o drivers/libtmp_rte_net_sfc.a.p/net_sfc_sfc_flow.c.o -c ../drivers/net/sfc/sfc_flow.c
../drivers/net/sfc/sfc_flow.c:2815:19: error: use of undeclared identifier 'SFC_ETHDEV_STARTED'; did you mean 'SFC_ADAPTER_STARTED'?
        if (sa->state != SFC_ETHDEV_STARTED) {
                         ^~~~~~~~~~~~~~~~~~
                         SFC_ADAPTER_STARTED
../drivers/net/sfc/sfc.h:83:2: note: 'SFC_ADAPTER_STARTED' declared here
        SFC_ADAPTER_STARTED,
        ^
1 error generated.
[1242/1951] Compiling C object drivers/libtmp_rte_net_sfc.a.p/net_sfc_sfc_mae.c.o
[1243/1951] Compiling C object drivers/libtmp_rte_net_sfc.a.p/net_sfc_sfc_ef10_essb_rx.c.o
[1244/1951] Compiling C object drivers/libtmp_rte_net_sfc.a.p/net_sfc_sfc_ef10_rx.c.o
[1245/1951] Compiling C object drivers/libtmp_rte_net_sfc.a.p/net_sfc_sfc_ef100_rx.c.o
[1246/1951] Compiling C object drivers/libtmp_rte_net_sfc.a.p/net_sfc_sfc_ef10_tx.c.o
ninja: build stopped




*Build Failed #8:
OS: FreeBSD1201-64
Target: x86_64-native-bsdapp-gcc+shared
FAILED: drivers/libtmp_rte_net_sfc.a.p/net_sfc_sfc_flow.c.o 
gcc -Idrivers/libtmp_rte_net_sfc.a.p -Idrivers -I../drivers -Idrivers/net/sfc -I../drivers/net/sfc -Ilib/ethdev -I../lib/ethdev -I. -I.. -Iconfig -I../config -Ilib/eal/include -I../lib/eal/include -Ilib/eal/freebsd/include -I../lib/eal/freebsd/include -Ilib/eal/x86/include -I../lib/eal/x86/include -Ilib/eal/common -I../lib/eal/common -Ilib/eal -I../lib/eal -Ilib/kvargs -I../lib/kvargs -Ilib/metrics -I../lib/metrics -Ilib/telemetry -I../lib/telemetry -Ilib/net -I../lib/net -Ilib/mbuf -I../lib/mbuf -Ilib/mempool -I../lib/mempool -Ilib/ring -I../lib/ring -Ilib/meter -I../lib/meter -Idrivers/bus/pci -I../drivers/bus/pci -I../drivers/bus/pci/bsd -Ilib/pci -I../lib/pci -Idrivers/bus/vdev -I../drivers/bus/vdev -Idrivers/common/sfc_efx -I../drivers/common/sfc_efx -Idrivers/common/sfc_efx/base -I../drivers/common/sfc_efx/base -fdiagnostics-color=always -pipe -D_FILE_OFFSET_BITS=64 -Wall -Winvalid-pch -Werror -O3 -include rte_config.h -Wextra -Wcast-qual -Wdeprecated -Wformat -Wformat-nonliteral -Wformat-security -Wmissing-declarations -Wmissing-prototypes -Wnested-externs -Wold-style-definition -Wpointer-arith -Wsign-compare -Wstrict-prototypes -Wundef -Wwrite-strings -Wno-address-of-packed-member -Wno-packed-not-aligned -Wno-missing-field-initializers -D_GNU_SOURCE -D__BSD_VISIBLE -fPIC -march=native -mno-avx512f -DALLOW_EXPERIMENTAL_API -DALLOW_INTERNAL_API -Wno-format-truncation -Wno-strict-aliasing -Wdisabled-optimization -Waggregate-return -Wbad-function-cast -DRTE_LOG_DEFAULT_LOGTYPE=pmd.net.sfc -MD -MQ drivers/libtmp_rte_net_sfc.a.p/net_sfc_sfc_flow.c.o -MF drivers/libtmp_rte_net_sfc.a.p/net_sfc_sfc_flow.c.o.d -o drivers/libtmp_rte_net_sfc.a.p/net_sfc_sfc_flow.c.o -c ../drivers/net/sfc/sfc_flow.c
../drivers/net/sfc/sfc_flow.c: In function 'sfc_flow_query':
../drivers/net/sfc/sfc_flow.c:2815:19: error: 'SFC_ETHDEV_STARTED' undeclared (first use in this function); did you mean 'SFC_ADAPTER_STARTED'?
 2815 |  if (sa->state != SFC_ETHDEV_STARTED) {
      |                   ^~~~~~~~~~~~~~~~~~
      |                   SFC_ADAPTER_STARTED
../drivers/net/sfc/sfc_flow.c:2815:19: note: each undeclared identifier is reported only once for each function it appears in
[1266/1832] Compiling C object drivers/libtmp_rte_net_sfc.a.p/net_sfc_sfc_ef10_essb_rx.c.o
[1267/1832] Compiling C object drivers/libtmp_rte_net_sfc.a.p/net_sfc_sfc_ef10_rx.c.o
[1268/1832] Compiling C object drivers/libtmp_rte_net_sfc.a.p/net_sfc_sfc_mae.c.o
[1269/1832] Compiling C object drivers/libtmp_rte_net_sfc.a.p/net_sfc_sfc_ef100_rx.c.o
[1270/1832] Compiling C object drivers/libtmp_rte_net_sfc.a.p/net_sfc_sfc_ef10_tx.c.o
ninja: build stopped




*Build Failed #9:
OS: FreeBSD1201-64
Target: x86_64-native-bsdapp-gcc+debug
FAILED: drivers/libtmp_rte_net_sfc.a.p/net_sfc_sfc_flow.c.o 
gcc -Idrivers/libtmp_rte_net_sfc.a.p -Idrivers -I../drivers -Idrivers/net/sfc -I../drivers/net/sfc -Ilib/ethdev -I../lib/ethdev -I. -I.. -Iconfig -I../config -Ilib/eal/include -I../lib/eal/include -Ilib/eal/freebsd/include -I../lib/eal/freebsd/include -Ilib/eal/x86/include -I../lib/eal/x86/include -Ilib/eal/common -I../lib/eal/common -Ilib/eal -I../lib/eal -Ilib/kvargs -I../lib/kvargs -Ilib/metrics -I../lib/metrics -Ilib/telemetry -I../lib/telemetry -Ilib/net -I../lib/net -Ilib/mbuf -I../lib/mbuf -Ilib/mempool -I../lib/mempool -Ilib/ring -I../lib/ring -Ilib/meter -I../lib/meter -Idrivers/bus/pci -I../drivers/bus/pci -I../drivers/bus/pci/bsd -Ilib/pci -I../lib/pci -Idrivers/bus/vdev -I../drivers/bus/vdev -Idrivers/common/sfc_efx -I../drivers/common/sfc_efx -Idrivers/common/sfc_efx/base -I../drivers/common/sfc_efx/base -fdiagnostics-color=always -pipe -D_FILE_OFFSET_BITS=64 -Wall -Winvalid-pch -Werror -O2 -g -include rte_config.h -Wextra -Wcast-qual -Wdeprecated -Wformat -Wformat-nonliteral -Wformat-security -Wmissing-declarations -Wmissing-prototypes -Wnested-externs -Wold-style-definition -Wpointer-arith -Wsign-compare -Wstrict-prototypes -Wundef -Wwrite-strings -Wno-address-of-packed-member -Wno-packed-not-aligned -Wno-missing-field-initializers -D_GNU_SOURCE -D__BSD_VISIBLE -fPIC -march=native -mno-avx512f -DALLOW_EXPERIMENTAL_API -DALLOW_INTERNAL_API -Wno-format-truncation -Wno-strict-aliasing -Wdisabled-optimization -Waggregate-return -Wbad-function-cast -DRTE_LOG_DEFAULT_LOGTYPE=pmd.net.sfc -MD -MQ drivers/libtmp_rte_net_sfc.a.p/net_sfc_sfc_flow.c.o -MF drivers/libtmp_rte_net_sfc.a.p/net_sfc_sfc_flow.c.o.d -o drivers/libtmp_rte_net_sfc.a.p/net_sfc_sfc_flow.c.o -c ../drivers/net/sfc/sfc_flow.c
../drivers/net/sfc/sfc_flow.c: In function 'sfc_flow_query':
../drivers/net/sfc/sfc_flow.c:2815:19: error: 'SFC_ETHDEV_STARTED' undeclared (first use in this function); did you mean 'SFC_ADAPTER_STARTED'?
 2815 |  if (sa->state != SFC_ETHDEV_STARTED) {
      |                   ^~~~~~~~~~~~~~~~~~
      |                   SFC_ADAPTER_STARTED
../drivers/net/sfc/sfc_flow.c:2815:19: note: each undeclared identifier is reported only once for each function it appears in
[1235/1951] Compiling C object drivers/libtmp_rte_net_sfc.a.p/net_sfc_sfc_ef10_rx.c.o
[1236/1951] Compiling C object drivers/libtmp_rte_net_sfc.a.p/net_sfc_sfc_ef10_essb_rx.c.o
[1237/1951] Compiling C object drivers/libtmp_rte_net_sfc.a.p/net_sfc_sfc_mae.c.o
[1238/1951] Compiling C object drivers/libtmp_rte_net_octeontx2.a.p/net_octeontx2_otx2_rx.c.o
[1239/1951] Compiling C object drivers/libtmp_rte_net_sfc.a.p/net_sfc_sfc_ef10_tx.c.o
ninja: build stopped




*Build Failed #10:
OS: RHEL83-64
Target: x86_64-native-linuxapp-gcc
FAILED: drivers/libtmp_rte_net_sfc.a.p/net_sfc_sfc_flow.c.o 
gcc -Idrivers/libtmp_rte_net_sfc.a.p -Idrivers -I../drivers -Idrivers/net/sfc -I../drivers/net/sfc -Ilib/ethdev -I../lib/ethdev -I. -I.. -Iconfig -I../config -Ilib/eal/include -I../lib/eal/include -Ilib/eal/linux/include -I../lib/eal/linux/include -Ilib/eal/x86/include -I../lib/eal/x86/include -Ilib/eal/common -I../lib/eal/common -Ilib/eal -I../lib/eal -Ilib/kvargs -I../lib/kvargs -Ilib/metrics -I../lib/metrics -Ilib/telemetry -I../lib/telemetry -Ilib/net -I../lib/net -Ilib/mbuf -I../lib/mbuf -Ilib/mempool -I../lib/mempool -Ilib/ring -I../lib/ring -Ilib/meter -I../lib/meter -Idrivers/bus/pci -I../drivers/bus/pci -I../drivers/bus/pci/linux -Ilib/pci -I../lib/pci -Idrivers/bus/vdev -I../drivers/bus/vdev -Idrivers/common/sfc_efx -I../drivers/common/sfc_efx -Idrivers/common/sfc_efx/base -I../drivers/common/sfc_efx/base -fdiagnostics-color=always -pipe -D_FILE_OFFSET_BITS=64 -Wall -Winvalid-pch -Werror -O3 -include rte_config.h -Wextra -Wcast-qual -Wdeprecated -Wformat -Wformat-nonliteral -Wformat-security -Wmissing-declarations -Wmissing-prototypes -Wnested-externs -Wold-style-definition -Wpointer-arith -Wsign-compare -Wstrict-prototypes -Wundef -Wwrite-strings -Wno-packed-not-aligned -Wno-missing-field-initializers -D_GNU_SOURCE -fPIC -march=native -DALLOW_EXPERIMENTAL_API -DALLOW_INTERNAL_API -Wno-format-truncation -Wno-strict-aliasing -Wdisabled-optimization -Waggregate-return -Wbad-function-cast -DRTE_LOG_DEFAULT_LOGTYPE=pmd.net.sfc -MD -MQ drivers/libtmp_rte_net_sfc.a.p/net_sfc_sfc_flow.c.o -MF drivers/libtmp_rte_net_sfc.a.p/net_sfc_sfc_flow.c.o.d -o drivers/libtmp_rte_net_sfc.a.p/net_sfc_sfc_flow.c.o -c ../drivers/net/sfc/sfc_flow.c
../drivers/net/sfc/sfc_flow.c: In function ‘sfc_flow_query’:
../drivers/net/sfc/sfc_flow.c:2815:19: error: ‘SFC_ETHDEV_STARTED’ undeclared (first use in this function); did you mean ‘SFC_ADAPTER_STARTED’?
  if (sa->state != SFC_ETHDEV_STARTED) {
                   ^~~~~~~~~~~~~~~~~~
                   SFC_ADAPTER_STARTED
../drivers/net/sfc/sfc_flow.c:2815:19: note: each undeclared identifier is reported only once for each function it appears in
[1636/2754] Generating rte_net_qede.pmd.c with a custom command
[1637/2754] Compiling C object drivers/libtmp_rte_net_sfc.a.p/net_sfc_sfc_mae_counter.c.o
[1638/2754] Compiling C object drivers/libtmp_rte_net_octeontx2.a.p/net_octeontx2_otx2_tx.c.o
[1639/2754] Compiling C object drivers/libtmp_rte_net_sfc.a.p/net_sfc_sfc_tx.c.o
[1640/2754] Compiling C object drivers/libtmp_rte_net_sfc.a.p/net_sfc_sfc_ef10_essb_rx.c.o
[1641/2754] Compiling C object drivers/libtmp_rte_net_sfc.a.p/net_sfc_sfc_ef10_rx.c.o
[1642/2754] Compiling C object drivers/libtmp_rte_net_octeontx2.a.p/net_octeontx2_otx2_rx.c.o
[1643/2754] Compiling C object drivers/libtmp_rte_net_sfc.a.p/net_sfc_sfc_mae.c.o
[1644/2754] Compiling C object drivers/libtmp_rte_net_sfc.a.p/net_sfc_sfc_ef10_tx.c.o
ninja: build stopped




*Build Failed #11:
OS: SUSE15-64
Target: x86_64-native-linuxapp-clang
FAILED: drivers/libtmp_rte_net_sfc.a.p/net_sfc_sfc_flow.c.o 
clang -Idrivers/libtmp_rte_net_sfc.a.p -Idrivers -I../drivers -Idrivers/net/sfc -I../drivers/net/sfc -Ilib/ethdev -I../lib/ethdev -I. -I.. -Iconfig -I../config -Ilib/eal/include -I../lib/eal/include -Ilib/eal/linux/include -I../lib/eal/linux/include -Ilib/eal/x86/include -I../lib/eal/x86/include -Ilib/eal/common -I../lib/eal/common -Ilib/eal -I../lib/eal -Ilib/kvargs -I../lib/kvargs -Ilib/metrics -I../lib/metrics -Ilib/telemetry -I../lib/telemetry -Ilib/net -I../lib/net -Ilib/mbuf -I../lib/mbuf -Ilib/mempool -I../lib/mempool -Ilib/ring -I../lib/ring -Ilib/meter -I../lib/meter -Idrivers/bus/pci -I../drivers/bus/pci -I../drivers/bus/pci/linux -Ilib/pci -I../lib/pci -Idrivers/bus/vdev -I../drivers/bus/vdev -Idrivers/common/sfc_efx -I../drivers/common/sfc_efx -Idrivers/common/sfc_efx/base -I../drivers/common/sfc_efx/base -Xclang -fcolor-diagnostics -pipe -D_FILE_OFFSET_BITS=64 -Wall -Winvalid-pch -Werror -O3 -include rte_config.h -Wextra -Wcast-qual -Wdeprecated -Wformat -Wformat-nonliteral -Wformat-security -Wmissing-declarations -Wmissing-prototypes -Wnested-externs -Wold-style-definition -Wpointer-arith -Wsign-compare -Wstrict-prototypes -Wundef -Wwrite-strings -Wno-address-of-packed-member -Wno-missing-field-initializers -D_GNU_SOURCE -fPIC -march=native -DALLOW_EXPERIMENTAL_API -DALLOW_INTERNAL_API -Wno-strict-aliasing -Wdisabled-optimization -Waggregate-return -Wbad-function-cast -DRTE_LOG_DEFAULT_LOGTYPE=pmd.net.sfc -MD -MQ drivers/libtmp_rte_net_sfc.a.p/net_sfc_sfc_flow.c.o -MF drivers/libtmp_rte_net_sfc.a.p/net_sfc_sfc_flow.c.o.d -o drivers/libtmp_rte_net_sfc.a.p/net_sfc_sfc_flow.c.o -c ../drivers/net/sfc/sfc_flow.c
../drivers/net/sfc/sfc_flow.c:2815:19: error: use of undeclared identifier 'SFC_ETHDEV_STARTED'; did you mean 'SFC_ADAPTER_STARTED'?
        if (sa->state != SFC_ETHDEV_STARTED) {
                         ^~~~~~~~~~~~~~~~~~
                         SFC_ADAPTER_STARTED
../drivers/net/sfc/sfc.h:83:2: note: 'SFC_ADAPTER_STARTED' declared here
        SFC_ADAPTER_STARTED,
        ^
1 error generated.
[1648/2714] Linking target drivers/librte_net_qede.so.21.3
[1649/2714] Compiling C object drivers/libtmp_rte_net_sfc.a.p/net_sfc_sfc_ef10_rx.c.o
[1650/2714] Compiling C object drivers/libtmp_rte_net_sfc.a.p/net_sfc_sfc_ef10_essb_rx.c.o
[1651/2714] Compiling C object drivers/libtmp_rte_net_sfc.a.p/net_sfc_sfc_ef10_tx.c.o
[1652/2714] Compiling C object drivers/libtmp_rte_net_sfc.a.p/net_sfc_sfc_ef100_rx.c.o
[1653/2714] Compiling C object drivers/libtmp_rte_net_softnic.a.p/net_softnic_parser.c.o
[1654/2714] Generating rte_net_octeontx2.pmd.c with a custom command
[1655/2714] Compiling C object drivers/libtmp_rte_net_sfc.a.p/net_sfc_sfc_ef100_tx.c.o
[1656/2714] Compiling C object drivers/libtmp_rte_net_softnic.a.p/net_softnic_rte_eth_softnic_action.c.o
ninja: build stopped




*Build Failed #12:
OS: SUSE15-64
Target: x86_64-native-linuxapp-gcc
FAILED: drivers/libtmp_rte_net_sfc.a.p/net_sfc_sfc_flow.c.o 
gcc -Idrivers/libtmp_rte_net_sfc.a.p -Idrivers -I../drivers -Idrivers/net/sfc -I../drivers/net/sfc -Ilib/ethdev -I../lib/ethdev -I. -I.. -Iconfig -I../config -Ilib/eal/include -I../lib/eal/include -Ilib/eal/linux/include -I../lib/eal/linux/include -Ilib/eal/x86/include -I../lib/eal/x86/include -Ilib/eal/common -I../lib/eal/common -Ilib/eal -I../lib/eal -Ilib/kvargs -I../lib/kvargs -Ilib/metrics -I../lib/metrics -Ilib/telemetry -I../lib/telemetry -Ilib/net -I../lib/net -Ilib/mbuf -I../lib/mbuf -Ilib/mempool -I../lib/mempool -Ilib/ring -I../lib/ring -Ilib/meter -I../lib/meter -Idrivers/bus/pci -I../drivers/bus/pci -I../drivers/bus/pci/linux -Ilib/pci -I../lib/pci -Idrivers/bus/vdev -I../drivers/bus/vdev -Idrivers/common/sfc_efx -I../drivers/common/sfc_efx -Idrivers/common/sfc_efx/base -I../drivers/common/sfc_efx/base -fdiagnostics-color=always -pipe -D_FILE_OFFSET_BITS=64 -Wall -Winvalid-pch -Werror -O3 -include rte_config.h -Wextra -Wcast-qual -Wdeprecated -Wformat -Wformat-nonliteral -Wformat-security -Wmissing-declarations -Wmissing-prototypes -Wnested-externs -Wold-style-definition -Wpointer-arith -Wsign-compare -Wstrict-prototypes -Wundef -Wwrite-strings -Wno-missing-field-initializers -D_GNU_SOURCE -fPIC -march=native -DALLOW_EXPERIMENTAL_API -DALLOW_INTERNAL_API -Wno-format-truncation -Wno-strict-aliasing -Wdisabled-optimization -Waggregate-return -Wbad-function-cast -DRTE_LOG_DEFAULT_LOGTYPE=pmd.net.sfc -MD -MQ drivers/libtmp_rte_net_sfc.a.p/net_sfc_sfc_flow.c.o -MF drivers/libtmp_rte_net_sfc.a.p/net_sfc_sfc_flow.c.o.d -o drivers/libtmp_rte_net_sfc.a.p/net_sfc_sfc_flow.c.o -c ../drivers/net/sfc/sfc_flow.c
../drivers/net/sfc/sfc_flow.c: In function ‘sfc_flow_query’:
../drivers/net/sfc/sfc_flow.c:2815:19: error: ‘SFC_ETHDEV_STARTED’ undeclared (first use in this function); did you mean ‘SFC_ADAPTER_STARTED’?
  if (sa->state != SFC_ETHDEV_STARTED) {
                   ^~~~~~~~~~~~~~~~~~
                   SFC_ADAPTER_STARTED
../drivers/net/sfc/sfc_flow.c:2815:19: note: each undeclared identifier is reported only once for each function it appears in
[1640/2683] Compiling C object drivers/libtmp_rte_net_sfc.a.p/net_sfc_sfc_mae_counter.c.o
[1641/2683] Compiling C object drivers/libtmp_rte_net_sfc.a.p/net_sfc_sfc_rx.c.o
[1642/2683] Compiling C object drivers/libtmp_rte_net_sfc.a.p/net_sfc_sfc_mae.c.o
[1643/2683] Compiling C object drivers/libtmp_rte_net_sfc.a.p/net_sfc_sfc_ef10_essb_rx.c.o
[1644/2683] Compiling C object drivers/libtmp_rte_net_sfc.a.p/net_sfc_sfc_ef10_rx.c.o
[1645/2683] Compiling C object drivers/libtmp_rte_net_sfc.a.p/net_sfc_sfc_ef100_rx.c.o
[1646/2683] Compiling C object drivers/libtmp_rte_net_sfc.a.p/net_sfc_sfc_ef10_tx.c.o
ninja: build stopped




*Build Failed #13:
OS: CentOsStream8-64
Target: x86_64-native-linuxapp-gcc
FAILED: drivers/libtmp_rte_net_sfc.a.p/net_sfc_sfc_flow.c.o 
gcc -Idrivers/libtmp_rte_net_sfc.a.p -Idrivers -I../drivers -Idrivers/net/sfc -I../drivers/net/sfc -Ilib/ethdev -I../lib/ethdev -I. -I.. -Iconfig -I../config -Ilib/eal/include -I../lib/eal/include -Ilib/eal/linux/include -I../lib/eal/linux/include -Ilib/eal/x86/include -I../lib/eal/x86/include -Ilib/eal/common -I../lib/eal/common -Ilib/eal -I../lib/eal -Ilib/kvargs -I../lib/kvargs -Ilib/metrics -I../lib/metrics -Ilib/telemetry -I../lib/telemetry -Ilib/net -I../lib/net -Ilib/mbuf -I../lib/mbuf -Ilib/mempool -I../lib/mempool -Ilib/ring -I../lib/ring -Ilib/meter -I../lib/meter -Idrivers/bus/pci -I../drivers/bus/pci -I../drivers/bus/pci/linux -Ilib/pci -I../lib/pci -Idrivers/bus/vdev -I../drivers/bus/vdev -Idrivers/common/sfc_efx -I../drivers/common/sfc_efx -Idrivers/common/sfc_efx/base -I../drivers/common/sfc_efx/base -fdiagnostics-color=always -pipe -D_FILE_OFFSET_BITS=64 -Wall -Winvalid-pch -Werror -O3 -include rte_config.h -Wextra -Wcast-qual -Wdeprecated -Wformat -Wformat-nonliteral -Wformat-security -Wmissing-declarations -Wmissing-prototypes -Wnested-externs -Wold-style-definition -Wpointer-arith -Wsign-compare -Wstrict-prototypes -Wundef -Wwrite-strings -Wno-packed-not-aligned -Wno-missing-field-initializers -D_GNU_SOURCE -fPIC -march=native -DALLOW_EXPERIMENTAL_API -DALLOW_INTERNAL_API -Wno-format-truncation -Wno-strict-aliasing -Wdisabled-optimization -Waggregate-return -Wbad-function-cast -DRTE_LOG_DEFAULT_LOGTYPE=pmd.net.sfc -MD -MQ drivers/libtmp_rte_net_sfc.a.p/net_sfc_sfc_flow.c.o -MF drivers/libtmp_rte_net_sfc.a.p/net_sfc_sfc_flow.c.o.d -o drivers/libtmp_rte_net_sfc.a.p/net_sfc_sfc_flow.c.o -c ../drivers/net/sfc/sfc_flow.c
../drivers/net/sfc/sfc_flow.c: In function ‘sfc_flow_query’:
../drivers/net/sfc/sfc_flow.c:2815:19: error: ‘SFC_ETHDEV_STARTED’ undeclared (first use in this function); did you mean ‘SFC_ADAPTER_STARTED’?
  if (sa->state != SFC_ETHDEV_STARTED) {
                   ^~~~~~~~~~~~~~~~~~
                   SFC_ADAPTER_STARTED
../drivers/net/sfc/sfc_flow.c:2815:19: note: each undeclared identifier is reported only once for each function it appears in
[1628/2744] Generating rte_net_sfc_def with a custom command
[1629/2744] Compiling C object drivers/libtmp_rte_net_sfc.a.p/net_sfc_sfc_mae.c.o
[1630/2744] Compiling C object drivers/libtmp_rte_net_sfc.a.p/net_sfc_sfc_ef10_rx.c.o
[1631/2744] Compiling C object drivers/libtmp_rte_net_sfc.a.p/net_sfc_sfc_ef100_rx.c.o
[1632/2744] Compiling C object drivers/libtmp_rte_net_sfc.a.p/net_sfc_sfc_ef10_essb_rx.c.o
[1633/2744] Generating rte_net_qede.pmd.c with a custom command
[1634/2744] Compiling C object drivers/libtmp_rte_net_sfc.a.p/net_sfc_sfc_ef100_tx.c.o
[1635/2744] Compiling C object drivers/libtmp_rte_net_softnic.a.p/net_softnic_parser.c.o
[1636/2744] Compiling C object drivers/libtmp_rte_net_sfc.a.p/net_sfc_sfc_ef10_tx.c.o
[1637/2744] Compiling C object drivers/libtmp_rte_net_octeontx2.a.p/net_octeontx2_otx2_rx.c.o
[1638/2744] Compiling C object drivers/libtmp_rte_net_octeontx2.a.p/net_octeontx2_otx2_tx.c.o
ninja: build stopped




*Build Failed #14:
OS: UB2004-64
Target: x86_64-native-linuxapp-clang
FAILED: drivers/libtmp_rte_net_sfc.a.p/net_sfc_sfc_flow.c.o 
clang -Idrivers/libtmp_rte_net_sfc.a.p -Idrivers -I../drivers -Idrivers/net/sfc -I../drivers/net/sfc -Ilib/ethdev -I../lib/ethdev -I. -I.. -Iconfig -I../config -Ilib/eal/include -I../lib/eal/include -Ilib/eal/linux/include -I../lib/eal/linux/include -Ilib/eal/x86/include -I../lib/eal/x86/include -Ilib/eal/common -I../lib/eal/common -Ilib/eal -I../lib/eal -Ilib/kvargs -I../lib/kvargs -Ilib/metrics -I../lib/metrics -Ilib/telemetry -I../lib/telemetry -Ilib/net -I../lib/net -Ilib/mbuf -I../lib/mbuf -Ilib/mempool -I../lib/mempool -Ilib/ring -I../lib/ring -Ilib/meter -I../lib/meter -Idrivers/bus/pci -I../drivers/bus/pci -I../drivers/bus/pci/linux -Ilib/pci -I../lib/pci -Idrivers/bus/vdev -I../drivers/bus/vdev -Idrivers/common/sfc_efx -I../drivers/common/sfc_efx -Idrivers/common/sfc_efx/base -I../drivers/common/sfc_efx/base -Xclang -fcolor-diagnostics -pipe -D_FILE_OFFSET_BITS=64 -Wall -Winvalid-pch -Werror -O3 -include rte_config.h -Wextra -Wcast-qual -Wdeprecated -Wformat -Wformat-nonliteral -Wformat-security -Wmissing-declarations -Wmissing-prototypes -Wnested-externs -Wold-style-definition -Wpointer-arith -Wsign-compare -Wstrict-prototypes -Wundef -Wwrite-strings -Wno-address-of-packed-member -Wno-missing-field-initializers -D_GNU_SOURCE -fPIC -march=native -DALLOW_EXPERIMENTAL_API -DALLOW_INTERNAL_API -Wno-strict-aliasing -Wdisabled-optimization -Waggregate-return -Wbad-function-cast -DRTE_LOG_DEFAULT_LOGTYPE=pmd.net.sfc -MD -MQ drivers/libtmp_rte_net_sfc.a.p/net_sfc_sfc_flow.c.o -MF drivers/libtmp_rte_net_sfc.a.p/net_sfc_sfc_flow.c.o.d -o drivers/libtmp_rte_net_sfc.a.p/net_sfc_sfc_flow.c.o -c ../drivers/net/sfc/sfc_flow.c
../drivers/net/sfc/sfc_flow.c:2815:19: error: use of undeclared identifier 'SFC_ETHDEV_STARTED'; did you mean 'SFC_ADAPTER_STARTED'?
        if (sa->state != SFC_ETHDEV_STARTED) {
                         ^~~~~~~~~~~~~~~~~~
                         SFC_ADAPTER_STARTED
../drivers/net/sfc/sfc.h:83:2: note: 'SFC_ADAPTER_STARTED' declared here
        SFC_ADAPTER_STARTED,
        ^
1 error generated.
[1639/2741] Compiling C object drivers/libtmp_rte_net_sfc.a.p/net_sfc_sfc_mae_counter.c.o
[1640/2741] Linking target drivers/librte_net_qede.so.21.3
[1641/2741] Compiling C object drivers/libtmp_rte_net_sfc.a.p/net_sfc_sfc_rx.c.o
[1642/2741] Compiling C object drivers/libtmp_rte_net_sfc.a.p/net_sfc_sfc_mae.c.o
[1643/2741] Compiling C object drivers/libtmp_rte_net_sfc.a.p/net_sfc_sfc_ef10_essb_rx.c.o
[1644/2741] Compiling C object drivers/libtmp_rte_net_sfc.a.p/net_sfc_sfc_ef10_rx.c.o
[1645/2741] Compiling C object drivers/libtmp_rte_net_sfc.a.p/net_sfc_sfc_ef100_rx.c.o
[1646/2741] Compiling C object drivers/libtmp_rte_net_sfc.a.p/net_sfc_sfc_ef10_tx.c.o
[1647/2741] Compiling C object drivers/libtmp_rte_net_octeontx2.a.p/net_octeontx2_otx2_rx.c.o
ninja: build stopped




*Build Failed #15:
OS: UB2004-64
Target: x86_64-native-linuxapp-gcc
FAILED: drivers/libtmp_rte_net_sfc.a.p/net_sfc_sfc_flow.c.o 
gcc -Idrivers/libtmp_rte_net_sfc.a.p -Idrivers -I../drivers -Idrivers/net/sfc -I../drivers/net/sfc -Ilib/ethdev -I../lib/ethdev -I. -I.. -Iconfig -I../config -Ilib/eal/include -I../lib/eal/include -Ilib/eal/linux/include -I../lib/eal/linux/include -Ilib/eal/x86/include -I../lib/eal/x86/include -Ilib/eal/common -I../lib/eal/common -Ilib/eal -I../lib/eal -Ilib/kvargs -I../lib/kvargs -Ilib/metrics -I../lib/metrics -Ilib/telemetry -I../lib/telemetry -Ilib/net -I../lib/net -Ilib/mbuf -I../lib/mbuf -Ilib/mempool -I../lib/mempool -Ilib/ring -I../lib/ring -Ilib/meter -I../lib/meter -Idrivers/bus/pci -I../drivers/bus/pci -I../drivers/bus/pci/linux -Ilib/pci -I../lib/pci -Idrivers/bus/vdev -I../drivers/bus/vdev -Idrivers/common/sfc_efx -I../drivers/common/sfc_efx -Idrivers/common/sfc_efx/base -I../drivers/common/sfc_efx/base -fdiagnostics-color=always -pipe -D_FILE_OFFSET_BITS=64 -Wall -Winvalid-pch -Werror -O3 -include rte_config.h -Wextra -Wcast-qual -Wdeprecated -Wformat -Wformat-nonliteral -Wformat-security -Wmissing-declarations -Wmissing-prototypes -Wnested-externs -Wold-style-definition -Wpointer-arith -Wsign-compare -Wstrict-prototypes -Wundef -Wwrite-strings -Wno-address-of-packed-member -Wno-packed-not-aligned -Wno-missing-field-initializers -Wno-zero-length-bounds -D_GNU_SOURCE -fPIC -march=native -DALLOW_EXPERIMENTAL_API -DALLOW_INTERNAL_API -Wno-format-truncation -Wno-strict-aliasing -Wdisabled-optimization -Waggregate-return -Wbad-function-cast -DRTE_LOG_DEFAULT_LOGTYPE=pmd.net.sfc -MD -MQ drivers/libtmp_rte_net_sfc.a.p/net_sfc_sfc_flow.c.o -MF drivers/libtmp_rte_net_sfc.a.p/net_sfc_sfc_flow.c.o.d -o drivers/libtmp_rte_net_sfc.a.p/net_sfc_sfc_flow.c.o -c ../drivers/net/sfc/sfc_flow.c
../drivers/net/sfc/sfc_flow.c: In function ‘sfc_flow_query’:
../drivers/net/sfc/sfc_flow.c:2815:19: error: ‘SFC_ETHDEV_STARTED’ undeclared (first use in this function); did you mean ‘SFC_ADAPTER_STARTED’?
 2815 |  if (sa->state != SFC_ETHDEV_STARTED) {
      |                   ^~~~~~~~~~~~~~~~~~
      |                   SFC_ADAPTER_STARTED
../drivers/net/sfc/sfc_flow.c:2815:19: note: each undeclared identifier is reported only once for each function it appears in
[1637/2741] Linking target drivers/librte_net_qede.so.21.3
[1638/2741] Compiling C object drivers/libtmp_rte_net_sfc.a.p/net_sfc_sfc_mae_counter.c.o
[1639/2741] Compiling C object drivers/libtmp_rte_net_sfc.a.p/net_sfc_sfc_ef10_essb_rx.c.o
[1640/2741] Compiling C object drivers/libtmp_rte_net_sfc.a.p/net_sfc_sfc_ef10_rx.c.o
[1641/2741] Compiling C object drivers/libtmp_rte_net_sfc.a.p/net_sfc_sfc_mae.c.o
[1642/2741] Compiling C object drivers/libtmp_rte_net_sfc.a.p/net_sfc_sfc_ef100_rx.c.o
[1643/2741] Compiling C object drivers/libtmp_rte_net_sfc.a.p/net_sfc_sfc_ef10_tx.c.o
[1644/2741] Compiling C object drivers/libtmp_rte_net_octeontx2.a.p/net_octeontx2_otx2_tx.c.o
[1645/2741] Compiling C object drivers/libtmp_rte_net_octeontx2.a.p/net_octeontx2_otx2_rx.c.o
ninja: build stopped




*Build Failed #16:
OS: UB2004-64
Target: x86_64-native-linuxapp-icc
FAILED: drivers/libtmp_rte_net_sfc.a.p/net_sfc_sfc_flow.c.o 
icc -Idrivers/libtmp_rte_net_sfc.a.p -Idrivers -I../drivers -Idrivers/net/sfc -I../drivers/net/sfc -Ilib/ethdev -I../lib/ethdev -I. -I.. -Iconfig -I../config -Ilib/eal/include -I../lib/eal/include -Ilib/eal/linux/include -I../lib/eal/linux/include -Ilib/eal/x86/include -I../lib/eal/x86/include -Ilib/eal/common -I../lib/eal/common -Ilib/eal -I../lib/eal -Ilib/kvargs -I../lib/kvargs -Ilib/metrics -I../lib/metrics -Ilib/telemetry -I../lib/telemetry -Ilib/net -I../lib/net -Ilib/mbuf -I../lib/mbuf -Ilib/mempool -I../lib/mempool -Ilib/ring -I../lib/ring -Ilib/meter -I../lib/meter -Idrivers/bus/pci -I../drivers/bus/pci -I../drivers/bus/pci/linux -Ilib/pci -I../lib/pci -Idrivers/bus/vdev -I../drivers/bus/vdev -Idrivers/common/sfc_efx -I../drivers/common/sfc_efx -Idrivers/common/sfc_efx/base -I../drivers/common/sfc_efx/base -pipe -D_FILE_OFFSET_BITS=64 -Wall -w3 -diag-disable:remark -Werror -O3 -include rte_config.h -Wextra -Wcast-qual -Wdeprecated -Wformat -Wformat-security -Wmissing-declarations -Wmissing-prototypes -Wold-style-definition -Wpointer-arith -Wsign-compare -Wstrict-prototypes -Wundef -Wwrite-strings -Wno-missing-field-initializers -diag-disable=181 -diag-disable=188 -diag-disable=2203 -diag-disable=2279 -diag-disable=2557 -diag-disable=3179 -diag-disable=3656 -D_GNU_SOURCE -fPIC -march=native -DALLOW_EXPERIMENTAL_API -DALLOW_INTERNAL_API -Wno-strict-aliasing -Wdisabled-optimization -DRTE_LOG_DEFAULT_LOGTYPE=pmd.net.sfc -MD -MQ drivers/libtmp_rte_net_sfc.a.p/net_sfc_sfc_flow.c.o -MF drivers/libtmp_rte_net_sfc.a.p/net_sfc_sfc_flow.c.o.d -o drivers/libtmp_rte_net_sfc.a.p/net_sfc_sfc_flow.c.o -c ../drivers/net/sfc/sfc_flow.c
../drivers/net/sfc/sfc_flow.c(2815): error: identifier "SFC_ETHDEV_STARTED" is undefined
  	if (sa->state != SFC_ETHDEV_STARTED) {
  	                 ^

compilation aborted for ../drivers/net/sfc/sfc_flow.c (code 2)
[1604/2694] Compiling C object drivers/libtmp_rte_net_sfc.a.p/net_sfc_sfc_switch.c.o
[1605/2694] Compiling C object drivers/libtmp_rte_net_sfc.a.p/net_sfc_sfc_mae_counter.c.o
[1606/2694] Linking target drivers/librte_net_pcap.so.21.3
[1607/2694] Compiling C object drivers/libtmp_rte_net_sfc.a.p/net_sfc_sfc_rx.c.o
[1608/2694] Compiling C object drivers/libtmp_rte_net_sfc.a.p/net_sfc_sfc_tx.c.o
[1609/2694] Compiling C object drivers/libtmp_rte_net_qede.a.p/net_qede_qede_rxtx.c.o
[1610/2694] Compiling C object drivers/libtmp_rte_net_sfc.a.p/net_sfc_sfc_mae.c.o
[1611/2694] Compiling C object drivers/libtmp_rte_net_octeontx2.a.p/net_octeontx2_otx2_rx.c.o
[1612/2694] Compiling C object drivers/libtmp_rte_net_octeontx2.a.p/net_octeontx2_otx2_tx.c.o
ninja: build stopped




*Build Failed #17:
OS: UB2104-64
Target: x86_64-native-linuxapp-gcc
FAILED: drivers/libtmp_rte_net_sfc.a.p/net_sfc_sfc_flow.c.o 
gcc -Idrivers/libtmp_rte_net_sfc.a.p -Idrivers -I../drivers -Idrivers/net/sfc -I../drivers/net/sfc -Ilib/ethdev -I../lib/ethdev -I. -I.. -Iconfig -I../config -Ilib/eal/include -I../lib/eal/include -Ilib/eal/linux/include -I../lib/eal/linux/include -Ilib/eal/x86/include -I../lib/eal/x86/include -Ilib/eal/common -I../lib/eal/common -Ilib/eal -I../lib/eal -Ilib/kvargs -I../lib/kvargs -Ilib/metrics -I../lib/metrics -Ilib/telemetry -I../lib/telemetry -Ilib/net -I../lib/net -Ilib/mbuf -I../lib/mbuf -Ilib/mempool -I../lib/mempool -Ilib/ring -I../lib/ring -Ilib/meter -I../lib/meter -Idrivers/bus/pci -I../drivers/bus/pci -I../drivers/bus/pci/linux -Ilib/pci -I../lib/pci -Idrivers/bus/vdev -I../drivers/bus/vdev -Idrivers/common/sfc_efx -I../drivers/common/sfc_efx -Idrivers/common/sfc_efx/base -I../drivers/common/sfc_efx/base -fdiagnostics-color=always -pipe -D_FILE_OFFSET_BITS=64 -Wall -Winvalid-pch -Werror -O3 -include rte_config.h -Wextra -Wcast-qual -Wdeprecated -Wformat -Wformat-nonliteral -Wformat-security -Wmissing-declarations -Wmissing-prototypes -Wnested-externs -Wold-style-definition -Wpointer-arith -Wsign-compare -Wstrict-prototypes -Wundef -Wwrite-strings -Wno-address-of-packed-member -Wno-packed-not-aligned -Wno-missing-field-initializers -Wno-zero-length-bounds -D_GNU_SOURCE -fPIC -march=native -DALLOW_EXPERIMENTAL_API -DALLOW_INTERNAL_API -Wno-format-truncation -Wno-strict-aliasing -Wdisabled-optimization -Waggregate-return -Wbad-function-cast -DRTE_LOG_DEFAULT_LOGTYPE=pmd.net.sfc -MD -MQ drivers/libtmp_rte_net_sfc.a.p/net_sfc_sfc_flow.c.o -MF drivers/libtmp_rte_net_sfc.a.p/net_sfc_sfc_flow.c.o.d -o drivers/libtmp_rte_net_sfc.a.p/net_sfc_sfc_flow.c.o -c ../drivers/net/sfc/sfc_flow.c
../drivers/net/sfc/sfc_flow.c: In function ‘sfc_flow_query’:
../drivers/net/sfc/sfc_flow.c:2815:19: error: ‘SFC_ETHDEV_STARTED’ undeclared (first use in this function); did you mean ‘SFC_ADAPTER_STARTED’?
 2815 |  if (sa->state != SFC_ETHDEV_STARTED) {
      |                   ^~~~~~~~~~~~~~~~~~
      |                   SFC_ADAPTER_STARTED
../drivers/net/sfc/sfc_flow.c:2815:19: note: each undeclared identifier is reported only once for each function it appears in
[1631/2754] Compiling C object drivers/libtmp_rte_net_sfc.a.p/net_sfc_sfc_tx.c.o
[1632/2754] Compiling C object drivers/libtmp_rte_net_sfc.a.p/net_sfc_sfc_mae_counter.c.o
[1633/2754] Compiling C object drivers/libtmp_rte_net_sfc.a.p/net_sfc_sfc_ef10_essb_rx.c.o
[1634/2754] Compiling C object drivers/libtmp_rte_net_sfc.a.p/net_sfc_sfc_mae.c.o
[1635/2754] Compiling C object drivers/libtmp_rte_net_sfc.a.p/net_sfc_sfc_ef10_rx.c.o
[1636/2754] Compiling C object drivers/libtmp_rte_net_octeontx2.a.p/net_octeontx2_otx2_tx.c.o
[1637/2754] Compiling C object drivers/libtmp_rte_net_sfc.a.p/net_sfc_sfc_ef100_rx.c.o
[1638/2754] Compiling C object drivers/libtmp_rte_net_sfc.a.p/net_sfc_sfc_ef10_tx.c.o
[1639/2754] Compiling C object drivers/libtmp_rte_net_octeontx2.a.p/net_octeontx2_otx2_rx.c.o
ninja: build stopped




*Build Failed #18:
OS: UB2004-64
Target: x86_64-native-linuxapp-doc
FAILED: drivers/a715181@@tmp_rte_net_sfc@sta/net_sfc_sfc_flow.c.o 
gcc -Idrivers/a715181@@tmp_rte_net_sfc@sta -Idrivers -I../drivers -Idrivers/net/sfc -I../drivers/net/sfc -Ilib/ethdev -I../lib/ethdev -I. -I../ -Iconfig -I../config -Ilib/eal/include -I../lib/eal/include -Ilib/eal/linux/include -I../lib/eal/linux/include -Ilib/eal/x86/include -I../lib/eal/x86/include -Ilib/eal/common -I../lib/eal/common -Ilib/eal -I../lib/eal -Ilib/kvargs -I../lib/kvargs -Ilib/telemetry/../metrics -I../lib/telemetry/../metrics -Ilib/telemetry -I../lib/telemetry -Ilib/net -I../lib/net -Ilib/mbuf -I../lib/mbuf -Ilib/mempool -I../lib/mempool -Ilib/ring -I../lib/ring -Ilib/meter -I../lib/meter -Idrivers/bus/pci -I../drivers/bus/pci -I../drivers/bus/pci/linux -Ilib/pci -I../lib/pci -Idrivers/bus/vdev -I../drivers/bus/vdev -Idrivers/common/sfc_efx -I../drivers/common/sfc_efx -Idrivers/common/sfc_efx/base -I../drivers/common/sfc_efx/base -fdiagnostics-color=always -pipe -D_FILE_OFFSET_BITS=64 -Wall -Winvalid-pch -Werror -O3 -include rte_config.h -Wextra -Wcast-qual -Wdeprecated -Wformat -Wformat-nonliteral -Wformat-security -Wmissing-declarations -Wmissing-prototypes -Wnested-externs -Wold-style-definition -Wpointer-arith -Wsign-compare -Wstrict-prototypes -Wundef -Wwrite-strings -Wno-address-of-packed-member -Wno-packed-not-aligned -Wno-missing-field-initializers -Wno-zero-length-bounds -D_GNU_SOURCE -fPIC -march=native -DALLOW_EXPERIMENTAL_API -DALLOW_INTERNAL_API -Wno-format-truncation -Wno-strict-aliasing -Wdisabled-optimization -Waggregate-return -Wbad-function-cast -DRTE_LOG_DEFAULT_LOGTYPE=pmd.net.sfc -MD -MQ 'drivers/a715181@@tmp_rte_net_sfc@sta/net_sfc_sfc_flow.c.o' -MF 'drivers/a715181@@tmp_rte_net_sfc@sta/net_sfc_sfc_flow.c.o.d' -o 'drivers/a715181@@tmp_rte_net_sfc@sta/net_sfc_sfc_flow.c.o' -c ../drivers/net/sfc/sfc_flow.c
../drivers/net/sfc/sfc_flow.c: In function ‘sfc_flow_query’:
../drivers/net/sfc/sfc_flow.c:2815:19: error: ‘SFC_ETHDEV_STARTED’ undeclared (first use in this function); did you mean ‘SFC_ADAPTER_STARTED’?
 2815 |  if (sa->state != SFC_ETHDEV_STARTED) {
      |                   ^~~~~~~~~~~~~~~~~~
      |                   SFC_ADAPTER_STARTED
../drivers/net/sfc/sfc_flow.c:2815:19: note: each undeclared identifier is reported only once for each function it appears in
[1611/2503] Generating rte_net_qede.pmd.c with a custom command.
[1612/2503] Compiling C object 'drivers/a715181@@tmp_rte_net_sfc@sta/net_sfc_sfc_mae_counter.c.o'.
[1613/2503] Compiling C object 'drivers/a715181@@tmp_rte_net_sfc@sta/net_sfc_sfc_ef10_rx.c.o'.
[1614/2503] Compiling C object 'drivers/a715181@@tmp_rte_net_sfc@sta/net_sfc_sfc_ef10_essb_rx.c.o'.
[1615/2503] Compiling C object 'drivers/a715181@@tmp_rte_net_sfc@sta/net_sfc_sfc_ef100_rx.c.o'.
[1616/2503] Compiling C object 'drivers/a715181@@tmp_rte_net_sfc@sta/net_sfc_sfc_mae.c.o'.
[1617/2503] Compiling C object 'drivers/a715181@@tmp_rte_net_sfc@sta/net_sfc_sfc_ef10_tx.c.o'.
[1618/2503] Compiling C object 'drivers/a715181@@tmp_rte_net_octeontx2@sta/net_octeontx2_otx2_tx.c.o'.
[1619/2503] Compiling C object 'drivers/a715181@@tmp_rte_net_octeontx2@sta/net_octeontx2_otx2_rx.c.o'.
ninja: build stopped




*Build Failed #19:
OS: FC34-64
Target: x86_64-native-linuxapp-gcc
FAILED: drivers/libtmp_rte_net_sfc.a.p/net_sfc_sfc_flow.c.o 
gcc -Idrivers/libtmp_rte_net_sfc.a.p -Idrivers -I../drivers -Idrivers/net/sfc -I../drivers/net/sfc -Ilib/ethdev -I../lib/ethdev -I. -I.. -Iconfig -I../config -Ilib/eal/include -I../lib/eal/include -Ilib/eal/linux/include -I../lib/eal/linux/include -Ilib/eal/x86/include -I../lib/eal/x86/include -Ilib/eal/common -I../lib/eal/common -Ilib/eal -I../lib/eal -Ilib/kvargs -I../lib/kvargs -Ilib/metrics -I../lib/metrics -Ilib/telemetry -I../lib/telemetry -Ilib/net -I../lib/net -Ilib/mbuf -I../lib/mbuf -Ilib/mempool -I../lib/mempool -Ilib/ring -I../lib/ring -Ilib/meter -I../lib/meter -Idrivers/bus/pci -I../drivers/bus/pci -I../drivers/bus/pci/linux -Ilib/pci -I../lib/pci -Idrivers/bus/vdev -I../drivers/bus/vdev -Idrivers/common/sfc_efx -I../drivers/common/sfc_efx -Idrivers/common/sfc_efx/base -I../drivers/common/sfc_efx/base -fdiagnostics-color=always -pipe -D_FILE_OFFSET_BITS=64 -Wall -Winvalid-pch -Werror -O3 -include rte_config.h -Wextra -Wcast-qual -Wdeprecated -Wformat -Wformat-nonliteral -Wformat-security -Wmissing-declarations -Wmissing-prototypes -Wnested-externs -Wold-style-definition -Wpointer-arith -Wsign-compare -Wstrict-prototypes -Wundef -Wwrite-strings -Wno-address-of-packed-member -Wno-packed-not-aligned -Wno-missing-field-initializers -Wno-zero-length-bounds -D_GNU_SOURCE -fPIC -march=native -DALLOW_EXPERIMENTAL_API -DALLOW_INTERNAL_API -Wno-format-truncation -Wno-strict-aliasing -Wdisabled-optimization -Waggregate-return -Wbad-function-cast -DRTE_LOG_DEFAULT_LOGTYPE=pmd.net.sfc -MD -MQ drivers/libtmp_rte_net_sfc.a.p/net_sfc_sfc_flow.c.o -MF drivers/libtmp_rte_net_sfc.a.p/net_sfc_sfc_flow.c.o.d -o drivers/libtmp_rte_net_sfc.a.p/net_sfc_sfc_flow.c.o -c ../drivers/net/sfc/sfc_flow.c
../drivers/net/sfc/sfc_flow.c: In function ‘sfc_flow_query’:
../drivers/net/sfc/sfc_flow.c:2815:26: error: ‘SFC_ETHDEV_STARTED’ undeclared (first use in this function); did you mean ‘SFC_ADAPTER_STARTED’?
 2815 |         if (sa->state != SFC_ETHDEV_STARTED) {
      |                          ^~~~~~~~~~~~~~~~~~
      |                          SFC_ADAPTER_STARTED
../drivers/net/sfc/sfc_flow.c:2815:26: note: each undeclared identifier is reported only once for each function it appears in
[1634/2753] Compiling C object drivers/libtmp_rte_net_sfc.a.p/net_sfc_sfc_mae_counter.c.o
[1635/2753] Compiling C object drivers/libtmp_rte_net_sfc.a.p/net_sfc_sfc_service.c.o
[1636/2753] Compiling C object drivers/libtmp_rte_net_qede.a.p/net_qede_qede_debug.c.o
[1637/2753] Compiling C object drivers/libtmp_rte_net_sfc.a.p/net_sfc_sfc_mae.c.o
[1638/2753] Compiling C object drivers/libtmp_rte_net_sfc.a.p/net_sfc_sfc_ef10_essb_rx.c.o
[1639/2753] Compiling C object drivers/libtmp_rte_net_sfc.a.p/net_sfc_sfc_ef10_rx.c.o
[1640/2753] Compiling C object drivers/libtmp_rte_net_sfc.a.p/net_sfc_sfc_ef100_rx.c.o
[1641/2753] Compiling C object drivers/libtmp_rte_net_sfc.a.p/net_sfc_sfc_ef100_tx.c.o
[1642/2753] Compiling C object drivers/libtmp_rte_net_sfc.a.p/net_sfc_sfc_ef10_tx.c.o
[1643/2753] Compiling C object drivers/libtmp_rte_net_octeontx2.a.p/net_octeontx2_otx2_tx.c.o
[1644/2753] Compiling C object drivers/libtmp_rte_net_octeontx2.a.p/net_octeontx2_otx2_rx.c.o
ninja: build stopped




*Build Failed #20:
OS: FC34-64
Target: x86_64-native-linuxapp-clang
FAILED: drivers/libtmp_rte_net_sfc.a.p/net_sfc_sfc_flow.c.o 
clang -Idrivers/libtmp_rte_net_sfc.a.p -Idrivers -I../drivers -Idrivers/net/sfc -I../drivers/net/sfc -Ilib/ethdev -I../lib/ethdev -I. -I.. -Iconfig -I../config -Ilib/eal/include -I../lib/eal/include -Ilib/eal/linux/include -I../lib/eal/linux/include -Ilib/eal/x86/include -I../lib/eal/x86/include -Ilib/eal/common -I../lib/eal/common -Ilib/eal -I../lib/eal -Ilib/kvargs -I../lib/kvargs -Ilib/metrics -I../lib/metrics -Ilib/telemetry -I../lib/telemetry -Ilib/net -I../lib/net -Ilib/mbuf -I../lib/mbuf -Ilib/mempool -I../lib/mempool -Ilib/ring -I../lib/ring -Ilib/meter -I../lib/meter -Idrivers/bus/pci -I../drivers/bus/pci -I../drivers/bus/pci/linux -Ilib/pci -I../lib/pci -Idrivers/bus/vdev -I../drivers/bus/vdev -Idrivers/common/sfc_efx -I../drivers/common/sfc_efx -Idrivers/common/sfc_efx/base -I../drivers/common/sfc_efx/base -Xclang -fcolor-diagnostics -pipe -D_FILE_OFFSET_BITS=64 -Wall -Winvalid-pch -Werror -O3 -include rte_config.h -Wextra -Wcast-qual -Wdeprecated -Wformat -Wformat-nonliteral -Wformat-security -Wmissing-declarations -Wmissing-prototypes -Wnested-externs -Wold-style-definition -Wpointer-arith -Wsign-compare -Wstrict-prototypes -Wundef -Wwrite-strings -Wno-address-of-packed-member -Wno-missing-field-initializers -D_GNU_SOURCE -fPIC -march=native -DALLOW_EXPERIMENTAL_API -DALLOW_INTERNAL_API -Wno-strict-aliasing -Wdisabled-optimization -Waggregate-return -Wbad-function-cast -DRTE_LOG_DEFAULT_LOGTYPE=pmd.net.sfc -MD -MQ drivers/libtmp_rte_net_sfc.a.p/net_sfc_sfc_flow.c.o -MF drivers/libtmp_rte_net_sfc.a.p/net_sfc_sfc_flow.c.o.d -o drivers/libtmp_rte_net_sfc.a.p/net_sfc_sfc_flow.c.o -c ../drivers/net/sfc/sfc_flow.c
../drivers/net/sfc/sfc_flow.c:2815:19: error: use of undeclared identifier 'SFC_ETHDEV_STARTED'; did you mean 'SFC_ADAPTER_STARTED'?
        if (sa->state != SFC_ETHDEV_STARTED) {
                         ^~~~~~~~~~~~~~~~~~
                         SFC_ADAPTER_STARTED
../drivers/net/sfc/sfc.h:83:2: note: 'SFC_ADAPTER_STARTED' declared here
        SFC_ADAPTER_STARTED,
        ^
1 error generated.
[1643/2753] Generating rte_net_softnic_mingw with a custom command
[1644/2753] Compiling C object drivers/libtmp_rte_net_sfc.a.p/net_sfc_sfc_service.c.o
[1645/2753] Compiling C object drivers/libtmp_rte_net_sfc.a.p/net_sfc_sfc_ef10_essb_rx.c.o
[1646/2753] Compiling C object drivers/libtmp_rte_net_octeontx2.a.p/net_octeontx2_otx2_rx.c.o
[1647/2753] Compiling C object drivers/libtmp_rte_net_sfc.a.p/net_sfc_sfc_ef10_rx.c.o
[1648/2753] Compiling C object drivers/libtmp_rte_net_sfc.a.p/net_sfc_sfc_mae.c.o
[1649/2753] Compiling C object drivers/libtmp_rte_net_sfc.a.p/net_sfc_sfc_ef100_rx.c.o
[1650/2753] Compiling C object drivers/libtmp_rte_net_sfc.a.p/net_sfc_sfc_ef10_tx.c.o
[1651/2753] Compiling C object drivers/libtmp_rte_net_sfc.a.p/net_sfc_sfc_ef100_tx.c.o
ninja: build stopped


DPDK STV team

^ permalink raw reply	[flat|nested] 3+ messages in thread

* [dpdk-test-report] |FAILURE| pw(93898) sid(17238) [v2, 20/20] net/sfc: support flow API query for count actions
@ 2021-06-11  3:26 sys_stv
  0 siblings, 0 replies; 3+ messages in thread
From: sys_stv @ 2021-06-11  3:26 UTC (permalink / raw)
  To: test-report

[-- Attachment #1: Type: text/plain, Size: 64328 bytes --]


Test-Label: Intel-compilation
Test-Status: FAILURE
http://dpdk.org/patch/93898

_Compilation issues_

Submitter: Andrew Rybchenko <Andrew.Rybchenko@oktetlabs.ru>
Date: 2021-06-04 14:24:14
Reply_mail: 20210604142414.283611-21-andrew.rybchenko@oktetlabs.ru

DPDK git baseline: Repo:dpdk-next-net, CommitID: 64307fad7d2b6af3be5e19833e404312f01f6ce5


Meson Build Summary: 22 Builds Done, 2 Successful, 20 Failures, 0 Blocked

+------------------+------------+--------------+------------+------------+-----------+----------+
| os               | gcc-static | clang-static | icc-static | gcc-shared | gcc-debug | document |
+------------------+------------+--------------+------------+------------+-----------+----------+
| UB2004-64        | fail       | fail         | fail       |            |           | fail     |
| RHEL83-64        | fail       |              |            |            |           |          |
| FC34-64          | fail       | fail         |            |            |           |          |
| CentOsStream8-64 | fail       |              |            |            |           |          |
| UB2104-64        | fail       |              |            |            |           |          |
| WIN10-64         |            | pass         |            |            |           |          |
| UB2004-32        | pass       |              |            |            |           |          |
| CENTOS83-64      | fail       | fail         | fail       | fail       | fail      |          |
| FreeBSD1201-64   | fail       | fail         |            | fail       | fail      |          |
| SUSE15-64        | fail       | fail         |            |            |           |          |
+------------------+------------+--------------+------------+------------+-----------+----------+
Test environment and configuration as below:


OS: UB2004-64
	Kernel Version: 5.8.0-48-generic
	GCC Version: gcc (Ubuntu 10.2.0-5ubuntu1~20.04) 10.2.0
	Clang Version: 10.0.0-4ubuntu1
	x86_64-native-linuxapp-clang
	x86_64-native-linuxapp-gcc
	x86_64-native-linuxapp-icc
	x86_64-native-linuxapp-doc

OS: RHEL83-64
	Kernel Version: 4.18.0-240.el8.x86_64
	GCC Version: gcc (GCC) 8.3.1 20191121 (Red Hat 8.3.1-5)
	Clang Version: 10.0.1 (Red Hat 10.0.1-1.module+el8.3.0+7459+90c24896)
	x86_64-native-linuxapp-gcc

OS: FC34-64
	Kernel Version: 5.11.15-300.fc34.x86_64
	GCC Version: gcc (GCC) 11.0.1 20210324 (Red Hat 11.0.1-0)
	Clang Version: 12.0.0 (Fedora 12.0.0-0.3.rc1.fc34)
	x86_64-native-linuxapp-gcc
	x86_64-native-linuxapp-clang

OS: CentOsStream8-64
	Kernel Version: 4.18.0-257.el8.x86_64
	GCC Version: gcc (GCC) 8.4.1 20200928 (Red Hat 8.4.1-1)
	Clang Version: 11.0.0 (Red Hat 11.0.0-0.2.rc2.module_el8.4.0+533+50191577)
	x86_64-native-linuxapp-gcc

OS: UB2104-64
	Kernel Version: 5.11.0-16-generic
	GCC Version: gcc (Ubuntu 10.3.0-1ubuntu1) 10.3.0
	Clang Version: 12.0.0-1ubuntu1
	x86_64-native-linuxapp-gcc

OS: WIN10-64
	Kernel Version: N/A
	GCC Version: N/A
	Clang Version: Clang 8.0.0
	x86_64-windows-clang

OS: UB2004-32
	Kernel Version: 5.8.0-48-generic
	GCC Version: gcc (Ubuntu 10.2.0-5ubuntu1~20.04) 10.2.0
	Clang Version: 10.0.0-4ubuntu1
	i686-native-linuxapp-gcc

OS: CENTOS83-64
	Kernel Version: 4.18.0-240.1.1.el8_3.x86_64
	GCC Version: gcc (GCC) 8.3.1 20191121 (Red Hat 8.3.1-5)
	Clang Version: 10.0.1 (Red Hat 10.0.1-1.module_el8.3.0+467+cb298d5b)
	x86_64-native-linuxapp-gcc
	x86_64-native-linuxapp-clang
	x86_64-native-linuxapp-icc
	x86_64-native-linuxapp-gcc+shared
	x86_64-native-linuxapp-gcc+debug

OS: FreeBSD1201-64
	Kernel Version: 12.1-RELEASE
	GCC Version: gcc (FreeBSD Ports Collection) 9.2.0
	Clang Version: 8.0.1 (tags/RELEASE_801/final 366581) (based on LLVM 8.0.1)
	x86_64-native-bsdapp-gcc
	x86_64-native-bsdapp-clang
	x86_64-native-bsdapp-gcc+shared
	x86_64-native-bsdapp-gcc+debug

OS: SUSE15-64
	Kernel Version: 5.3.18-lp152.57-default
	GCC Version: gcc (SUSE Linux) 7.5.0
	Clang Version: 9.0.1
	x86_64-native-linuxapp-clang
	x86_64-native-linuxapp-gcc



*Build Failed #1:
OS: CENTOS83-64
Target: x86_64-native-linuxapp-gcc
FAILED: drivers/libtmp_rte_net_sfc.a.p/net_sfc_sfc_flow.c.o 
gcc -Idrivers/libtmp_rte_net_sfc.a.p -Idrivers -I../drivers -Idrivers/net/sfc -I../drivers/net/sfc -Ilib/ethdev -I../lib/ethdev -I. -I.. -Iconfig -I../config -Ilib/eal/include -I../lib/eal/include -Ilib/eal/linux/include -I../lib/eal/linux/include -Ilib/eal/x86/include -I../lib/eal/x86/include -Ilib/eal/common -I../lib/eal/common -Ilib/eal -I../lib/eal -Ilib/kvargs -I../lib/kvargs -Ilib/metrics -I../lib/metrics -Ilib/telemetry -I../lib/telemetry -Ilib/net -I../lib/net -Ilib/mbuf -I../lib/mbuf -Ilib/mempool -I../lib/mempool -Ilib/ring -I../lib/ring -Ilib/meter -I../lib/meter -Idrivers/bus/pci -I../drivers/bus/pci -I../drivers/bus/pci/linux -Ilib/pci -I../lib/pci -Idrivers/bus/vdev -I../drivers/bus/vdev -Idrivers/common/sfc_efx -I../drivers/common/sfc_efx -Idrivers/common/sfc_efx/base -I../drivers/common/sfc_efx/base -fdiagnostics-color=always -pipe -D_FILE_OFFSET_BITS=64 -Wall -Winvalid-pch -Werror -O3 -include rte_config.h -Wextra -Wcast-qual -Wdeprecated -Wformat -Wformat-nonliteral -Wformat-security -Wmissing-declarations -Wmissing-prototypes -Wnested-externs -Wold-style-definition -Wpointer-arith -Wsign-compare -Wstrict-prototypes -Wundef -Wwrite-strings -Wno-packed-not-aligned -Wno-missing-field-initializers -D_GNU_SOURCE -fPIC -march=native -DALLOW_EXPERIMENTAL_API -DALLOW_INTERNAL_API -Wno-format-truncation -Wno-strict-aliasing -Wdisabled-optimization -Waggregate-return -Wbad-function-cast -DRTE_LOG_DEFAULT_LOGTYPE=pmd.net.sfc -MD -MQ drivers/libtmp_rte_net_sfc.a.p/net_sfc_sfc_flow.c.o -MF drivers/libtmp_rte_net_sfc.a.p/net_sfc_sfc_flow.c.o.d -o drivers/libtmp_rte_net_sfc.a.p/net_sfc_sfc_flow.c.o -c ../drivers/net/sfc/sfc_flow.c
../drivers/net/sfc/sfc_flow.c: In function ‘sfc_flow_query’:
../drivers/net/sfc/sfc_flow.c:2815:19: error: ‘SFC_ETHDEV_STARTED’ undeclared (first use in this function); did you mean ‘SFC_ADAPTER_STARTED’?
  if (sa->state != SFC_ETHDEV_STARTED) {
                   ^~~~~~~~~~~~~~~~~~
                   SFC_ADAPTER_STARTED
../drivers/net/sfc/sfc_flow.c:2815:19: note: each undeclared identifier is reported only once for each function it appears in
[1634/2751] Compiling C object drivers/libtmp_rte_net_sfc.a.p/net_sfc_sfc_service.c.o
[1635/2751] Compiling C object drivers/libtmp_rte_net_sfc.a.p/net_sfc_sfc_mae_counter.c.o
[1636/2751] Generating rte_net_qede.pmd.c with a custom command
[1637/2751] Compiling C object drivers/libtmp_rte_net_sfc.a.p/net_sfc_sfc_ef10_essb_rx.c.o
[1638/2751] Compiling C object drivers/libtmp_rte_net_sfc.a.p/net_sfc_sfc_mae.c.o
[1639/2751] Compiling C object drivers/libtmp_rte_net_sfc.a.p/net_sfc_sfc_ef100_rx.c.o
[1640/2751] Compiling C object drivers/libtmp_rte_net_sfc.a.p/net_sfc_sfc_ef10_rx.c.o
[1641/2751] Compiling C object drivers/libtmp_rte_net_sfc.a.p/net_sfc_sfc_ef100_tx.c.o
[1642/2751] Compiling C object drivers/libtmp_rte_net_sfc.a.p/net_sfc_sfc_ef10_tx.c.o
[1643/2751] Compiling C object drivers/libtmp_rte_net_octeontx2.a.p/net_octeontx2_otx2_rx.c.o
[1644/2751] Compiling C object drivers/libtmp_rte_net_octeontx2.a.p/net_octeontx2_otx2_tx.c.o
ninja: build stopped




*Build Failed #2:
OS: CENTOS83-64
Target: x86_64-native-linuxapp-clang
FAILED: drivers/libtmp_rte_net_sfc.a.p/net_sfc_sfc_flow.c.o 
clang -Idrivers/libtmp_rte_net_sfc.a.p -Idrivers -I../drivers -Idrivers/net/sfc -I../drivers/net/sfc -Ilib/ethdev -I../lib/ethdev -I. -I.. -Iconfig -I../config -Ilib/eal/include -I../lib/eal/include -Ilib/eal/linux/include -I../lib/eal/linux/include -Ilib/eal/x86/include -I../lib/eal/x86/include -Ilib/eal/common -I../lib/eal/common -Ilib/eal -I../lib/eal -Ilib/kvargs -I../lib/kvargs -Ilib/metrics -I../lib/metrics -Ilib/telemetry -I../lib/telemetry -Ilib/net -I../lib/net -Ilib/mbuf -I../lib/mbuf -Ilib/mempool -I../lib/mempool -Ilib/ring -I../lib/ring -Ilib/meter -I../lib/meter -Idrivers/bus/pci -I../drivers/bus/pci -I../drivers/bus/pci/linux -Ilib/pci -I../lib/pci -Idrivers/bus/vdev -I../drivers/bus/vdev -Idrivers/common/sfc_efx -I../drivers/common/sfc_efx -Idrivers/common/sfc_efx/base -I../drivers/common/sfc_efx/base -Xclang -fcolor-diagnostics -pipe -D_FILE_OFFSET_BITS=64 -Wall -Winvalid-pch -Werror -O3 -include rte_config.h -Wextra -Wcast-qual -Wdeprecated -Wformat -Wformat-nonliteral -Wformat-security -Wmissing-declarations -Wmissing-prototypes -Wnested-externs -Wold-style-definition -Wpointer-arith -Wsign-compare -Wstrict-prototypes -Wundef -Wwrite-strings -Wno-address-of-packed-member -Wno-missing-field-initializers -D_GNU_SOURCE -fPIC -march=native -DALLOW_EXPERIMENTAL_API -DALLOW_INTERNAL_API -Wno-strict-aliasing -Wdisabled-optimization -Waggregate-return -Wbad-function-cast -DRTE_LOG_DEFAULT_LOGTYPE=pmd.net.sfc -MD -MQ drivers/libtmp_rte_net_sfc.a.p/net_sfc_sfc_flow.c.o -MF drivers/libtmp_rte_net_sfc.a.p/net_sfc_sfc_flow.c.o.d -o drivers/libtmp_rte_net_sfc.a.p/net_sfc_sfc_flow.c.o -c ../drivers/net/sfc/sfc_flow.c
../drivers/net/sfc/sfc_flow.c:2815:19: error: use of undeclared identifier 'SFC_ETHDEV_STARTED'; did you mean 'SFC_ADAPTER_STARTED'?
        if (sa->state != SFC_ETHDEV_STARTED) {
                         ^~~~~~~~~~~~~~~~~~
                         SFC_ADAPTER_STARTED
../drivers/net/sfc/sfc.h:83:2: note: 'SFC_ADAPTER_STARTED' declared here
        SFC_ADAPTER_STARTED,
        ^
1 error generated.
[1642/2754] Compiling C object drivers/libtmp_rte_net_sfc.a.p/net_sfc_sfc_mae_counter.c.o
[1643/2754] Compiling C object drivers/libtmp_rte_net_sfc.a.p/net_sfc_sfc_service.c.o
[1644/2754] Compiling C object drivers/libtmp_rte_net_sfc.a.p/net_sfc_sfc_mae.c.o
[1645/2754] Compiling C object drivers/libtmp_rte_net_sfc.a.p/net_sfc_sfc_ef10_essb_rx.c.o
[1646/2754] Compiling C object drivers/libtmp_rte_net_sfc.a.p/net_sfc_sfc_ef10_tx.c.o
[1647/2754] Compiling C object drivers/libtmp_rte_net_sfc.a.p/net_sfc_sfc_ef10_rx.c.o
[1648/2754] Compiling C object drivers/libtmp_rte_net_sfc.a.p/net_sfc_sfc_ef100_rx.c.o
[1649/2754] Compiling C object drivers/libtmp_rte_net_sfc.a.p/net_sfc_sfc_ef100_tx.c.o
[1650/2754] Compiling C object drivers/libtmp_rte_net_octeontx2.a.p/net_octeontx2_otx2_rx.c.o
ninja: build stopped




*Build Failed #3:
OS: CENTOS83-64
Target: x86_64-native-linuxapp-icc
FAILED: drivers/libtmp_rte_net_sfc.a.p/net_sfc_sfc_flow.c.o 
icc -Idrivers/libtmp_rte_net_sfc.a.p -Idrivers -I../drivers -Idrivers/net/sfc -I../drivers/net/sfc -Ilib/ethdev -I../lib/ethdev -I. -I.. -Iconfig -I../config -Ilib/eal/include -I../lib/eal/include -Ilib/eal/linux/include -I../lib/eal/linux/include -Ilib/eal/x86/include -I../lib/eal/x86/include -Ilib/eal/common -I../lib/eal/common -Ilib/eal -I../lib/eal -Ilib/kvargs -I../lib/kvargs -Ilib/metrics -I../lib/metrics -Ilib/telemetry -I../lib/telemetry -Ilib/net -I../lib/net -Ilib/mbuf -I../lib/mbuf -Ilib/mempool -I../lib/mempool -Ilib/ring -I../lib/ring -Ilib/meter -I../lib/meter -Idrivers/bus/pci -I../drivers/bus/pci -I../drivers/bus/pci/linux -Ilib/pci -I../lib/pci -Idrivers/bus/vdev -I../drivers/bus/vdev -Idrivers/common/sfc_efx -I../drivers/common/sfc_efx -Idrivers/common/sfc_efx/base -I../drivers/common/sfc_efx/base -pipe -D_FILE_OFFSET_BITS=64 -Wall -w3 -diag-disable:remark -Werror -O3 -include rte_config.h -Wextra -Wcast-qual -Wdeprecated -Wformat -Wformat-security -Wmissing-declarations -Wmissing-prototypes -Wold-style-definition -Wpointer-arith -Wsign-compare -Wstrict-prototypes -Wundef -Wwrite-strings -Wno-missing-field-initializers -diag-disable=181 -diag-disable=188 -diag-disable=2203 -diag-disable=2279 -diag-disable=2557 -diag-disable=3179 -diag-disable=3656 -D_GNU_SOURCE -fPIC -march=native -DALLOW_EXPERIMENTAL_API -DALLOW_INTERNAL_API -Wno-strict-aliasing -Wdisabled-optimization -DRTE_LOG_DEFAULT_LOGTYPE=pmd.net.sfc -MD -MQ drivers/libtmp_rte_net_sfc.a.p/net_sfc_sfc_flow.c.o -MF drivers/libtmp_rte_net_sfc.a.p/net_sfc_sfc_flow.c.o.d -o drivers/libtmp_rte_net_sfc.a.p/net_sfc_sfc_flow.c.o -c ../drivers/net/sfc/sfc_flow.c
../drivers/net/sfc/sfc_flow.c(2815): error: identifier "SFC_ETHDEV_STARTED" is undefined
  	if (sa->state != SFC_ETHDEV_STARTED) {
  	                 ^

compilation aborted for ../drivers/net/sfc/sfc_flow.c (code 2)
[1621/2751] Linking target drivers/librte_net_ring.so.21.3
[1622/2751] Compiling C object drivers/libtmp_rte_net_sfc.a.p/net_sfc_sfc_dp.c.o
[1623/2751] Compiling C object drivers/libtmp_rte_net_sfc.a.p/net_sfc_sfc_rx.c.o
[1624/2751] Compiling C object drivers/libtmp_rte_net_sfc.a.p/net_sfc_sfc_tx.c.o
[1625/2751] Compiling C object drivers/libtmp_rte_net_sfc.a.p/net_sfc_sfc_mae_counter.c.o
[1626/2751] Compiling C object drivers/libtmp_rte_net_qede.a.p/net_qede_qede_rxtx.c.o
[1627/2751] Compiling C object drivers/libtmp_rte_net_sfc.a.p/net_sfc_sfc_mae.c.o
[1628/2751] Compiling C object drivers/libtmp_rte_net_pcap.a.p/net_pcap_pcap_ethdev.c.o
[1629/2751] Compiling C object drivers/libtmp_rte_net_qede.a.p/net_qede_qede_debug.c.o
[1630/2751] Compiling C object drivers/libtmp_rte_net_octeontx2.a.p/net_octeontx2_otx2_rx.c.o
[1631/2751] Compiling C object drivers/libtmp_rte_net_octeontx2.a.p/net_octeontx2_otx2_tx.c.o
ninja: build stopped




*Build Failed #4:
OS: CENTOS83-64
Target: x86_64-native-linuxapp-gcc+shared
FAILED: drivers/libtmp_rte_net_sfc.a.p/net_sfc_sfc_flow.c.o 
gcc -Idrivers/libtmp_rte_net_sfc.a.p -Idrivers -I../drivers -Idrivers/net/sfc -I../drivers/net/sfc -Ilib/ethdev -I../lib/ethdev -I. -I.. -Iconfig -I../config -Ilib/eal/include -I../lib/eal/include -Ilib/eal/linux/include -I../lib/eal/linux/include -Ilib/eal/x86/include -I../lib/eal/x86/include -Ilib/eal/common -I../lib/eal/common -Ilib/eal -I../lib/eal -Ilib/kvargs -I../lib/kvargs -Ilib/metrics -I../lib/metrics -Ilib/telemetry -I../lib/telemetry -Ilib/net -I../lib/net -Ilib/mbuf -I../lib/mbuf -Ilib/mempool -I../lib/mempool -Ilib/ring -I../lib/ring -Ilib/meter -I../lib/meter -Idrivers/bus/pci -I../drivers/bus/pci -I../drivers/bus/pci/linux -Ilib/pci -I../lib/pci -Idrivers/bus/vdev -I../drivers/bus/vdev -Idrivers/common/sfc_efx -I../drivers/common/sfc_efx -Idrivers/common/sfc_efx/base -I../drivers/common/sfc_efx/base -fdiagnostics-color=always -pipe -D_FILE_OFFSET_BITS=64 -Wall -Winvalid-pch -Werror -O3 -include rte_config.h -Wextra -Wcast-qual -Wdeprecated -Wformat -Wformat-nonliteral -Wformat-security -Wmissing-declarations -Wmissing-prototypes -Wnested-externs -Wold-style-definition -Wpointer-arith -Wsign-compare -Wstrict-prototypes -Wundef -Wwrite-strings -Wno-packed-not-aligned -Wno-missing-field-initializers -D_GNU_SOURCE -fPIC -march=native -DALLOW_EXPERIMENTAL_API -DALLOW_INTERNAL_API -Wno-format-truncation -Wno-strict-aliasing -Wdisabled-optimization -Waggregate-return -Wbad-function-cast -DRTE_LOG_DEFAULT_LOGTYPE=pmd.net.sfc -MD -MQ drivers/libtmp_rte_net_sfc.a.p/net_sfc_sfc_flow.c.o -MF drivers/libtmp_rte_net_sfc.a.p/net_sfc_sfc_flow.c.o.d -o drivers/libtmp_rte_net_sfc.a.p/net_sfc_sfc_flow.c.o -c ../drivers/net/sfc/sfc_flow.c
../drivers/net/sfc/sfc_flow.c: In function ‘sfc_flow_query’:
../drivers/net/sfc/sfc_flow.c:2815:19: error: ‘SFC_ETHDEV_STARTED’ undeclared (first use in this function); did you mean ‘SFC_ADAPTER_STARTED’?
  if (sa->state != SFC_ETHDEV_STARTED) {
                   ^~~~~~~~~~~~~~~~~~
                   SFC_ADAPTER_STARTED
../drivers/net/sfc/sfc_flow.c:2815:19: note: each undeclared identifier is reported only once for each function it appears in
[1656/2586] Compiling C object drivers/libtmp_rte_net_qede.a.p/net_qede_qede_debug.c.o
[1657/2586] Compiling C object drivers/libtmp_rte_net_sfc.a.p/net_sfc_sfc_service.c.o
[1658/2586] Generating symbol file drivers/librte_net_ring.so.21.3.p/librte_net_ring.so.21.3.symbols
[1659/2586] Compiling C object drivers/libtmp_rte_net_sfc.a.p/net_sfc_sfc_ef10_essb_rx.c.o
[1660/2586] Compiling C object drivers/libtmp_rte_net_sfc.a.p/net_sfc_sfc_ef10_rx.c.o
[1661/2586] Compiling C object drivers/libtmp_rte_net_sfc.a.p/net_sfc_sfc_mae.c.o
[1662/2586] Compiling C object drivers/libtmp_rte_net_sfc.a.p/net_sfc_sfc_ef100_rx.c.o
[1663/2586] Compiling C object drivers/libtmp_rte_net_sfc.a.p/net_sfc_sfc_ef100_tx.c.o
[1664/2586] Compiling C object drivers/libtmp_rte_net_sfc.a.p/net_sfc_sfc_ef10_tx.c.o
[1665/2586] Compiling C object drivers/libtmp_rte_net_octeontx2.a.p/net_octeontx2_otx2_tx.c.o
[1666/2586] Compiling C object drivers/libtmp_rte_net_octeontx2.a.p/net_octeontx2_otx2_rx.c.o
ninja: build stopped




*Build Failed #5:
OS: CENTOS83-64
Target: x86_64-native-linuxapp-gcc+debug
FAILED: drivers/libtmp_rte_net_sfc.a.p/net_sfc_sfc_flow.c.o 
gcc -Idrivers/libtmp_rte_net_sfc.a.p -Idrivers -I../drivers -Idrivers/net/sfc -I../drivers/net/sfc -Ilib/ethdev -I../lib/ethdev -I. -I.. -Iconfig -I../config -Ilib/eal/include -I../lib/eal/include -Ilib/eal/linux/include -I../lib/eal/linux/include -Ilib/eal/x86/include -I../lib/eal/x86/include -Ilib/eal/common -I../lib/eal/common -Ilib/eal -I../lib/eal -Ilib/kvargs -I../lib/kvargs -Ilib/metrics -I../lib/metrics -Ilib/telemetry -I../lib/telemetry -Ilib/net -I../lib/net -Ilib/mbuf -I../lib/mbuf -Ilib/mempool -I../lib/mempool -Ilib/ring -I../lib/ring -Ilib/meter -I../lib/meter -Idrivers/bus/pci -I../drivers/bus/pci -I../drivers/bus/pci/linux -Ilib/pci -I../lib/pci -Idrivers/bus/vdev -I../drivers/bus/vdev -Idrivers/common/sfc_efx -I../drivers/common/sfc_efx -Idrivers/common/sfc_efx/base -I../drivers/common/sfc_efx/base -fdiagnostics-color=always -pipe -D_FILE_OFFSET_BITS=64 -Wall -Winvalid-pch -Werror -O2 -g -include rte_config.h -Wextra -Wcast-qual -Wdeprecated -Wformat -Wformat-nonliteral -Wformat-security -Wmissing-declarations -Wmissing-prototypes -Wnested-externs -Wold-style-definition -Wpointer-arith -Wsign-compare -Wstrict-prototypes -Wundef -Wwrite-strings -Wno-packed-not-aligned -Wno-missing-field-initializers -D_GNU_SOURCE -fPIC -march=native -DALLOW_EXPERIMENTAL_API -DALLOW_INTERNAL_API -Wno-format-truncation -Wno-strict-aliasing -Wdisabled-optimization -Waggregate-return -Wbad-function-cast -DRTE_LOG_DEFAULT_LOGTYPE=pmd.net.sfc -MD -MQ drivers/libtmp_rte_net_sfc.a.p/net_sfc_sfc_flow.c.o -MF drivers/libtmp_rte_net_sfc.a.p/net_sfc_sfc_flow.c.o.d -o drivers/libtmp_rte_net_sfc.a.p/net_sfc_sfc_flow.c.o -c ../drivers/net/sfc/sfc_flow.c
../drivers/net/sfc/sfc_flow.c: In function ‘sfc_flow_query’:
../drivers/net/sfc/sfc_flow.c:2815:19: error: ‘SFC_ETHDEV_STARTED’ undeclared (first use in this function); did you mean ‘SFC_ADAPTER_STARTED’?
  if (sa->state != SFC_ETHDEV_STARTED) {
                   ^~~~~~~~~~~~~~~~~~
                   SFC_ADAPTER_STARTED
../drivers/net/sfc/sfc_flow.c:2815:19: note: each undeclared identifier is reported only once for each function it appears in
[1633/2754] Compiling C object drivers/libtmp_rte_net_qede.a.p/net_qede_qede_rxtx.c.o
[1634/2754] Compiling C object drivers/libtmp_rte_net_sfc.a.p/net_sfc_sfc_ef10_essb_rx.c.o
[1635/2754] Compiling C object drivers/libtmp_rte_net_sfc.a.p/net_sfc_sfc_mae_counter.c.o
[1636/2754] Compiling C object drivers/libtmp_rte_net_sfc.a.p/net_sfc_sfc_ef10_rx.c.o
[1637/2754] Compiling C object drivers/libtmp_rte_net_sfc.a.p/net_sfc_sfc_mae.c.o
[1638/2754] Compiling C object drivers/libtmp_rte_net_sfc.a.p/net_sfc_sfc_ef100_rx.c.o
[1639/2754] Compiling C object drivers/libtmp_rte_net_sfc.a.p/net_sfc_sfc_ef10_tx.c.o
[1640/2754] Compiling C object drivers/libtmp_rte_net_octeontx2.a.p/net_octeontx2_otx2_tx.c.o
[1641/2754] Compiling C object drivers/libtmp_rte_net_octeontx2.a.p/net_octeontx2_otx2_rx.c.o
ninja: build stopped




*Build Failed #6:
OS: FreeBSD1201-64
Target: x86_64-native-bsdapp-gcc
FAILED: drivers/libtmp_rte_net_sfc.a.p/net_sfc_sfc_flow.c.o 
gcc -Idrivers/libtmp_rte_net_sfc.a.p -Idrivers -I../drivers -Idrivers/net/sfc -I../drivers/net/sfc -Ilib/ethdev -I../lib/ethdev -I. -I.. -Iconfig -I../config -Ilib/eal/include -I../lib/eal/include -Ilib/eal/freebsd/include -I../lib/eal/freebsd/include -Ilib/eal/x86/include -I../lib/eal/x86/include -Ilib/eal/common -I../lib/eal/common -Ilib/eal -I../lib/eal -Ilib/kvargs -I../lib/kvargs -Ilib/metrics -I../lib/metrics -Ilib/telemetry -I../lib/telemetry -Ilib/net -I../lib/net -Ilib/mbuf -I../lib/mbuf -Ilib/mempool -I../lib/mempool -Ilib/ring -I../lib/ring -Ilib/meter -I../lib/meter -Idrivers/bus/pci -I../drivers/bus/pci -I../drivers/bus/pci/bsd -Ilib/pci -I../lib/pci -Idrivers/bus/vdev -I../drivers/bus/vdev -Idrivers/common/sfc_efx -I../drivers/common/sfc_efx -Idrivers/common/sfc_efx/base -I../drivers/common/sfc_efx/base -fdiagnostics-color=always -pipe -D_FILE_OFFSET_BITS=64 -Wall -Winvalid-pch -Werror -O3 -include rte_config.h -Wextra -Wcast-qual -Wdeprecated -Wformat -Wformat-nonliteral -Wformat-security -Wmissing-declarations -Wmissing-prototypes -Wnested-externs -Wold-style-definition -Wpointer-arith -Wsign-compare -Wstrict-prototypes -Wundef -Wwrite-strings -Wno-address-of-packed-member -Wno-packed-not-aligned -Wno-missing-field-initializers -D_GNU_SOURCE -D__BSD_VISIBLE -fPIC -march=native -mno-avx512f -DALLOW_EXPERIMENTAL_API -DALLOW_INTERNAL_API -Wno-format-truncation -Wno-strict-aliasing -Wdisabled-optimization -Waggregate-return -Wbad-function-cast -DRTE_LOG_DEFAULT_LOGTYPE=pmd.net.sfc -MD -MQ drivers/libtmp_rte_net_sfc.a.p/net_sfc_sfc_flow.c.o -MF drivers/libtmp_rte_net_sfc.a.p/net_sfc_sfc_flow.c.o.d -o drivers/libtmp_rte_net_sfc.a.p/net_sfc_sfc_flow.c.o -c ../drivers/net/sfc/sfc_flow.c
../drivers/net/sfc/sfc_flow.c: In function 'sfc_flow_query':
../drivers/net/sfc/sfc_flow.c:2815:19: error: 'SFC_ETHDEV_STARTED' undeclared (first use in this function); did you mean 'SFC_ADAPTER_STARTED'?
 2815 |  if (sa->state != SFC_ETHDEV_STARTED) {
      |                   ^~~~~~~~~~~~~~~~~~
      |                   SFC_ADAPTER_STARTED
../drivers/net/sfc/sfc_flow.c:2815:19: note: each undeclared identifier is reported only once for each function it appears in
[1241/1951] Compiling C object drivers/libtmp_rte_net_sfc.a.p/net_sfc_sfc_mae.c.o
[1242/1951] Compiling C object drivers/libtmp_rte_net_sfc.a.p/net_sfc_sfc_mae_counter.c.o
[1243/1951] Compiling C object drivers/libtmp_rte_net_sfc.a.p/net_sfc_sfc_ef10_rx.c.o
[1244/1951] Compiling C object drivers/libtmp_rte_net_sfc.a.p/net_sfc_sfc_ef10_essb_rx.c.o
[1245/1951] Compiling C object drivers/libtmp_rte_net_sfc.a.p/net_sfc_sfc_ef10_tx.c.o
ninja: build stopped




*Build Failed #7:
OS: FreeBSD1201-64
Target: x86_64-native-bsdapp-clang
FAILED: drivers/libtmp_rte_net_sfc.a.p/net_sfc_sfc_flow.c.o 
clang -Idrivers/libtmp_rte_net_sfc.a.p -Idrivers -I../drivers -Idrivers/net/sfc -I../drivers/net/sfc -Ilib/ethdev -I../lib/ethdev -I. -I.. -Iconfig -I../config -Ilib/eal/include -I../lib/eal/include -Ilib/eal/freebsd/include -I../lib/eal/freebsd/include -Ilib/eal/x86/include -I../lib/eal/x86/include -Ilib/eal/common -I../lib/eal/common -Ilib/eal -I../lib/eal -Ilib/kvargs -I../lib/kvargs -Ilib/metrics -I../lib/metrics -Ilib/telemetry -I../lib/telemetry -Ilib/net -I../lib/net -Ilib/mbuf -I../lib/mbuf -Ilib/mempool -I../lib/mempool -Ilib/ring -I../lib/ring -Ilib/meter -I../lib/meter -Idrivers/bus/pci -I../drivers/bus/pci -I../drivers/bus/pci/bsd -Ilib/pci -I../lib/pci -Idrivers/bus/vdev -I../drivers/bus/vdev -Idrivers/common/sfc_efx -I../drivers/common/sfc_efx -Idrivers/common/sfc_efx/base -I../drivers/common/sfc_efx/base -Xclang -fcolor-diagnostics -pipe -D_FILE_OFFSET_BITS=64 -Wall -Winvalid-pch -Werror -O3 -include rte_config.h -Wextra -Wcast-qual -Wdeprecated -Wformat -Wformat-nonliteral -Wformat-security -Wmissing-declarations -Wmissing-prototypes -Wnested-externs -Wold-style-definition -Wpointer-arith -Wsign-compare -Wstrict-prototypes -Wundef -Wwrite-strings -Wno-address-of-packed-member -Wno-missing-field-initializers -D_GNU_SOURCE -D__BSD_VISIBLE -fPIC -march=native -mno-avx512f -DALLOW_EXPERIMENTAL_API -DALLOW_INTERNAL_API -Wno-strict-aliasing -Wdisabled-optimization -Waggregate-return -Wbad-function-cast -DRTE_LOG_DEFAULT_LOGTYPE=pmd.net.sfc -MD -MQ drivers/libtmp_rte_net_sfc.a.p/net_sfc_sfc_flow.c.o -MF drivers/libtmp_rte_net_sfc.a.p/net_sfc_sfc_flow.c.o.d -o drivers/libtmp_rte_net_sfc.a.p/net_sfc_sfc_flow.c.o -c ../drivers/net/sfc/sfc_flow.c
../drivers/net/sfc/sfc_flow.c:2815:19: error: use of undeclared identifier 'SFC_ETHDEV_STARTED'; did you mean 'SFC_ADAPTER_STARTED'?
        if (sa->state != SFC_ETHDEV_STARTED) {
                         ^~~~~~~~~~~~~~~~~~
                         SFC_ADAPTER_STARTED
../drivers/net/sfc/sfc.h:83:2: note: 'SFC_ADAPTER_STARTED' declared here
        SFC_ADAPTER_STARTED,
        ^
1 error generated.
[1244/1951] Compiling C object drivers/libtmp_rte_net_sfc.a.p/net_sfc_sfc_service.c.o
[1245/1951] Compiling C object drivers/libtmp_rte_net_sfc.a.p/net_sfc_sfc_ef10_essb_rx.c.o
[1246/1951] Compiling C object drivers/libtmp_rte_net_sfc.a.p/net_sfc_sfc_ef100_rx.c.o
[1247/1951] Compiling C object drivers/libtmp_rte_net_sfc.a.p/net_sfc_sfc_ef10_tx.c.o
[1248/1951] Compiling C object drivers/libtmp_rte_net_sfc.a.p/net_sfc_sfc_ef100_tx.c.o
ninja: build stopped




*Build Failed #8:
OS: FreeBSD1201-64
Target: x86_64-native-bsdapp-gcc+shared
FAILED: drivers/libtmp_rte_net_sfc.a.p/net_sfc_sfc_flow.c.o 
gcc -Idrivers/libtmp_rte_net_sfc.a.p -Idrivers -I../drivers -Idrivers/net/sfc -I../drivers/net/sfc -Ilib/ethdev -I../lib/ethdev -I. -I.. -Iconfig -I../config -Ilib/eal/include -I../lib/eal/include -Ilib/eal/freebsd/include -I../lib/eal/freebsd/include -Ilib/eal/x86/include -I../lib/eal/x86/include -Ilib/eal/common -I../lib/eal/common -Ilib/eal -I../lib/eal -Ilib/kvargs -I../lib/kvargs -Ilib/metrics -I../lib/metrics -Ilib/telemetry -I../lib/telemetry -Ilib/net -I../lib/net -Ilib/mbuf -I../lib/mbuf -Ilib/mempool -I../lib/mempool -Ilib/ring -I../lib/ring -Ilib/meter -I../lib/meter -Idrivers/bus/pci -I../drivers/bus/pci -I../drivers/bus/pci/bsd -Ilib/pci -I../lib/pci -Idrivers/bus/vdev -I../drivers/bus/vdev -Idrivers/common/sfc_efx -I../drivers/common/sfc_efx -Idrivers/common/sfc_efx/base -I../drivers/common/sfc_efx/base -fdiagnostics-color=always -pipe -D_FILE_OFFSET_BITS=64 -Wall -Winvalid-pch -Werror -O3 -include rte_config.h -Wextra -Wcast-qual -Wdeprecated -Wformat -Wformat-nonliteral -Wformat-security -Wmissing-declarations -Wmissing-prototypes -Wnested-externs -Wold-style-definition -Wpointer-arith -Wsign-compare -Wstrict-prototypes -Wundef -Wwrite-strings -Wno-address-of-packed-member -Wno-packed-not-aligned -Wno-missing-field-initializers -D_GNU_SOURCE -D__BSD_VISIBLE -fPIC -march=native -mno-avx512f -DALLOW_EXPERIMENTAL_API -DALLOW_INTERNAL_API -Wno-format-truncation -Wno-strict-aliasing -Wdisabled-optimization -Waggregate-return -Wbad-function-cast -DRTE_LOG_DEFAULT_LOGTYPE=pmd.net.sfc -MD -MQ drivers/libtmp_rte_net_sfc.a.p/net_sfc_sfc_flow.c.o -MF drivers/libtmp_rte_net_sfc.a.p/net_sfc_sfc_flow.c.o.d -o drivers/libtmp_rte_net_sfc.a.p/net_sfc_sfc_flow.c.o -c ../drivers/net/sfc/sfc_flow.c
../drivers/net/sfc/sfc_flow.c: In function 'sfc_flow_query':
../drivers/net/sfc/sfc_flow.c:2815:19: error: 'SFC_ETHDEV_STARTED' undeclared (first use in this function); did you mean 'SFC_ADAPTER_STARTED'?
 2815 |  if (sa->state != SFC_ETHDEV_STARTED) {
      |                   ^~~~~~~~~~~~~~~~~~
      |                   SFC_ADAPTER_STARTED
../drivers/net/sfc/sfc_flow.c:2815:19: note: each undeclared identifier is reported only once for each function it appears in
[1266/1832] Compiling C object drivers/libtmp_rte_net_sfc.a.p/net_sfc_sfc_mae_counter.c.o
[1267/1832] Compiling C object drivers/libtmp_rte_net_sfc.a.p/net_sfc_sfc_ef10_rx.c.o
[1268/1832] Compiling C object drivers/libtmp_rte_net_sfc.a.p/net_sfc_sfc_ef10_essb_rx.c.o
[1269/1832] Compiling C object drivers/libtmp_rte_net_sfc.a.p/net_sfc_sfc_ef100_rx.c.o
[1270/1832] Compiling C object drivers/libtmp_rte_net_sfc.a.p/net_sfc_sfc_ef10_tx.c.o
ninja: build stopped




*Build Failed #9:
OS: FreeBSD1201-64
Target: x86_64-native-bsdapp-gcc+debug
FAILED: drivers/libtmp_rte_net_sfc.a.p/net_sfc_sfc_flow.c.o 
gcc -Idrivers/libtmp_rte_net_sfc.a.p -Idrivers -I../drivers -Idrivers/net/sfc -I../drivers/net/sfc -Ilib/ethdev -I../lib/ethdev -I. -I.. -Iconfig -I../config -Ilib/eal/include -I../lib/eal/include -Ilib/eal/freebsd/include -I../lib/eal/freebsd/include -Ilib/eal/x86/include -I../lib/eal/x86/include -Ilib/eal/common -I../lib/eal/common -Ilib/eal -I../lib/eal -Ilib/kvargs -I../lib/kvargs -Ilib/metrics -I../lib/metrics -Ilib/telemetry -I../lib/telemetry -Ilib/net -I../lib/net -Ilib/mbuf -I../lib/mbuf -Ilib/mempool -I../lib/mempool -Ilib/ring -I../lib/ring -Ilib/meter -I../lib/meter -Idrivers/bus/pci -I../drivers/bus/pci -I../drivers/bus/pci/bsd -Ilib/pci -I../lib/pci -Idrivers/bus/vdev -I../drivers/bus/vdev -Idrivers/common/sfc_efx -I../drivers/common/sfc_efx -Idrivers/common/sfc_efx/base -I../drivers/common/sfc_efx/base -fdiagnostics-color=always -pipe -D_FILE_OFFSET_BITS=64 -Wall -Winvalid-pch -Werror -O2 -g -include rte_config.h -Wextra -Wcast-qual -Wdeprecated -Wformat -Wformat-nonliteral -Wformat-security -Wmissing-declarations -Wmissing-prototypes -Wnested-externs -Wold-style-definition -Wpointer-arith -Wsign-compare -Wstrict-prototypes -Wundef -Wwrite-strings -Wno-address-of-packed-member -Wno-packed-not-aligned -Wno-missing-field-initializers -D_GNU_SOURCE -D__BSD_VISIBLE -fPIC -march=native -mno-avx512f -DALLOW_EXPERIMENTAL_API -DALLOW_INTERNAL_API -Wno-format-truncation -Wno-strict-aliasing -Wdisabled-optimization -Waggregate-return -Wbad-function-cast -DRTE_LOG_DEFAULT_LOGTYPE=pmd.net.sfc -MD -MQ drivers/libtmp_rte_net_sfc.a.p/net_sfc_sfc_flow.c.o -MF drivers/libtmp_rte_net_sfc.a.p/net_sfc_sfc_flow.c.o.d -o drivers/libtmp_rte_net_sfc.a.p/net_sfc_sfc_flow.c.o -c ../drivers/net/sfc/sfc_flow.c
../drivers/net/sfc/sfc_flow.c: In function 'sfc_flow_query':
../drivers/net/sfc/sfc_flow.c:2815:19: error: 'SFC_ETHDEV_STARTED' undeclared (first use in this function); did you mean 'SFC_ADAPTER_STARTED'?
 2815 |  if (sa->state != SFC_ETHDEV_STARTED) {
      |                   ^~~~~~~~~~~~~~~~~~
      |                   SFC_ADAPTER_STARTED
../drivers/net/sfc/sfc_flow.c:2815:19: note: each undeclared identifier is reported only once for each function it appears in
[1237/1951] Compiling C object drivers/libtmp_rte_net_sfc.a.p/net_sfc_sfc_mae.c.o
[1238/1951] Compiling C object drivers/libtmp_rte_net_sfc.a.p/net_sfc_sfc_ef10_essb_rx.c.o
[1239/1951] Generating rte_net_octeontx2.pmd.c with a custom command
[1240/1951] Compiling C object drivers/libtmp_rte_net_sfc.a.p/net_sfc_sfc_ef10_rx.c.o
[1241/1951] Compiling C object drivers/libtmp_rte_net_sfc.a.p/net_sfc_sfc_ef10_tx.c.o
ninja: build stopped




*Build Failed #10:
OS: RHEL83-64
Target: x86_64-native-linuxapp-gcc
FAILED: drivers/libtmp_rte_net_sfc.a.p/net_sfc_sfc_flow.c.o 
gcc -Idrivers/libtmp_rte_net_sfc.a.p -Idrivers -I../drivers -Idrivers/net/sfc -I../drivers/net/sfc -Ilib/ethdev -I../lib/ethdev -I. -I.. -Iconfig -I../config -Ilib/eal/include -I../lib/eal/include -Ilib/eal/linux/include -I../lib/eal/linux/include -Ilib/eal/x86/include -I../lib/eal/x86/include -Ilib/eal/common -I../lib/eal/common -Ilib/eal -I../lib/eal -Ilib/kvargs -I../lib/kvargs -Ilib/metrics -I../lib/metrics -Ilib/telemetry -I../lib/telemetry -Ilib/net -I../lib/net -Ilib/mbuf -I../lib/mbuf -Ilib/mempool -I../lib/mempool -Ilib/ring -I../lib/ring -Ilib/meter -I../lib/meter -Idrivers/bus/pci -I../drivers/bus/pci -I../drivers/bus/pci/linux -Ilib/pci -I../lib/pci -Idrivers/bus/vdev -I../drivers/bus/vdev -Idrivers/common/sfc_efx -I../drivers/common/sfc_efx -Idrivers/common/sfc_efx/base -I../drivers/common/sfc_efx/base -fdiagnostics-color=always -pipe -D_FILE_OFFSET_BITS=64 -Wall -Winvalid-pch -Werror -O3 -include rte_config.h -Wextra -Wcast-qual -Wdeprecated -Wformat -Wformat-nonliteral -Wformat-security -Wmissing-declarations -Wmissing-prototypes -Wnested-externs -Wold-style-definition -Wpointer-arith -Wsign-compare -Wstrict-prototypes -Wundef -Wwrite-strings -Wno-packed-not-aligned -Wno-missing-field-initializers -D_GNU_SOURCE -fPIC -march=native -DALLOW_EXPERIMENTAL_API -DALLOW_INTERNAL_API -Wno-format-truncation -Wno-strict-aliasing -Wdisabled-optimization -Waggregate-return -Wbad-function-cast -DRTE_LOG_DEFAULT_LOGTYPE=pmd.net.sfc -MD -MQ drivers/libtmp_rte_net_sfc.a.p/net_sfc_sfc_flow.c.o -MF drivers/libtmp_rte_net_sfc.a.p/net_sfc_sfc_flow.c.o.d -o drivers/libtmp_rte_net_sfc.a.p/net_sfc_sfc_flow.c.o -c ../drivers/net/sfc/sfc_flow.c
../drivers/net/sfc/sfc_flow.c: In function ‘sfc_flow_query’:
../drivers/net/sfc/sfc_flow.c:2815:19: error: ‘SFC_ETHDEV_STARTED’ undeclared (first use in this function); did you mean ‘SFC_ADAPTER_STARTED’?
  if (sa->state != SFC_ETHDEV_STARTED) {
                   ^~~~~~~~~~~~~~~~~~
                   SFC_ADAPTER_STARTED
../drivers/net/sfc/sfc_flow.c:2815:19: note: each undeclared identifier is reported only once for each function it appears in
[1639/2754] Linking static target drivers/librte_net_qede.a
[1640/2754] Compiling C object drivers/libtmp_rte_net_sfc.a.p/net_sfc_sfc_mae_counter.c.o
[1641/2754] Compiling C object drivers/libtmp_rte_net_sfc.a.p/net_sfc_sfc_mae.c.o
[1642/2754] Compiling C object drivers/libtmp_rte_net_sfc.a.p/net_sfc_sfc_ef10_rx.c.o
[1643/2754] Compiling C object drivers/libtmp_rte_net_sfc.a.p/net_sfc_sfc_ef10_essb_rx.c.o
[1644/2754] Compiling C object drivers/libtmp_rte_net_sfc.a.p/net_sfc_sfc_ef100_rx.c.o
[1645/2754] Compiling C object drivers/libtmp_rte_net_octeontx2.a.p/net_octeontx2_otx2_rx.c.o
[1646/2754] Compiling C object drivers/libtmp_rte_net_octeontx2.a.p/net_octeontx2_otx2_tx.c.o
[1647/2754] Compiling C object drivers/libtmp_rte_net_sfc.a.p/net_sfc_sfc_ef10_tx.c.o
ninja: build stopped




*Build Failed #11:
OS: SUSE15-64
Target: x86_64-native-linuxapp-clang
FAILED: drivers/libtmp_rte_net_sfc.a.p/net_sfc_sfc_flow.c.o 
clang -Idrivers/libtmp_rte_net_sfc.a.p -Idrivers -I../drivers -Idrivers/net/sfc -I../drivers/net/sfc -Ilib/ethdev -I../lib/ethdev -I. -I.. -Iconfig -I../config -Ilib/eal/include -I../lib/eal/include -Ilib/eal/linux/include -I../lib/eal/linux/include -Ilib/eal/x86/include -I../lib/eal/x86/include -Ilib/eal/common -I../lib/eal/common -Ilib/eal -I../lib/eal -Ilib/kvargs -I../lib/kvargs -Ilib/metrics -I../lib/metrics -Ilib/telemetry -I../lib/telemetry -Ilib/net -I../lib/net -Ilib/mbuf -I../lib/mbuf -Ilib/mempool -I../lib/mempool -Ilib/ring -I../lib/ring -Ilib/meter -I../lib/meter -Idrivers/bus/pci -I../drivers/bus/pci -I../drivers/bus/pci/linux -Ilib/pci -I../lib/pci -Idrivers/bus/vdev -I../drivers/bus/vdev -Idrivers/common/sfc_efx -I../drivers/common/sfc_efx -Idrivers/common/sfc_efx/base -I../drivers/common/sfc_efx/base -Xclang -fcolor-diagnostics -pipe -D_FILE_OFFSET_BITS=64 -Wall -Winvalid-pch -Werror -O3 -include rte_config.h -Wextra -Wcast-qual -Wdeprecated -Wformat -Wformat-nonliteral -Wformat-security -Wmissing-declarations -Wmissing-prototypes -Wnested-externs -Wold-style-definition -Wpointer-arith -Wsign-compare -Wstrict-prototypes -Wundef -Wwrite-strings -Wno-address-of-packed-member -Wno-missing-field-initializers -D_GNU_SOURCE -fPIC -march=native -DALLOW_EXPERIMENTAL_API -DALLOW_INTERNAL_API -Wno-strict-aliasing -Wdisabled-optimization -Waggregate-return -Wbad-function-cast -DRTE_LOG_DEFAULT_LOGTYPE=pmd.net.sfc -MD -MQ drivers/libtmp_rte_net_sfc.a.p/net_sfc_sfc_flow.c.o -MF drivers/libtmp_rte_net_sfc.a.p/net_sfc_sfc_flow.c.o.d -o drivers/libtmp_rte_net_sfc.a.p/net_sfc_sfc_flow.c.o -c ../drivers/net/sfc/sfc_flow.c
../drivers/net/sfc/sfc_flow.c:2815:19: error: use of undeclared identifier 'SFC_ETHDEV_STARTED'; did you mean 'SFC_ADAPTER_STARTED'?
        if (sa->state != SFC_ETHDEV_STARTED) {
                         ^~~~~~~~~~~~~~~~~~
                         SFC_ADAPTER_STARTED
../drivers/net/sfc/sfc.h:83:2: note: 'SFC_ADAPTER_STARTED' declared here
        SFC_ADAPTER_STARTED,
        ^
1 error generated.
[1643/2714] Linking target drivers/librte_net_qede.so.21.3
[1644/2714] Compiling C object drivers/libtmp_rte_net_sfc.a.p/net_sfc_sfc_service.c.o
[1645/2714] Compiling C object drivers/libtmp_rte_net_sfc.a.p/net_sfc_sfc_ef100_rx.c.o
[1646/2714] Compiling C object drivers/libtmp_rte_net_sfc.a.p/net_sfc_sfc_ef10_essb_rx.c.o
[1647/2714] Compiling C object drivers/libtmp_rte_net_sfc.a.p/net_sfc_sfc_mae.c.o
[1648/2714] Compiling C object drivers/libtmp_rte_net_sfc.a.p/net_sfc_sfc_ef10_rx.c.o
[1649/2714] Generating rte_net_octeontx2.pmd.c with a custom command
[1650/2714] Compiling C object drivers/libtmp_rte_net_sfc.a.p/net_sfc_sfc_ef10_tx.c.o
[1651/2714] Compiling C object drivers/libtmp_rte_net_sfc.a.p/net_sfc_sfc_ef100_tx.c.o
ninja: build stopped




*Build Failed #12:
OS: SUSE15-64
Target: x86_64-native-linuxapp-gcc
FAILED: drivers/libtmp_rte_net_sfc.a.p/net_sfc_sfc_flow.c.o 
gcc -Idrivers/libtmp_rte_net_sfc.a.p -Idrivers -I../drivers -Idrivers/net/sfc -I../drivers/net/sfc -Ilib/ethdev -I../lib/ethdev -I. -I.. -Iconfig -I../config -Ilib/eal/include -I../lib/eal/include -Ilib/eal/linux/include -I../lib/eal/linux/include -Ilib/eal/x86/include -I../lib/eal/x86/include -Ilib/eal/common -I../lib/eal/common -Ilib/eal -I../lib/eal -Ilib/kvargs -I../lib/kvargs -Ilib/metrics -I../lib/metrics -Ilib/telemetry -I../lib/telemetry -Ilib/net -I../lib/net -Ilib/mbuf -I../lib/mbuf -Ilib/mempool -I../lib/mempool -Ilib/ring -I../lib/ring -Ilib/meter -I../lib/meter -Idrivers/bus/pci -I../drivers/bus/pci -I../drivers/bus/pci/linux -Ilib/pci -I../lib/pci -Idrivers/bus/vdev -I../drivers/bus/vdev -Idrivers/common/sfc_efx -I../drivers/common/sfc_efx -Idrivers/common/sfc_efx/base -I../drivers/common/sfc_efx/base -fdiagnostics-color=always -pipe -D_FILE_OFFSET_BITS=64 -Wall -Winvalid-pch -Werror -O3 -include rte_config.h -Wextra -Wcast-qual -Wdeprecated -Wformat -Wformat-nonliteral -Wformat-security -Wmissing-declarations -Wmissing-prototypes -Wnested-externs -Wold-style-definition -Wpointer-arith -Wsign-compare -Wstrict-prototypes -Wundef -Wwrite-strings -Wno-missing-field-initializers -D_GNU_SOURCE -fPIC -march=native -DALLOW_EXPERIMENTAL_API -DALLOW_INTERNAL_API -Wno-format-truncation -Wno-strict-aliasing -Wdisabled-optimization -Waggregate-return -Wbad-function-cast -DRTE_LOG_DEFAULT_LOGTYPE=pmd.net.sfc -MD -MQ drivers/libtmp_rte_net_sfc.a.p/net_sfc_sfc_flow.c.o -MF drivers/libtmp_rte_net_sfc.a.p/net_sfc_sfc_flow.c.o.d -o drivers/libtmp_rte_net_sfc.a.p/net_sfc_sfc_flow.c.o -c ../drivers/net/sfc/sfc_flow.c
../drivers/net/sfc/sfc_flow.c: In function ‘sfc_flow_query’:
../drivers/net/sfc/sfc_flow.c:2815:19: error: ‘SFC_ETHDEV_STARTED’ undeclared (first use in this function); did you mean ‘SFC_ADAPTER_STARTED’?
  if (sa->state != SFC_ETHDEV_STARTED) {
                   ^~~~~~~~~~~~~~~~~~
                   SFC_ADAPTER_STARTED
../drivers/net/sfc/sfc_flow.c:2815:19: note: each undeclared identifier is reported only once for each function it appears in
[1641/2683] Compiling C object drivers/libtmp_rte_net_sfc.a.p/net_sfc_sfc_ef10_essb_rx.c.o
[1642/2683] Compiling C object drivers/libtmp_rte_net_sfc.a.p/net_sfc_sfc_mae_counter.c.o
[1643/2683] Compiling C object drivers/libtmp_rte_net_sfc.a.p/net_sfc_sfc_ef100_rx.c.o
[1644/2683] Compiling C object drivers/libtmp_rte_net_sfc.a.p/net_sfc_sfc_mae.c.o
[1645/2683] Compiling C object drivers/libtmp_rte_net_sfc.a.p/net_sfc_sfc_ef100_tx.c.o
[1646/2683] Compiling C object drivers/libtmp_rte_net_sfc.a.p/net_sfc_sfc_ef10_rx.c.o
[1647/2683] Compiling C object drivers/libtmp_rte_net_sfc.a.p/net_sfc_sfc_ef10_tx.c.o
ninja: build stopped




*Build Failed #13:
OS: CentOsStream8-64
Target: x86_64-native-linuxapp-gcc
FAILED: drivers/libtmp_rte_net_sfc.a.p/net_sfc_sfc_flow.c.o 
gcc -Idrivers/libtmp_rte_net_sfc.a.p -Idrivers -I../drivers -Idrivers/net/sfc -I../drivers/net/sfc -Ilib/ethdev -I../lib/ethdev -I. -I.. -Iconfig -I../config -Ilib/eal/include -I../lib/eal/include -Ilib/eal/linux/include -I../lib/eal/linux/include -Ilib/eal/x86/include -I../lib/eal/x86/include -Ilib/eal/common -I../lib/eal/common -Ilib/eal -I../lib/eal -Ilib/kvargs -I../lib/kvargs -Ilib/metrics -I../lib/metrics -Ilib/telemetry -I../lib/telemetry -Ilib/net -I../lib/net -Ilib/mbuf -I../lib/mbuf -Ilib/mempool -I../lib/mempool -Ilib/ring -I../lib/ring -Ilib/meter -I../lib/meter -Idrivers/bus/pci -I../drivers/bus/pci -I../drivers/bus/pci/linux -Ilib/pci -I../lib/pci -Idrivers/bus/vdev -I../drivers/bus/vdev -Idrivers/common/sfc_efx -I../drivers/common/sfc_efx -Idrivers/common/sfc_efx/base -I../drivers/common/sfc_efx/base -fdiagnostics-color=always -pipe -D_FILE_OFFSET_BITS=64 -Wall -Winvalid-pch -Werror -O3 -include rte_config.h -Wextra -Wcast-qual -Wdeprecated -Wformat -Wformat-nonliteral -Wformat-security -Wmissing-declarations -Wmissing-prototypes -Wnested-externs -Wold-style-definition -Wpointer-arith -Wsign-compare -Wstrict-prototypes -Wundef -Wwrite-strings -Wno-packed-not-aligned -Wno-missing-field-initializers -D_GNU_SOURCE -fPIC -march=native -DALLOW_EXPERIMENTAL_API -DALLOW_INTERNAL_API -Wno-format-truncation -Wno-strict-aliasing -Wdisabled-optimization -Waggregate-return -Wbad-function-cast -DRTE_LOG_DEFAULT_LOGTYPE=pmd.net.sfc -MD -MQ drivers/libtmp_rte_net_sfc.a.p/net_sfc_sfc_flow.c.o -MF drivers/libtmp_rte_net_sfc.a.p/net_sfc_sfc_flow.c.o.d -o drivers/libtmp_rte_net_sfc.a.p/net_sfc_sfc_flow.c.o -c ../drivers/net/sfc/sfc_flow.c
../drivers/net/sfc/sfc_flow.c: In function ‘sfc_flow_query’:
../drivers/net/sfc/sfc_flow.c:2815:19: error: ‘SFC_ETHDEV_STARTED’ undeclared (first use in this function); did you mean ‘SFC_ADAPTER_STARTED’?
  if (sa->state != SFC_ETHDEV_STARTED) {
                   ^~~~~~~~~~~~~~~~~~
                   SFC_ADAPTER_STARTED
../drivers/net/sfc/sfc_flow.c:2815:19: note: each undeclared identifier is reported only once for each function it appears in
[1623/2744] Compiling C object drivers/libtmp_rte_net_sfc.a.p/net_sfc_sfc_service.c.o
[1624/2744] Compiling C object drivers/libtmp_rte_net_sfc.a.p/net_sfc_sfc_mae_counter.c.o
[1625/2744] Compiling C object drivers/libtmp_rte_net_sfc.a.p/net_sfc_sfc_mae.c.o
[1626/2744] Compiling C object drivers/libtmp_rte_net_qede.a.p/net_qede_qede_debug.c.o
[1627/2744] Compiling C object drivers/libtmp_rte_net_sfc.a.p/net_sfc_sfc_ef10_rx.c.o
[1628/2744] Compiling C object drivers/libtmp_rte_net_sfc.a.p/net_sfc_sfc_ef10_essb_rx.c.o
[1629/2744] Compiling C object drivers/libtmp_rte_net_sfc.a.p/net_sfc_sfc_ef100_rx.c.o
[1630/2744] Compiling C object drivers/libtmp_rte_net_sfc.a.p/net_sfc_sfc_ef100_tx.c.o
[1631/2744] Compiling C object drivers/libtmp_rte_net_sfc.a.p/net_sfc_sfc_ef10_tx.c.o
[1632/2744] Compiling C object drivers/libtmp_rte_net_octeontx2.a.p/net_octeontx2_otx2_rx.c.o
[1633/2744] Compiling C object drivers/libtmp_rte_net_octeontx2.a.p/net_octeontx2_otx2_tx.c.o
ninja: build stopped




*Build Failed #14:
OS: UB2004-64
Target: x86_64-native-linuxapp-clang
FAILED: drivers/libtmp_rte_net_sfc.a.p/net_sfc_sfc_flow.c.o 
clang -Idrivers/libtmp_rte_net_sfc.a.p -Idrivers -I../drivers -Idrivers/net/sfc -I../drivers/net/sfc -Ilib/ethdev -I../lib/ethdev -I. -I.. -Iconfig -I../config -Ilib/eal/include -I../lib/eal/include -Ilib/eal/linux/include -I../lib/eal/linux/include -Ilib/eal/x86/include -I../lib/eal/x86/include -Ilib/eal/common -I../lib/eal/common -Ilib/eal -I../lib/eal -Ilib/kvargs -I../lib/kvargs -Ilib/metrics -I../lib/metrics -Ilib/telemetry -I../lib/telemetry -Ilib/net -I../lib/net -Ilib/mbuf -I../lib/mbuf -Ilib/mempool -I../lib/mempool -Ilib/ring -I../lib/ring -Ilib/meter -I../lib/meter -Idrivers/bus/pci -I../drivers/bus/pci -I../drivers/bus/pci/linux -Ilib/pci -I../lib/pci -Idrivers/bus/vdev -I../drivers/bus/vdev -Idrivers/common/sfc_efx -I../drivers/common/sfc_efx -Idrivers/common/sfc_efx/base -I../drivers/common/sfc_efx/base -Xclang -fcolor-diagnostics -pipe -D_FILE_OFFSET_BITS=64 -Wall -Winvalid-pch -Werror -O3 -include rte_config.h -Wextra -Wcast-qual -Wdeprecated -Wformat -Wformat-nonliteral -Wformat-security -Wmissing-declarations -Wmissing-prototypes -Wnested-externs -Wold-style-definition -Wpointer-arith -Wsign-compare -Wstrict-prototypes -Wundef -Wwrite-strings -Wno-address-of-packed-member -Wno-missing-field-initializers -D_GNU_SOURCE -fPIC -march=native -DALLOW_EXPERIMENTAL_API -DALLOW_INTERNAL_API -Wno-strict-aliasing -Wdisabled-optimization -Waggregate-return -Wbad-function-cast -DRTE_LOG_DEFAULT_LOGTYPE=pmd.net.sfc -MD -MQ drivers/libtmp_rte_net_sfc.a.p/net_sfc_sfc_flow.c.o -MF drivers/libtmp_rte_net_sfc.a.p/net_sfc_sfc_flow.c.o.d -o drivers/libtmp_rte_net_sfc.a.p/net_sfc_sfc_flow.c.o -c ../drivers/net/sfc/sfc_flow.c
../drivers/net/sfc/sfc_flow.c:2815:19: error: use of undeclared identifier 'SFC_ETHDEV_STARTED'; did you mean 'SFC_ADAPTER_STARTED'?
        if (sa->state != SFC_ETHDEV_STARTED) {
                         ^~~~~~~~~~~~~~~~~~
                         SFC_ADAPTER_STARTED
../drivers/net/sfc/sfc.h:83:2: note: 'SFC_ADAPTER_STARTED' declared here
        SFC_ADAPTER_STARTED,
        ^
1 error generated.
[1638/2741] Compiling C object drivers/librte_net_qede.so.21.3.p/meson-generated_.._rte_net_qede.pmd.c.o
[1639/2741] Compiling C object drivers/librte_net_qede.a.p/meson-generated_.._rte_net_qede.pmd.c.o
[1640/2741] Compiling C object drivers/libtmp_rte_net_sfc.a.p/net_sfc_sfc_mae.c.o
[1641/2741] Compiling C object drivers/libtmp_rte_net_sfc.a.p/net_sfc_sfc_ef10_essb_rx.c.o
[1642/2741] Compiling C object drivers/libtmp_rte_net_sfc.a.p/net_sfc_sfc_ef10_rx.c.o
[1643/2741] Compiling C object drivers/libtmp_rte_net_sfc.a.p/net_sfc_sfc_ef100_rx.c.o
[1644/2741] Compiling C object drivers/libtmp_rte_net_sfc.a.p/net_sfc_sfc_ef100_tx.c.o
[1645/2741] Compiling C object drivers/libtmp_rte_net_sfc.a.p/net_sfc_sfc_ef10_tx.c.o
[1646/2741] Compiling C object drivers/libtmp_rte_net_octeontx2.a.p/net_octeontx2_otx2_rx.c.o
ninja: build stopped




*Build Failed #15:
OS: UB2004-64
Target: x86_64-native-linuxapp-gcc
FAILED: drivers/libtmp_rte_net_sfc.a.p/net_sfc_sfc_flow.c.o 
gcc -Idrivers/libtmp_rte_net_sfc.a.p -Idrivers -I../drivers -Idrivers/net/sfc -I../drivers/net/sfc -Ilib/ethdev -I../lib/ethdev -I. -I.. -Iconfig -I../config -Ilib/eal/include -I../lib/eal/include -Ilib/eal/linux/include -I../lib/eal/linux/include -Ilib/eal/x86/include -I../lib/eal/x86/include -Ilib/eal/common -I../lib/eal/common -Ilib/eal -I../lib/eal -Ilib/kvargs -I../lib/kvargs -Ilib/metrics -I../lib/metrics -Ilib/telemetry -I../lib/telemetry -Ilib/net -I../lib/net -Ilib/mbuf -I../lib/mbuf -Ilib/mempool -I../lib/mempool -Ilib/ring -I../lib/ring -Ilib/meter -I../lib/meter -Idrivers/bus/pci -I../drivers/bus/pci -I../drivers/bus/pci/linux -Ilib/pci -I../lib/pci -Idrivers/bus/vdev -I../drivers/bus/vdev -Idrivers/common/sfc_efx -I../drivers/common/sfc_efx -Idrivers/common/sfc_efx/base -I../drivers/common/sfc_efx/base -fdiagnostics-color=always -pipe -D_FILE_OFFSET_BITS=64 -Wall -Winvalid-pch -Werror -O3 -include rte_config.h -Wextra -Wcast-qual -Wdeprecated -Wformat -Wformat-nonliteral -Wformat-security -Wmissing-declarations -Wmissing-prototypes -Wnested-externs -Wold-style-definition -Wpointer-arith -Wsign-compare -Wstrict-prototypes -Wundef -Wwrite-strings -Wno-address-of-packed-member -Wno-packed-not-aligned -Wno-missing-field-initializers -Wno-zero-length-bounds -D_GNU_SOURCE -fPIC -march=native -DALLOW_EXPERIMENTAL_API -DALLOW_INTERNAL_API -Wno-format-truncation -Wno-strict-aliasing -Wdisabled-optimization -Waggregate-return -Wbad-function-cast -DRTE_LOG_DEFAULT_LOGTYPE=pmd.net.sfc -MD -MQ drivers/libtmp_rte_net_sfc.a.p/net_sfc_sfc_flow.c.o -MF drivers/libtmp_rte_net_sfc.a.p/net_sfc_sfc_flow.c.o.d -o drivers/libtmp_rte_net_sfc.a.p/net_sfc_sfc_flow.c.o -c ../drivers/net/sfc/sfc_flow.c
../drivers/net/sfc/sfc_flow.c: In function ‘sfc_flow_query’:
../drivers/net/sfc/sfc_flow.c:2815:19: error: ‘SFC_ETHDEV_STARTED’ undeclared (first use in this function); did you mean ‘SFC_ADAPTER_STARTED’?
 2815 |  if (sa->state != SFC_ETHDEV_STARTED) {
      |                   ^~~~~~~~~~~~~~~~~~
      |                   SFC_ADAPTER_STARTED
../drivers/net/sfc/sfc_flow.c:2815:19: note: each undeclared identifier is reported only once for each function it appears in
[1633/2741] Compiling C object drivers/libtmp_rte_net_sfc.a.p/net_sfc_sfc_mae_counter.c.o
[1634/2741] Generating rte_net_qede.pmd.c with a custom command
[1635/2741] Compiling C object drivers/libtmp_rte_net_sfc.a.p/net_sfc_sfc_ef10_essb_rx.c.o
[1636/2741] Compiling C object drivers/libtmp_rte_net_sfc.a.p/net_sfc_sfc_ef10_rx.c.o
[1637/2741] Compiling C object drivers/libtmp_rte_net_sfc.a.p/net_sfc_sfc_mae.c.o
[1638/2741] Compiling C object drivers/libtmp_rte_net_sfc.a.p/net_sfc_sfc_ef100_rx.c.o
[1639/2741] Compiling C object drivers/libtmp_rte_net_sfc.a.p/net_sfc_sfc_ef10_tx.c.o
[1640/2741] Compiling C object drivers/libtmp_rte_net_octeontx2.a.p/net_octeontx2_otx2_tx.c.o
[1641/2741] Compiling C object drivers/libtmp_rte_net_octeontx2.a.p/net_octeontx2_otx2_rx.c.o
ninja: build stopped




*Build Failed #16:
OS: UB2004-64
Target: x86_64-native-linuxapp-icc
FAILED: drivers/libtmp_rte_net_sfc.a.p/net_sfc_sfc_flow.c.o 
icc -Idrivers/libtmp_rte_net_sfc.a.p -Idrivers -I../drivers -Idrivers/net/sfc -I../drivers/net/sfc -Ilib/ethdev -I../lib/ethdev -I. -I.. -Iconfig -I../config -Ilib/eal/include -I../lib/eal/include -Ilib/eal/linux/include -I../lib/eal/linux/include -Ilib/eal/x86/include -I../lib/eal/x86/include -Ilib/eal/common -I../lib/eal/common -Ilib/eal -I../lib/eal -Ilib/kvargs -I../lib/kvargs -Ilib/metrics -I../lib/metrics -Ilib/telemetry -I../lib/telemetry -Ilib/net -I../lib/net -Ilib/mbuf -I../lib/mbuf -Ilib/mempool -I../lib/mempool -Ilib/ring -I../lib/ring -Ilib/meter -I../lib/meter -Idrivers/bus/pci -I../drivers/bus/pci -I../drivers/bus/pci/linux -Ilib/pci -I../lib/pci -Idrivers/bus/vdev -I../drivers/bus/vdev -Idrivers/common/sfc_efx -I../drivers/common/sfc_efx -Idrivers/common/sfc_efx/base -I../drivers/common/sfc_efx/base -pipe -D_FILE_OFFSET_BITS=64 -Wall -w3 -diag-disable:remark -Werror -O3 -include rte_config.h -Wextra -Wcast-qual -Wdeprecated -Wformat -Wformat-security -Wmissing-declarations -Wmissing-prototypes -Wold-style-definition -Wpointer-arith -Wsign-compare -Wstrict-prototypes -Wundef -Wwrite-strings -Wno-missing-field-initializers -diag-disable=181 -diag-disable=188 -diag-disable=2203 -diag-disable=2279 -diag-disable=2557 -diag-disable=3179 -diag-disable=3656 -D_GNU_SOURCE -fPIC -march=native -DALLOW_EXPERIMENTAL_API -DALLOW_INTERNAL_API -Wno-strict-aliasing -Wdisabled-optimization -DRTE_LOG_DEFAULT_LOGTYPE=pmd.net.sfc -MD -MQ drivers/libtmp_rte_net_sfc.a.p/net_sfc_sfc_flow.c.o -MF drivers/libtmp_rte_net_sfc.a.p/net_sfc_sfc_flow.c.o.d -o drivers/libtmp_rte_net_sfc.a.p/net_sfc_sfc_flow.c.o -c ../drivers/net/sfc/sfc_flow.c
../drivers/net/sfc/sfc_flow.c(2815): error: identifier "SFC_ETHDEV_STARTED" is undefined
  	if (sa->state != SFC_ETHDEV_STARTED) {
  	                 ^

compilation aborted for ../drivers/net/sfc/sfc_flow.c (code 2)
[1611/2694] Compiling C object drivers/libtmp_rte_net_sfc.a.p/net_sfc_sfc_mae_counter.c.o
[1612/2694] Compiling C object drivers/libtmp_rte_net_sfc.a.p/net_sfc_sfc_tx.c.o
[1613/2694] Compiling C object drivers/librte_net_qede.a.p/meson-generated_.._rte_net_qede.pmd.c.o
[1614/2694] Compiling C object drivers/libtmp_rte_net_sfc.a.p/net_sfc_sfc_mae.c.o
[1615/2694] Compiling C object drivers/libtmp_rte_net_sfc.a.p/net_sfc_sfc_ef10_essb_rx.c.o
[1616/2694] Compiling C object drivers/libtmp_rte_net_sfc.a.p/net_sfc_sfc_ef10_rx.c.o
[1617/2694] Compiling C object drivers/libtmp_rte_net_sfc.a.p/net_sfc_sfc_ef10_tx.c.o
[1618/2694] Compiling C object drivers/libtmp_rte_net_octeontx2.a.p/net_octeontx2_otx2_rx.c.o
[1619/2694] Compiling C object drivers/libtmp_rte_net_octeontx2.a.p/net_octeontx2_otx2_tx.c.o
ninja: build stopped




*Build Failed #17:
OS: UB2104-64
Target: x86_64-native-linuxapp-gcc
FAILED: drivers/libtmp_rte_net_sfc.a.p/net_sfc_sfc_flow.c.o 
gcc -Idrivers/libtmp_rte_net_sfc.a.p -Idrivers -I../drivers -Idrivers/net/sfc -I../drivers/net/sfc -Ilib/ethdev -I../lib/ethdev -I. -I.. -Iconfig -I../config -Ilib/eal/include -I../lib/eal/include -Ilib/eal/linux/include -I../lib/eal/linux/include -Ilib/eal/x86/include -I../lib/eal/x86/include -Ilib/eal/common -I../lib/eal/common -Ilib/eal -I../lib/eal -Ilib/kvargs -I../lib/kvargs -Ilib/metrics -I../lib/metrics -Ilib/telemetry -I../lib/telemetry -Ilib/net -I../lib/net -Ilib/mbuf -I../lib/mbuf -Ilib/mempool -I../lib/mempool -Ilib/ring -I../lib/ring -Ilib/meter -I../lib/meter -Idrivers/bus/pci -I../drivers/bus/pci -I../drivers/bus/pci/linux -Ilib/pci -I../lib/pci -Idrivers/bus/vdev -I../drivers/bus/vdev -Idrivers/common/sfc_efx -I../drivers/common/sfc_efx -Idrivers/common/sfc_efx/base -I../drivers/common/sfc_efx/base -fdiagnostics-color=always -pipe -D_FILE_OFFSET_BITS=64 -Wall -Winvalid-pch -Werror -O3 -include rte_config.h -Wextra -Wcast-qual -Wdeprecated -Wformat -Wformat-nonliteral -Wformat-security -Wmissing-declarations -Wmissing-prototypes -Wnested-externs -Wold-style-definition -Wpointer-arith -Wsign-compare -Wstrict-prototypes -Wundef -Wwrite-strings -Wno-address-of-packed-member -Wno-packed-not-aligned -Wno-missing-field-initializers -Wno-zero-length-bounds -D_GNU_SOURCE -fPIC -march=native -DALLOW_EXPERIMENTAL_API -DALLOW_INTERNAL_API -Wno-format-truncation -Wno-strict-aliasing -Wdisabled-optimization -Waggregate-return -Wbad-function-cast -DRTE_LOG_DEFAULT_LOGTYPE=pmd.net.sfc -MD -MQ drivers/libtmp_rte_net_sfc.a.p/net_sfc_sfc_flow.c.o -MF drivers/libtmp_rte_net_sfc.a.p/net_sfc_sfc_flow.c.o.d -o drivers/libtmp_rte_net_sfc.a.p/net_sfc_sfc_flow.c.o -c ../drivers/net/sfc/sfc_flow.c
../drivers/net/sfc/sfc_flow.c: In function ‘sfc_flow_query’:
../drivers/net/sfc/sfc_flow.c:2815:19: error: ‘SFC_ETHDEV_STARTED’ undeclared (first use in this function); did you mean ‘SFC_ADAPTER_STARTED’?
 2815 |  if (sa->state != SFC_ETHDEV_STARTED) {
      |                   ^~~~~~~~~~~~~~~~~~
      |                   SFC_ADAPTER_STARTED
../drivers/net/sfc/sfc_flow.c:2815:19: note: each undeclared identifier is reported only once for each function it appears in
[1627/2754] Generating rte_net_qede.pmd.c with a custom command
[1628/2754] Compiling C object drivers/libtmp_rte_net_sfc.a.p/net_sfc_sfc_ef10_essb_rx.c.o
[1629/2754] Compiling C object drivers/libtmp_rte_net_sfc.a.p/net_sfc_sfc_mae_counter.c.o
[1630/2754] Compiling C object drivers/libtmp_rte_net_sfc.a.p/net_sfc_sfc_mae.c.o
[1631/2754] Compiling C object drivers/libtmp_rte_net_sfc.a.p/net_sfc_sfc_ef10_rx.c.o
[1632/2754] Compiling C object drivers/libtmp_rte_net_octeontx2.a.p/net_octeontx2_otx2_tx.c.o
[1633/2754] Compiling C object drivers/libtmp_rte_net_sfc.a.p/net_sfc_sfc_ef100_rx.c.o
[1634/2754] Compiling C object drivers/libtmp_rte_net_sfc.a.p/net_sfc_sfc_ef10_tx.c.o
[1635/2754] Compiling C object drivers/libtmp_rte_net_octeontx2.a.p/net_octeontx2_otx2_rx.c.o
ninja: build stopped




*Build Failed #18:
OS: UB2004-64
Target: x86_64-native-linuxapp-doc
FAILED: drivers/a715181@@tmp_rte_net_sfc@sta/net_sfc_sfc_flow.c.o 
gcc -Idrivers/a715181@@tmp_rte_net_sfc@sta -Idrivers -I../drivers -Idrivers/net/sfc -I../drivers/net/sfc -Ilib/ethdev -I../lib/ethdev -I. -I../ -Iconfig -I../config -Ilib/eal/include -I../lib/eal/include -Ilib/eal/linux/include -I../lib/eal/linux/include -Ilib/eal/x86/include -I../lib/eal/x86/include -Ilib/eal/common -I../lib/eal/common -Ilib/eal -I../lib/eal -Ilib/kvargs -I../lib/kvargs -Ilib/telemetry/../metrics -I../lib/telemetry/../metrics -Ilib/telemetry -I../lib/telemetry -Ilib/net -I../lib/net -Ilib/mbuf -I../lib/mbuf -Ilib/mempool -I../lib/mempool -Ilib/ring -I../lib/ring -Ilib/meter -I../lib/meter -Idrivers/bus/pci -I../drivers/bus/pci -I../drivers/bus/pci/linux -Ilib/pci -I../lib/pci -Idrivers/bus/vdev -I../drivers/bus/vdev -Idrivers/common/sfc_efx -I../drivers/common/sfc_efx -Idrivers/common/sfc_efx/base -I../drivers/common/sfc_efx/base -fdiagnostics-color=always -pipe -D_FILE_OFFSET_BITS=64 -Wall -Winvalid-pch -Werror -O3 -include rte_config.h -Wextra -Wcast-qual -Wdeprecated -Wformat -Wformat-nonliteral -Wformat-security -Wmissing-declarations -Wmissing-prototypes -Wnested-externs -Wold-style-definition -Wpointer-arith -Wsign-compare -Wstrict-prototypes -Wundef -Wwrite-strings -Wno-address-of-packed-member -Wno-packed-not-aligned -Wno-missing-field-initializers -Wno-zero-length-bounds -D_GNU_SOURCE -fPIC -march=native -DALLOW_EXPERIMENTAL_API -DALLOW_INTERNAL_API -Wno-format-truncation -Wno-strict-aliasing -Wdisabled-optimization -Waggregate-return -Wbad-function-cast -DRTE_LOG_DEFAULT_LOGTYPE=pmd.net.sfc -MD -MQ 'drivers/a715181@@tmp_rte_net_sfc@sta/net_sfc_sfc_flow.c.o' -MF 'drivers/a715181@@tmp_rte_net_sfc@sta/net_sfc_sfc_flow.c.o.d' -o 'drivers/a715181@@tmp_rte_net_sfc@sta/net_sfc_sfc_flow.c.o' -c ../drivers/net/sfc/sfc_flow.c
../drivers/net/sfc/sfc_flow.c: In function ‘sfc_flow_query’:
../drivers/net/sfc/sfc_flow.c:2815:19: error: ‘SFC_ETHDEV_STARTED’ undeclared (first use in this function); did you mean ‘SFC_ADAPTER_STARTED’?
 2815 |  if (sa->state != SFC_ETHDEV_STARTED) {
      |                   ^~~~~~~~~~~~~~~~~~
      |                   SFC_ADAPTER_STARTED
../drivers/net/sfc/sfc_flow.c:2815:19: note: each undeclared identifier is reported only once for each function it appears in
[1615/2503] Linking target drivers/librte_net_qede.so.21.3.
[1616/2503] Compiling C object 'drivers/a715181@@tmp_rte_net_sfc@sta/net_sfc_sfc_mae_counter.c.o'.
[1617/2503] Compiling C object 'drivers/a715181@@tmp_rte_net_sfc@sta/net_sfc_sfc_ef10_essb_rx.c.o'.
[1618/2503] Compiling C object 'drivers/a715181@@tmp_rte_net_sfc@sta/net_sfc_sfc_ef10_rx.c.o'.
[1619/2503] Compiling C object 'drivers/a715181@@tmp_rte_net_sfc@sta/net_sfc_sfc_mae.c.o'.
[1620/2503] Compiling C object 'drivers/a715181@@tmp_rte_net_sfc@sta/net_sfc_sfc_ef100_rx.c.o'.
[1621/2503] Compiling C object 'drivers/a715181@@tmp_rte_net_sfc@sta/net_sfc_sfc_ef10_tx.c.o'.
[1622/2503] Compiling C object 'drivers/a715181@@tmp_rte_net_octeontx2@sta/net_octeontx2_otx2_tx.c.o'.
[1623/2503] Compiling C object 'drivers/a715181@@tmp_rte_net_octeontx2@sta/net_octeontx2_otx2_rx.c.o'.
ninja: build stopped




*Build Failed #19:
OS: FC34-64
Target: x86_64-native-linuxapp-gcc
FAILED: drivers/libtmp_rte_net_sfc.a.p/net_sfc_sfc_flow.c.o 
gcc -Idrivers/libtmp_rte_net_sfc.a.p -Idrivers -I../drivers -Idrivers/net/sfc -I../drivers/net/sfc -Ilib/ethdev -I../lib/ethdev -I. -I.. -Iconfig -I../config -Ilib/eal/include -I../lib/eal/include -Ilib/eal/linux/include -I../lib/eal/linux/include -Ilib/eal/x86/include -I../lib/eal/x86/include -Ilib/eal/common -I../lib/eal/common -Ilib/eal -I../lib/eal -Ilib/kvargs -I../lib/kvargs -Ilib/metrics -I../lib/metrics -Ilib/telemetry -I../lib/telemetry -Ilib/net -I../lib/net -Ilib/mbuf -I../lib/mbuf -Ilib/mempool -I../lib/mempool -Ilib/ring -I../lib/ring -Ilib/meter -I../lib/meter -Idrivers/bus/pci -I../drivers/bus/pci -I../drivers/bus/pci/linux -Ilib/pci -I../lib/pci -Idrivers/bus/vdev -I../drivers/bus/vdev -Idrivers/common/sfc_efx -I../drivers/common/sfc_efx -Idrivers/common/sfc_efx/base -I../drivers/common/sfc_efx/base -fdiagnostics-color=always -pipe -D_FILE_OFFSET_BITS=64 -Wall -Winvalid-pch -Werror -O3 -include rte_config.h -Wextra -Wcast-qual -Wdeprecated -Wformat -Wformat-nonliteral -Wformat-security -Wmissing-declarations -Wmissing-prototypes -Wnested-externs -Wold-style-definition -Wpointer-arith -Wsign-compare -Wstrict-prototypes -Wundef -Wwrite-strings -Wno-address-of-packed-member -Wno-packed-not-aligned -Wno-missing-field-initializers -Wno-zero-length-bounds -D_GNU_SOURCE -fPIC -march=native -DALLOW_EXPERIMENTAL_API -DALLOW_INTERNAL_API -Wno-format-truncation -Wno-strict-aliasing -Wdisabled-optimization -Waggregate-return -Wbad-function-cast -DRTE_LOG_DEFAULT_LOGTYPE=pmd.net.sfc -MD -MQ drivers/libtmp_rte_net_sfc.a.p/net_sfc_sfc_flow.c.o -MF drivers/libtmp_rte_net_sfc.a.p/net_sfc_sfc_flow.c.o.d -o drivers/libtmp_rte_net_sfc.a.p/net_sfc_sfc_flow.c.o -c ../drivers/net/sfc/sfc_flow.c
../drivers/net/sfc/sfc_flow.c: In function ‘sfc_flow_query’:
../drivers/net/sfc/sfc_flow.c:2815:26: error: ‘SFC_ETHDEV_STARTED’ undeclared (first use in this function); did you mean ‘SFC_ADAPTER_STARTED’?
 2815 |         if (sa->state != SFC_ETHDEV_STARTED) {
      |                          ^~~~~~~~~~~~~~~~~~
      |                          SFC_ADAPTER_STARTED
../drivers/net/sfc/sfc_flow.c:2815:26: note: each undeclared identifier is reported only once for each function it appears in
[1634/2753] Compiling C object drivers/libtmp_rte_net_sfc.a.p/net_sfc_sfc_service.c.o
[1635/2753] Compiling C object drivers/libtmp_rte_net_qede.a.p/net_qede_qede_rxtx.c.o
[1636/2753] Compiling C object drivers/libtmp_rte_net_sfc.a.p/net_sfc_sfc_mae.c.o
[1637/2753] Compiling C object drivers/libtmp_rte_net_qede.a.p/net_qede_qede_debug.c.o
[1638/2753] Compiling C object drivers/libtmp_rte_net_sfc.a.p/net_sfc_sfc_ef10_essb_rx.c.o
[1639/2753] Compiling C object drivers/libtmp_rte_net_sfc.a.p/net_sfc_sfc_ef10_rx.c.o
[1640/2753] Compiling C object drivers/libtmp_rte_net_sfc.a.p/net_sfc_sfc_ef100_rx.c.o
[1641/2753] Compiling C object drivers/libtmp_rte_net_sfc.a.p/net_sfc_sfc_ef100_tx.c.o
[1642/2753] Compiling C object drivers/libtmp_rte_net_sfc.a.p/net_sfc_sfc_ef10_tx.c.o
[1643/2753] Compiling C object drivers/libtmp_rte_net_octeontx2.a.p/net_octeontx2_otx2_tx.c.o
[1644/2753] Compiling C object drivers/libtmp_rte_net_octeontx2.a.p/net_octeontx2_otx2_rx.c.o
ninja: build stopped




*Build Failed #20:
OS: FC34-64
Target: x86_64-native-linuxapp-clang
FAILED: drivers/libtmp_rte_net_sfc.a.p/net_sfc_sfc_flow.c.o 
clang -Idrivers/libtmp_rte_net_sfc.a.p -Idrivers -I../drivers -Idrivers/net/sfc -I../drivers/net/sfc -Ilib/ethdev -I../lib/ethdev -I. -I.. -Iconfig -I../config -Ilib/eal/include -I../lib/eal/include -Ilib/eal/linux/include -I../lib/eal/linux/include -Ilib/eal/x86/include -I../lib/eal/x86/include -Ilib/eal/common -I../lib/eal/common -Ilib/eal -I../lib/eal -Ilib/kvargs -I../lib/kvargs -Ilib/metrics -I../lib/metrics -Ilib/telemetry -I../lib/telemetry -Ilib/net -I../lib/net -Ilib/mbuf -I../lib/mbuf -Ilib/mempool -I../lib/mempool -Ilib/ring -I../lib/ring -Ilib/meter -I../lib/meter -Idrivers/bus/pci -I../drivers/bus/pci -I../drivers/bus/pci/linux -Ilib/pci -I../lib/pci -Idrivers/bus/vdev -I../drivers/bus/vdev -Idrivers/common/sfc_efx -I../drivers/common/sfc_efx -Idrivers/common/sfc_efx/base -I../drivers/common/sfc_efx/base -Xclang -fcolor-diagnostics -pipe -D_FILE_OFFSET_BITS=64 -Wall -Winvalid-pch -Werror -O3 -include rte_config.h -Wextra -Wcast-qual -Wdeprecated -Wformat -Wformat-nonliteral -Wformat-security -Wmissing-declarations -Wmissing-prototypes -Wnested-externs -Wold-style-definition -Wpointer-arith -Wsign-compare -Wstrict-prototypes -Wundef -Wwrite-strings -Wno-address-of-packed-member -Wno-missing-field-initializers -D_GNU_SOURCE -fPIC -march=native -DALLOW_EXPERIMENTAL_API -DALLOW_INTERNAL_API -Wno-strict-aliasing -Wdisabled-optimization -Waggregate-return -Wbad-function-cast -DRTE_LOG_DEFAULT_LOGTYPE=pmd.net.sfc -MD -MQ drivers/libtmp_rte_net_sfc.a.p/net_sfc_sfc_flow.c.o -MF drivers/libtmp_rte_net_sfc.a.p/net_sfc_sfc_flow.c.o.d -o drivers/libtmp_rte_net_sfc.a.p/net_sfc_sfc_flow.c.o -c ../drivers/net/sfc/sfc_flow.c
../drivers/net/sfc/sfc_flow.c:2815:19: error: use of undeclared identifier 'SFC_ETHDEV_STARTED'; did you mean 'SFC_ADAPTER_STARTED'?
        if (sa->state != SFC_ETHDEV_STARTED) {
                         ^~~~~~~~~~~~~~~~~~
                         SFC_ADAPTER_STARTED
../drivers/net/sfc/sfc.h:83:2: note: 'SFC_ADAPTER_STARTED' declared here
        SFC_ADAPTER_STARTED,
        ^
1 error generated.
[1643/2753] Generating rte_net_softnic_mingw with a custom command
[1644/2753] Compiling C object drivers/libtmp_rte_net_sfc.a.p/net_sfc_sfc_mae.c.o
[1645/2753] Compiling C object drivers/libtmp_rte_net_sfc.a.p/net_sfc_sfc_service.c.o
[1646/2753] Compiling C object drivers/libtmp_rte_net_octeontx2.a.p/net_octeontx2_otx2_rx.c.o
[1647/2753] Compiling C object drivers/libtmp_rte_net_sfc.a.p/net_sfc_sfc_ef10_essb_rx.c.o
[1648/2753] Compiling C object drivers/libtmp_rte_net_sfc.a.p/net_sfc_sfc_ef100_rx.c.o
[1649/2753] Compiling C object drivers/libtmp_rte_net_sfc.a.p/net_sfc_sfc_ef10_rx.c.o
[1650/2753] Compiling C object drivers/libtmp_rte_net_sfc.a.p/net_sfc_sfc_ef10_tx.c.o
[1651/2753] Compiling C object drivers/libtmp_rte_net_sfc.a.p/net_sfc_sfc_ef100_tx.c.o
ninja: build stopped


DPDK STV team

^ permalink raw reply	[flat|nested] 3+ messages in thread

* [dpdk-test-report] |FAILURE| pw(93898) sid(17238) [v2, 20/20] net/sfc: support flow API query for count actions
@ 2021-06-10  9:30 sys_stv
  0 siblings, 0 replies; 3+ messages in thread
From: sys_stv @ 2021-06-10  9:30 UTC (permalink / raw)
  To: test-report

[-- Attachment #1: Type: text/plain, Size: 64318 bytes --]


Test-Label: Intel-compilation
Test-Status: FAILURE
http://dpdk.org/patch/93898

_Compilation issues_

Submitter: Andrew Rybchenko <Andrew.Rybchenko@oktetlabs.ru>
Date: 2021-06-04 14:24:14
Reply_mail: 20210604142414.283611-21-andrew.rybchenko@oktetlabs.ru

DPDK git baseline: Repo:dpdk, CommitID: 469d5c02159ddf0746ddbb9822c034556422515f


Meson Build Summary: 22 Builds Done, 2 Successful, 20 Failures, 0 Blocked

+------------------+------------+--------------+------------+------------+-----------+----------+
| os               | gcc-static | clang-static | icc-static | gcc-shared | gcc-debug | document |
+------------------+------------+--------------+------------+------------+-----------+----------+
| UB2004-64        | fail       | fail         | fail       |            |           | fail     |
| RHEL83-64        | fail       |              |            |            |           |          |
| FC34-64          | fail       | fail         |            |            |           |          |
| CentOsStream8-64 | fail       |              |            |            |           |          |
| UB2104-64        | fail       |              |            |            |           |          |
| WIN10-64         |            | pass         |            |            |           |          |
| UB2004-32        | pass       |              |            |            |           |          |
| CENTOS83-64      | fail       | fail         | fail       | fail       | fail      |          |
| FreeBSD1201-64   | fail       | fail         |            | fail       | fail      |          |
| SUSE15-64        | fail       | fail         |            |            |           |          |
+------------------+------------+--------------+------------+------------+-----------+----------+
Test environment and configuration as below:


OS: UB2004-64
	Kernel Version: 5.8.0-48-generic
	GCC Version: gcc (Ubuntu 10.2.0-5ubuntu1~20.04) 10.2.0
	Clang Version: 10.0.0-4ubuntu1
	x86_64-native-linuxapp-clang
	x86_64-native-linuxapp-gcc
	x86_64-native-linuxapp-icc
	x86_64-native-linuxapp-doc

OS: RHEL83-64
	Kernel Version: 4.18.0-240.el8.x86_64
	GCC Version: gcc (GCC) 8.3.1 20191121 (Red Hat 8.3.1-5)
	Clang Version: 10.0.1 (Red Hat 10.0.1-1.module+el8.3.0+7459+90c24896)
	x86_64-native-linuxapp-gcc

OS: FC34-64
	Kernel Version: 5.11.15-300.fc34.x86_64
	GCC Version: gcc (GCC) 11.0.1 20210324 (Red Hat 11.0.1-0)
	Clang Version: 12.0.0 (Fedora 12.0.0-0.3.rc1.fc34)
	x86_64-native-linuxapp-gcc
	x86_64-native-linuxapp-clang

OS: CentOsStream8-64
	Kernel Version: 4.18.0-257.el8.x86_64
	GCC Version: gcc (GCC) 8.4.1 20200928 (Red Hat 8.4.1-1)
	Clang Version: 11.0.0 (Red Hat 11.0.0-0.2.rc2.module_el8.4.0+533+50191577)
	x86_64-native-linuxapp-gcc

OS: UB2104-64
	Kernel Version: 5.11.0-16-generic
	GCC Version: gcc (Ubuntu 10.3.0-1ubuntu1) 10.3.0
	Clang Version: 12.0.0-1ubuntu1
	x86_64-native-linuxapp-gcc

OS: WIN10-64
	Kernel Version: N/A
	GCC Version: N/A
	Clang Version: Clang 8.0.0
	x86_64-windows-clang

OS: UB2004-32
	Kernel Version: 5.8.0-48-generic
	GCC Version: gcc (Ubuntu 10.2.0-5ubuntu1~20.04) 10.2.0
	Clang Version: 10.0.0-4ubuntu1
	i686-native-linuxapp-gcc

OS: CENTOS83-64
	Kernel Version: 4.18.0-240.1.1.el8_3.x86_64
	GCC Version: gcc (GCC) 8.3.1 20191121 (Red Hat 8.3.1-5)
	Clang Version: 10.0.1 (Red Hat 10.0.1-1.module_el8.3.0+467+cb298d5b)
	x86_64-native-linuxapp-gcc
	x86_64-native-linuxapp-clang
	x86_64-native-linuxapp-icc
	x86_64-native-linuxapp-gcc+shared
	x86_64-native-linuxapp-gcc+debug

OS: FreeBSD1201-64
	Kernel Version: 12.1-RELEASE
	GCC Version: gcc (FreeBSD Ports Collection) 9.2.0
	Clang Version: 8.0.1 (tags/RELEASE_801/final 366581) (based on LLVM 8.0.1)
	x86_64-native-bsdapp-gcc
	x86_64-native-bsdapp-clang
	x86_64-native-bsdapp-gcc+shared
	x86_64-native-bsdapp-gcc+debug

OS: SUSE15-64
	Kernel Version: 5.3.18-lp152.57-default
	GCC Version: gcc (SUSE Linux) 7.5.0
	Clang Version: 9.0.1
	x86_64-native-linuxapp-clang
	x86_64-native-linuxapp-gcc



*Build Failed #1:
OS: CENTOS83-64
Target: x86_64-native-linuxapp-gcc
FAILED: drivers/libtmp_rte_net_sfc.a.p/net_sfc_sfc_flow.c.o 
gcc -Idrivers/libtmp_rte_net_sfc.a.p -Idrivers -I../drivers -Idrivers/net/sfc -I../drivers/net/sfc -Ilib/ethdev -I../lib/ethdev -I. -I.. -Iconfig -I../config -Ilib/eal/include -I../lib/eal/include -Ilib/eal/linux/include -I../lib/eal/linux/include -Ilib/eal/x86/include -I../lib/eal/x86/include -Ilib/eal/common -I../lib/eal/common -Ilib/eal -I../lib/eal -Ilib/kvargs -I../lib/kvargs -Ilib/metrics -I../lib/metrics -Ilib/telemetry -I../lib/telemetry -Ilib/net -I../lib/net -Ilib/mbuf -I../lib/mbuf -Ilib/mempool -I../lib/mempool -Ilib/ring -I../lib/ring -Ilib/meter -I../lib/meter -Idrivers/bus/pci -I../drivers/bus/pci -I../drivers/bus/pci/linux -Ilib/pci -I../lib/pci -Idrivers/bus/vdev -I../drivers/bus/vdev -Idrivers/common/sfc_efx -I../drivers/common/sfc_efx -Idrivers/common/sfc_efx/base -I../drivers/common/sfc_efx/base -fdiagnostics-color=always -pipe -D_FILE_OFFSET_BITS=64 -Wall -Winvalid-pch -Werror -O3 -include rte_config.h -Wextra -Wcast-qual -Wdeprecated -Wformat -Wformat-nonliteral -Wformat-security -Wmissing-declarations -Wmissing-prototypes -Wnested-externs -Wold-style-definition -Wpointer-arith -Wsign-compare -Wstrict-prototypes -Wundef -Wwrite-strings -Wno-packed-not-aligned -Wno-missing-field-initializers -D_GNU_SOURCE -fPIC -march=native -DALLOW_EXPERIMENTAL_API -DALLOW_INTERNAL_API -Wno-format-truncation -Wno-strict-aliasing -Wdisabled-optimization -Waggregate-return -Wbad-function-cast -DRTE_LOG_DEFAULT_LOGTYPE=pmd.net.sfc -MD -MQ drivers/libtmp_rte_net_sfc.a.p/net_sfc_sfc_flow.c.o -MF drivers/libtmp_rte_net_sfc.a.p/net_sfc_sfc_flow.c.o.d -o drivers/libtmp_rte_net_sfc.a.p/net_sfc_sfc_flow.c.o -c ../drivers/net/sfc/sfc_flow.c
../drivers/net/sfc/sfc_flow.c: In function ‘sfc_flow_query’:
../drivers/net/sfc/sfc_flow.c:2815:19: error: ‘SFC_ETHDEV_STARTED’ undeclared (first use in this function); did you mean ‘SFC_ADAPTER_STARTED’?
  if (sa->state != SFC_ETHDEV_STARTED) {
                   ^~~~~~~~~~~~~~~~~~
                   SFC_ADAPTER_STARTED
../drivers/net/sfc/sfc_flow.c:2815:19: note: each undeclared identifier is reported only once for each function it appears in
[1632/2751] Compiling C object drivers/libtmp_rte_net_sfc.a.p/net_sfc_sfc_ef10_essb_rx.c.o
[1633/2751] Compiling C object drivers/libtmp_rte_net_sfc.a.p/net_sfc_sfc_service.c.o
[1634/2751] Compiling C object drivers/libtmp_rte_net_sfc.a.p/net_sfc_sfc_mae_counter.c.o
[1635/2751] Compiling C object drivers/libtmp_rte_net_sfc.a.p/net_sfc_sfc_ef10_rx.c.o
[1636/2751] Compiling C object drivers/libtmp_rte_net_sfc.a.p/net_sfc_sfc_mae.c.o
[1637/2751] Compiling C object drivers/libtmp_rte_net_sfc.a.p/net_sfc_sfc_ef100_rx.c.o
[1638/2751] Compiling C object drivers/libtmp_rte_net_sfc.a.p/net_sfc_sfc_ef100_tx.c.o
[1639/2751] Compiling C object drivers/libtmp_rte_net_qede.a.p/net_qede_qede_debug.c.o
[1640/2751] Compiling C object drivers/libtmp_rte_net_sfc.a.p/net_sfc_sfc_ef10_tx.c.o
[1641/2751] Compiling C object drivers/libtmp_rte_net_octeontx2.a.p/net_octeontx2_otx2_tx.c.o
[1642/2751] Compiling C object drivers/libtmp_rte_net_octeontx2.a.p/net_octeontx2_otx2_rx.c.o
ninja: build stopped




*Build Failed #2:
OS: CENTOS83-64
Target: x86_64-native-linuxapp-clang
FAILED: drivers/libtmp_rte_net_sfc.a.p/net_sfc_sfc_flow.c.o 
clang -Idrivers/libtmp_rte_net_sfc.a.p -Idrivers -I../drivers -Idrivers/net/sfc -I../drivers/net/sfc -Ilib/ethdev -I../lib/ethdev -I. -I.. -Iconfig -I../config -Ilib/eal/include -I../lib/eal/include -Ilib/eal/linux/include -I../lib/eal/linux/include -Ilib/eal/x86/include -I../lib/eal/x86/include -Ilib/eal/common -I../lib/eal/common -Ilib/eal -I../lib/eal -Ilib/kvargs -I../lib/kvargs -Ilib/metrics -I../lib/metrics -Ilib/telemetry -I../lib/telemetry -Ilib/net -I../lib/net -Ilib/mbuf -I../lib/mbuf -Ilib/mempool -I../lib/mempool -Ilib/ring -I../lib/ring -Ilib/meter -I../lib/meter -Idrivers/bus/pci -I../drivers/bus/pci -I../drivers/bus/pci/linux -Ilib/pci -I../lib/pci -Idrivers/bus/vdev -I../drivers/bus/vdev -Idrivers/common/sfc_efx -I../drivers/common/sfc_efx -Idrivers/common/sfc_efx/base -I../drivers/common/sfc_efx/base -Xclang -fcolor-diagnostics -pipe -D_FILE_OFFSET_BITS=64 -Wall -Winvalid-pch -Werror -O3 -include rte_config.h -Wextra -Wcast-qual -Wdeprecated -Wformat -Wformat-nonliteral -Wformat-security -Wmissing-declarations -Wmissing-prototypes -Wnested-externs -Wold-style-definition -Wpointer-arith -Wsign-compare -Wstrict-prototypes -Wundef -Wwrite-strings -Wno-address-of-packed-member -Wno-missing-field-initializers -D_GNU_SOURCE -fPIC -march=native -DALLOW_EXPERIMENTAL_API -DALLOW_INTERNAL_API -Wno-strict-aliasing -Wdisabled-optimization -Waggregate-return -Wbad-function-cast -DRTE_LOG_DEFAULT_LOGTYPE=pmd.net.sfc -MD -MQ drivers/libtmp_rte_net_sfc.a.p/net_sfc_sfc_flow.c.o -MF drivers/libtmp_rte_net_sfc.a.p/net_sfc_sfc_flow.c.o.d -o drivers/libtmp_rte_net_sfc.a.p/net_sfc_sfc_flow.c.o -c ../drivers/net/sfc/sfc_flow.c
../drivers/net/sfc/sfc_flow.c:2815:19: error: use of undeclared identifier 'SFC_ETHDEV_STARTED'; did you mean 'SFC_ADAPTER_STARTED'?
        if (sa->state != SFC_ETHDEV_STARTED) {
                         ^~~~~~~~~~~~~~~~~~
                         SFC_ADAPTER_STARTED
../drivers/net/sfc/sfc.h:83:2: note: 'SFC_ADAPTER_STARTED' declared here
        SFC_ADAPTER_STARTED,
        ^
1 error generated.
[1646/2754] Generating rte_net_sfc_mingw with a custom command
[1647/2754] Compiling C object drivers/libtmp_rte_net_sfc.a.p/net_sfc_sfc_mae.c.o
[1648/2754] Compiling C object drivers/libtmp_rte_net_sfc.a.p/net_sfc_sfc_ef10_rx.c.o
[1649/2754] Compiling C object drivers/libtmp_rte_net_sfc.a.p/net_sfc_sfc_ef10_essb_rx.c.o
[1650/2754] Compiling C object drivers/libtmp_rte_net_sfc.a.p/net_sfc_sfc_ef100_rx.c.o
[1651/2754] Compiling C object drivers/libtmp_rte_net_softnic.a.p/net_softnic_parser.c.o
[1652/2754] Compiling C object drivers/libtmp_rte_net_octeontx2.a.p/net_octeontx2_otx2_rx.c.o
[1653/2754] Compiling C object drivers/libtmp_rte_net_sfc.a.p/net_sfc_sfc_ef100_tx.c.o
[1654/2754] Compiling C object drivers/libtmp_rte_net_sfc.a.p/net_sfc_sfc_ef10_tx.c.o
ninja: build stopped




*Build Failed #3:
OS: CENTOS83-64
Target: x86_64-native-linuxapp-icc
FAILED: drivers/libtmp_rte_net_sfc.a.p/net_sfc_sfc_flow.c.o 
icc -Idrivers/libtmp_rte_net_sfc.a.p -Idrivers -I../drivers -Idrivers/net/sfc -I../drivers/net/sfc -Ilib/ethdev -I../lib/ethdev -I. -I.. -Iconfig -I../config -Ilib/eal/include -I../lib/eal/include -Ilib/eal/linux/include -I../lib/eal/linux/include -Ilib/eal/x86/include -I../lib/eal/x86/include -Ilib/eal/common -I../lib/eal/common -Ilib/eal -I../lib/eal -Ilib/kvargs -I../lib/kvargs -Ilib/metrics -I../lib/metrics -Ilib/telemetry -I../lib/telemetry -Ilib/net -I../lib/net -Ilib/mbuf -I../lib/mbuf -Ilib/mempool -I../lib/mempool -Ilib/ring -I../lib/ring -Ilib/meter -I../lib/meter -Idrivers/bus/pci -I../drivers/bus/pci -I../drivers/bus/pci/linux -Ilib/pci -I../lib/pci -Idrivers/bus/vdev -I../drivers/bus/vdev -Idrivers/common/sfc_efx -I../drivers/common/sfc_efx -Idrivers/common/sfc_efx/base -I../drivers/common/sfc_efx/base -pipe -D_FILE_OFFSET_BITS=64 -Wall -w3 -diag-disable:remark -Werror -O3 -include rte_config.h -Wextra -Wcast-qual -Wdeprecated -Wformat -Wformat-security -Wmissing-declarations -Wmissing-prototypes -Wold-style-definition -Wpointer-arith -Wsign-compare -Wstrict-prototypes -Wundef -Wwrite-strings -Wno-missing-field-initializers -diag-disable=181 -diag-disable=188 -diag-disable=2203 -diag-disable=2279 -diag-disable=2557 -diag-disable=3179 -diag-disable=3656 -D_GNU_SOURCE -fPIC -march=native -DALLOW_EXPERIMENTAL_API -DALLOW_INTERNAL_API -Wno-strict-aliasing -Wdisabled-optimization -DRTE_LOG_DEFAULT_LOGTYPE=pmd.net.sfc -MD -MQ drivers/libtmp_rte_net_sfc.a.p/net_sfc_sfc_flow.c.o -MF drivers/libtmp_rte_net_sfc.a.p/net_sfc_sfc_flow.c.o.d -o drivers/libtmp_rte_net_sfc.a.p/net_sfc_sfc_flow.c.o -c ../drivers/net/sfc/sfc_flow.c
../drivers/net/sfc/sfc_flow.c(2815): error: identifier "SFC_ETHDEV_STARTED" is undefined
  	if (sa->state != SFC_ETHDEV_STARTED) {
  	                 ^

compilation aborted for ../drivers/net/sfc/sfc_flow.c (code 2)
[1624/2751] Compiling C object drivers/libtmp_rte_net_sfc.a.p/net_sfc_sfc_tx.c.o
[1625/2751] Compiling C object drivers/libtmp_rte_net_sfc.a.p/net_sfc_sfc_mae_counter.c.o
[1626/2751] Compiling C object drivers/libtmp_rte_net_sfc.a.p/net_sfc_sfc_dp.c.o
[1627/2751] Compiling C object drivers/libtmp_rte_net_qede.a.p/net_qede_qede_rxtx.c.o
[1628/2751] Compiling C object drivers/libtmp_rte_net_pcap.a.p/net_pcap_pcap_ethdev.c.o
[1629/2751] Compiling C object drivers/libtmp_rte_net_sfc.a.p/net_sfc_sfc_ef10_essb_rx.c.o
[1630/2751] Compiling C object drivers/libtmp_rte_net_sfc.a.p/net_sfc_sfc_ef10_rx.c.o
[1631/2751] Compiling C object drivers/libtmp_rte_net_sfc.a.p/net_sfc_sfc_mae.c.o
[1632/2751] Compiling C object drivers/libtmp_rte_net_sfc.a.p/net_sfc_sfc_ef10_tx.c.o
[1633/2751] Compiling C object drivers/libtmp_rte_net_octeontx2.a.p/net_octeontx2_otx2_rx.c.o
[1634/2751] Compiling C object drivers/libtmp_rte_net_octeontx2.a.p/net_octeontx2_otx2_tx.c.o
ninja: build stopped




*Build Failed #4:
OS: CENTOS83-64
Target: x86_64-native-linuxapp-gcc+shared
FAILED: drivers/libtmp_rte_net_sfc.a.p/net_sfc_sfc_flow.c.o 
gcc -Idrivers/libtmp_rte_net_sfc.a.p -Idrivers -I../drivers -Idrivers/net/sfc -I../drivers/net/sfc -Ilib/ethdev -I../lib/ethdev -I. -I.. -Iconfig -I../config -Ilib/eal/include -I../lib/eal/include -Ilib/eal/linux/include -I../lib/eal/linux/include -Ilib/eal/x86/include -I../lib/eal/x86/include -Ilib/eal/common -I../lib/eal/common -Ilib/eal -I../lib/eal -Ilib/kvargs -I../lib/kvargs -Ilib/metrics -I../lib/metrics -Ilib/telemetry -I../lib/telemetry -Ilib/net -I../lib/net -Ilib/mbuf -I../lib/mbuf -Ilib/mempool -I../lib/mempool -Ilib/ring -I../lib/ring -Ilib/meter -I../lib/meter -Idrivers/bus/pci -I../drivers/bus/pci -I../drivers/bus/pci/linux -Ilib/pci -I../lib/pci -Idrivers/bus/vdev -I../drivers/bus/vdev -Idrivers/common/sfc_efx -I../drivers/common/sfc_efx -Idrivers/common/sfc_efx/base -I../drivers/common/sfc_efx/base -fdiagnostics-color=always -pipe -D_FILE_OFFSET_BITS=64 -Wall -Winvalid-pch -Werror -O3 -include rte_config.h -Wextra -Wcast-qual -Wdeprecated -Wformat -Wformat-nonliteral -Wformat-security -Wmissing-declarations -Wmissing-prototypes -Wnested-externs -Wold-style-definition -Wpointer-arith -Wsign-compare -Wstrict-prototypes -Wundef -Wwrite-strings -Wno-packed-not-aligned -Wno-missing-field-initializers -D_GNU_SOURCE -fPIC -march=native -DALLOW_EXPERIMENTAL_API -DALLOW_INTERNAL_API -Wno-format-truncation -Wno-strict-aliasing -Wdisabled-optimization -Waggregate-return -Wbad-function-cast -DRTE_LOG_DEFAULT_LOGTYPE=pmd.net.sfc -MD -MQ drivers/libtmp_rte_net_sfc.a.p/net_sfc_sfc_flow.c.o -MF drivers/libtmp_rte_net_sfc.a.p/net_sfc_sfc_flow.c.o.d -o drivers/libtmp_rte_net_sfc.a.p/net_sfc_sfc_flow.c.o -c ../drivers/net/sfc/sfc_flow.c
../drivers/net/sfc/sfc_flow.c: In function ‘sfc_flow_query’:
../drivers/net/sfc/sfc_flow.c:2815:19: error: ‘SFC_ETHDEV_STARTED’ undeclared (first use in this function); did you mean ‘SFC_ADAPTER_STARTED’?
  if (sa->state != SFC_ETHDEV_STARTED) {
                   ^~~~~~~~~~~~~~~~~~
                   SFC_ADAPTER_STARTED
../drivers/net/sfc/sfc_flow.c:2815:19: note: each undeclared identifier is reported only once for each function it appears in
[1658/2586] Compiling C object drivers/libtmp_rte_net_sfc.a.p/net_sfc_sfc_service.c.o
[1659/2586] Generating rte_net_qede.pmd.c with a custom command
[1660/2586] Compiling C object drivers/libtmp_rte_net_sfc.a.p/net_sfc_sfc_mae_counter.c.o
[1661/2586] Compiling C object drivers/libtmp_rte_net_sfc.a.p/net_sfc_sfc_ef10_essb_rx.c.o
[1662/2586] Compiling C object drivers/libtmp_rte_net_sfc.a.p/net_sfc_sfc_mae.c.o
[1663/2586] Compiling C object drivers/libtmp_rte_net_sfc.a.p/net_sfc_sfc_ef10_rx.c.o
[1664/2586] Compiling C object drivers/libtmp_rte_net_sfc.a.p/net_sfc_sfc_ef100_rx.c.o
[1665/2586] Compiling C object drivers/libtmp_rte_net_sfc.a.p/net_sfc_sfc_ef100_tx.c.o
[1666/2586] Compiling C object drivers/libtmp_rte_net_sfc.a.p/net_sfc_sfc_ef10_tx.c.o
[1667/2586] Compiling C object drivers/libtmp_rte_net_octeontx2.a.p/net_octeontx2_otx2_tx.c.o
[1668/2586] Compiling C object drivers/libtmp_rte_net_octeontx2.a.p/net_octeontx2_otx2_rx.c.o
ninja: build stopped




*Build Failed #5:
OS: CENTOS83-64
Target: x86_64-native-linuxapp-gcc+debug
FAILED: drivers/libtmp_rte_net_sfc.a.p/net_sfc_sfc_flow.c.o 
gcc -Idrivers/libtmp_rte_net_sfc.a.p -Idrivers -I../drivers -Idrivers/net/sfc -I../drivers/net/sfc -Ilib/ethdev -I../lib/ethdev -I. -I.. -Iconfig -I../config -Ilib/eal/include -I../lib/eal/include -Ilib/eal/linux/include -I../lib/eal/linux/include -Ilib/eal/x86/include -I../lib/eal/x86/include -Ilib/eal/common -I../lib/eal/common -Ilib/eal -I../lib/eal -Ilib/kvargs -I../lib/kvargs -Ilib/metrics -I../lib/metrics -Ilib/telemetry -I../lib/telemetry -Ilib/net -I../lib/net -Ilib/mbuf -I../lib/mbuf -Ilib/mempool -I../lib/mempool -Ilib/ring -I../lib/ring -Ilib/meter -I../lib/meter -Idrivers/bus/pci -I../drivers/bus/pci -I../drivers/bus/pci/linux -Ilib/pci -I../lib/pci -Idrivers/bus/vdev -I../drivers/bus/vdev -Idrivers/common/sfc_efx -I../drivers/common/sfc_efx -Idrivers/common/sfc_efx/base -I../drivers/common/sfc_efx/base -fdiagnostics-color=always -pipe -D_FILE_OFFSET_BITS=64 -Wall -Winvalid-pch -Werror -O2 -g -include rte_config.h -Wextra -Wcast-qual -Wdeprecated -Wformat -Wformat-nonliteral -Wformat-security -Wmissing-declarations -Wmissing-prototypes -Wnested-externs -Wold-style-definition -Wpointer-arith -Wsign-compare -Wstrict-prototypes -Wundef -Wwrite-strings -Wno-packed-not-aligned -Wno-missing-field-initializers -D_GNU_SOURCE -fPIC -march=native -DALLOW_EXPERIMENTAL_API -DALLOW_INTERNAL_API -Wno-format-truncation -Wno-strict-aliasing -Wdisabled-optimization -Waggregate-return -Wbad-function-cast -DRTE_LOG_DEFAULT_LOGTYPE=pmd.net.sfc -MD -MQ drivers/libtmp_rte_net_sfc.a.p/net_sfc_sfc_flow.c.o -MF drivers/libtmp_rte_net_sfc.a.p/net_sfc_sfc_flow.c.o.d -o drivers/libtmp_rte_net_sfc.a.p/net_sfc_sfc_flow.c.o -c ../drivers/net/sfc/sfc_flow.c
../drivers/net/sfc/sfc_flow.c: In function ‘sfc_flow_query’:
../drivers/net/sfc/sfc_flow.c:2815:19: error: ‘SFC_ETHDEV_STARTED’ undeclared (first use in this function); did you mean ‘SFC_ADAPTER_STARTED’?
  if (sa->state != SFC_ETHDEV_STARTED) {
                   ^~~~~~~~~~~~~~~~~~
                   SFC_ADAPTER_STARTED
../drivers/net/sfc/sfc_flow.c:2815:19: note: each undeclared identifier is reported only once for each function it appears in
[1638/2754] Linking target drivers/librte_net_qede.so.21.3
[1639/2754] Compiling C object drivers/libtmp_rte_net_sfc.a.p/net_sfc_sfc_rx.c.o
[1640/2754] Compiling C object drivers/libtmp_rte_net_sfc.a.p/net_sfc_sfc_mae_counter.c.o
[1641/2754] Compiling C object drivers/libtmp_rte_net_sfc.a.p/net_sfc_sfc_ef10_essb_rx.c.o
[1642/2754] Compiling C object drivers/libtmp_rte_net_sfc.a.p/net_sfc_sfc_ef10_rx.c.o
[1643/2754] Compiling C object drivers/libtmp_rte_net_sfc.a.p/net_sfc_sfc_mae.c.o
[1644/2754] Compiling C object drivers/libtmp_rte_net_sfc.a.p/net_sfc_sfc_ef10_tx.c.o
[1645/2754] Compiling C object drivers/libtmp_rte_net_octeontx2.a.p/net_octeontx2_otx2_tx.c.o
[1646/2754] Compiling C object drivers/libtmp_rte_net_octeontx2.a.p/net_octeontx2_otx2_rx.c.o
ninja: build stopped




*Build Failed #6:
OS: FreeBSD1201-64
Target: x86_64-native-bsdapp-gcc
FAILED: drivers/libtmp_rte_net_sfc.a.p/net_sfc_sfc_flow.c.o 
gcc -Idrivers/libtmp_rte_net_sfc.a.p -Idrivers -I../drivers -Idrivers/net/sfc -I../drivers/net/sfc -Ilib/ethdev -I../lib/ethdev -I. -I.. -Iconfig -I../config -Ilib/eal/include -I../lib/eal/include -Ilib/eal/freebsd/include -I../lib/eal/freebsd/include -Ilib/eal/x86/include -I../lib/eal/x86/include -Ilib/eal/common -I../lib/eal/common -Ilib/eal -I../lib/eal -Ilib/kvargs -I../lib/kvargs -Ilib/metrics -I../lib/metrics -Ilib/telemetry -I../lib/telemetry -Ilib/net -I../lib/net -Ilib/mbuf -I../lib/mbuf -Ilib/mempool -I../lib/mempool -Ilib/ring -I../lib/ring -Ilib/meter -I../lib/meter -Idrivers/bus/pci -I../drivers/bus/pci -I../drivers/bus/pci/bsd -Ilib/pci -I../lib/pci -Idrivers/bus/vdev -I../drivers/bus/vdev -Idrivers/common/sfc_efx -I../drivers/common/sfc_efx -Idrivers/common/sfc_efx/base -I../drivers/common/sfc_efx/base -fdiagnostics-color=always -pipe -D_FILE_OFFSET_BITS=64 -Wall -Winvalid-pch -Werror -O3 -include rte_config.h -Wextra -Wcast-qual -Wdeprecated -Wformat -Wformat-nonliteral -Wformat-security -Wmissing-declarations -Wmissing-prototypes -Wnested-externs -Wold-style-definition -Wpointer-arith -Wsign-compare -Wstrict-prototypes -Wundef -Wwrite-strings -Wno-address-of-packed-member -Wno-packed-not-aligned -Wno-missing-field-initializers -D_GNU_SOURCE -D__BSD_VISIBLE -fPIC -march=native -mno-avx512f -DALLOW_EXPERIMENTAL_API -DALLOW_INTERNAL_API -Wno-format-truncation -Wno-strict-aliasing -Wdisabled-optimization -Waggregate-return -Wbad-function-cast -DRTE_LOG_DEFAULT_LOGTYPE=pmd.net.sfc -MD -MQ drivers/libtmp_rte_net_sfc.a.p/net_sfc_sfc_flow.c.o -MF drivers/libtmp_rte_net_sfc.a.p/net_sfc_sfc_flow.c.o.d -o drivers/libtmp_rte_net_sfc.a.p/net_sfc_sfc_flow.c.o -c ../drivers/net/sfc/sfc_flow.c
../drivers/net/sfc/sfc_flow.c: In function 'sfc_flow_query':
../drivers/net/sfc/sfc_flow.c:2815:19: error: 'SFC_ETHDEV_STARTED' undeclared (first use in this function); did you mean 'SFC_ADAPTER_STARTED'?
 2815 |  if (sa->state != SFC_ETHDEV_STARTED) {
      |                   ^~~~~~~~~~~~~~~~~~
      |                   SFC_ADAPTER_STARTED
../drivers/net/sfc/sfc_flow.c:2815:19: note: each undeclared identifier is reported only once for each function it appears in
[1242/1951] Compiling C object drivers/libtmp_rte_net_sfc.a.p/net_sfc_sfc_mae.c.o
[1243/1951] Compiling C object drivers/libtmp_rte_net_sfc.a.p/net_sfc_sfc_ef10_essb_rx.c.o
[1244/1951] Compiling C object drivers/libtmp_rte_net_sfc.a.p/net_sfc_sfc_ef10_rx.c.o
[1245/1951] Compiling C object drivers/libtmp_rte_net_sfc.a.p/net_sfc_sfc_ef100_rx.c.o
[1246/1951] Compiling C object drivers/libtmp_rte_net_sfc.a.p/net_sfc_sfc_ef10_tx.c.o
ninja: build stopped




*Build Failed #7:
OS: FreeBSD1201-64
Target: x86_64-native-bsdapp-clang
FAILED: drivers/libtmp_rte_net_sfc.a.p/net_sfc_sfc_flow.c.o 
clang -Idrivers/libtmp_rte_net_sfc.a.p -Idrivers -I../drivers -Idrivers/net/sfc -I../drivers/net/sfc -Ilib/ethdev -I../lib/ethdev -I. -I.. -Iconfig -I../config -Ilib/eal/include -I../lib/eal/include -Ilib/eal/freebsd/include -I../lib/eal/freebsd/include -Ilib/eal/x86/include -I../lib/eal/x86/include -Ilib/eal/common -I../lib/eal/common -Ilib/eal -I../lib/eal -Ilib/kvargs -I../lib/kvargs -Ilib/metrics -I../lib/metrics -Ilib/telemetry -I../lib/telemetry -Ilib/net -I../lib/net -Ilib/mbuf -I../lib/mbuf -Ilib/mempool -I../lib/mempool -Ilib/ring -I../lib/ring -Ilib/meter -I../lib/meter -Idrivers/bus/pci -I../drivers/bus/pci -I../drivers/bus/pci/bsd -Ilib/pci -I../lib/pci -Idrivers/bus/vdev -I../drivers/bus/vdev -Idrivers/common/sfc_efx -I../drivers/common/sfc_efx -Idrivers/common/sfc_efx/base -I../drivers/common/sfc_efx/base -Xclang -fcolor-diagnostics -pipe -D_FILE_OFFSET_BITS=64 -Wall -Winvalid-pch -Werror -O3 -include rte_config.h -Wextra -Wcast-qual -Wdeprecated -Wformat -Wformat-nonliteral -Wformat-security -Wmissing-declarations -Wmissing-prototypes -Wnested-externs -Wold-style-definition -Wpointer-arith -Wsign-compare -Wstrict-prototypes -Wundef -Wwrite-strings -Wno-address-of-packed-member -Wno-missing-field-initializers -D_GNU_SOURCE -D__BSD_VISIBLE -fPIC -march=native -mno-avx512f -DALLOW_EXPERIMENTAL_API -DALLOW_INTERNAL_API -Wno-strict-aliasing -Wdisabled-optimization -Waggregate-return -Wbad-function-cast -DRTE_LOG_DEFAULT_LOGTYPE=pmd.net.sfc -MD -MQ drivers/libtmp_rte_net_sfc.a.p/net_sfc_sfc_flow.c.o -MF drivers/libtmp_rte_net_sfc.a.p/net_sfc_sfc_flow.c.o.d -o drivers/libtmp_rte_net_sfc.a.p/net_sfc_sfc_flow.c.o -c ../drivers/net/sfc/sfc_flow.c
../drivers/net/sfc/sfc_flow.c:2815:19: error: use of undeclared identifier 'SFC_ETHDEV_STARTED'; did you mean 'SFC_ADAPTER_STARTED'?
        if (sa->state != SFC_ETHDEV_STARTED) {
                         ^~~~~~~~~~~~~~~~~~
                         SFC_ADAPTER_STARTED
../drivers/net/sfc/sfc.h:83:2: note: 'SFC_ADAPTER_STARTED' declared here
        SFC_ADAPTER_STARTED,
        ^
1 error generated.
[1250/1951] Compiling C object drivers/net/thunderx/base/libnicvf_base.a.p/nicvf_hw.c.o
[1251/1951] Compiling C object drivers/libtmp_rte_net_sfc.a.p/net_sfc_sfc_ef100_tx.c.o
[1252/1951] Compiling C object drivers/net/thunderx/base/libnicvf_base.a.p/nicvf_mbox.c.o
[1253/1951] Compiling C object drivers/net/thunderx/base/libnicvf_base.a.p/nicvf_bsvf.c.o
[1254/1951] Compiling C object drivers/libtmp_rte_net_thunderx.a.p/net_thunderx_nicvf_ethdev.c.o
ninja: build stopped




*Build Failed #8:
OS: FreeBSD1201-64
Target: x86_64-native-bsdapp-gcc+shared
FAILED: drivers/libtmp_rte_net_sfc.a.p/net_sfc_sfc_flow.c.o 
gcc -Idrivers/libtmp_rte_net_sfc.a.p -Idrivers -I../drivers -Idrivers/net/sfc -I../drivers/net/sfc -Ilib/ethdev -I../lib/ethdev -I. -I.. -Iconfig -I../config -Ilib/eal/include -I../lib/eal/include -Ilib/eal/freebsd/include -I../lib/eal/freebsd/include -Ilib/eal/x86/include -I../lib/eal/x86/include -Ilib/eal/common -I../lib/eal/common -Ilib/eal -I../lib/eal -Ilib/kvargs -I../lib/kvargs -Ilib/metrics -I../lib/metrics -Ilib/telemetry -I../lib/telemetry -Ilib/net -I../lib/net -Ilib/mbuf -I../lib/mbuf -Ilib/mempool -I../lib/mempool -Ilib/ring -I../lib/ring -Ilib/meter -I../lib/meter -Idrivers/bus/pci -I../drivers/bus/pci -I../drivers/bus/pci/bsd -Ilib/pci -I../lib/pci -Idrivers/bus/vdev -I../drivers/bus/vdev -Idrivers/common/sfc_efx -I../drivers/common/sfc_efx -Idrivers/common/sfc_efx/base -I../drivers/common/sfc_efx/base -fdiagnostics-color=always -pipe -D_FILE_OFFSET_BITS=64 -Wall -Winvalid-pch -Werror -O3 -include rte_config.h -Wextra -Wcast-qual -Wdeprecated -Wformat -Wformat-nonliteral -Wformat-security -Wmissing-declarations -Wmissing-prototypes -Wnested-externs -Wold-style-definition -Wpointer-arith -Wsign-compare -Wstrict-prototypes -Wundef -Wwrite-strings -Wno-address-of-packed-member -Wno-packed-not-aligned -Wno-missing-field-initializers -D_GNU_SOURCE -D__BSD_VISIBLE -fPIC -march=native -mno-avx512f -DALLOW_EXPERIMENTAL_API -DALLOW_INTERNAL_API -Wno-format-truncation -Wno-strict-aliasing -Wdisabled-optimization -Waggregate-return -Wbad-function-cast -DRTE_LOG_DEFAULT_LOGTYPE=pmd.net.sfc -MD -MQ drivers/libtmp_rte_net_sfc.a.p/net_sfc_sfc_flow.c.o -MF drivers/libtmp_rte_net_sfc.a.p/net_sfc_sfc_flow.c.o.d -o drivers/libtmp_rte_net_sfc.a.p/net_sfc_sfc_flow.c.o -c ../drivers/net/sfc/sfc_flow.c
../drivers/net/sfc/sfc_flow.c: In function 'sfc_flow_query':
../drivers/net/sfc/sfc_flow.c:2815:19: error: 'SFC_ETHDEV_STARTED' undeclared (first use in this function); did you mean 'SFC_ADAPTER_STARTED'?
 2815 |  if (sa->state != SFC_ETHDEV_STARTED) {
      |                   ^~~~~~~~~~~~~~~~~~
      |                   SFC_ADAPTER_STARTED
../drivers/net/sfc/sfc_flow.c:2815:19: note: each undeclared identifier is reported only once for each function it appears in
[1266/1832] Compiling C object drivers/libtmp_rte_net_sfc.a.p/net_sfc_sfc_mae.c.o
[1267/1832] Compiling C object drivers/libtmp_rte_net_sfc.a.p/net_sfc_sfc_ef10_rx.c.o
[1268/1832] Compiling C object drivers/libtmp_rte_net_sfc.a.p/net_sfc_sfc_ef10_essb_rx.c.o
[1269/1832] Compiling C object drivers/libtmp_rte_net_sfc.a.p/net_sfc_sfc_ef100_rx.c.o
[1270/1832] Compiling C object drivers/libtmp_rte_net_sfc.a.p/net_sfc_sfc_ef10_tx.c.o
ninja: build stopped




*Build Failed #9:
OS: FreeBSD1201-64
Target: x86_64-native-bsdapp-gcc+debug
FAILED: drivers/libtmp_rte_net_sfc.a.p/net_sfc_sfc_flow.c.o 
gcc -Idrivers/libtmp_rte_net_sfc.a.p -Idrivers -I../drivers -Idrivers/net/sfc -I../drivers/net/sfc -Ilib/ethdev -I../lib/ethdev -I. -I.. -Iconfig -I../config -Ilib/eal/include -I../lib/eal/include -Ilib/eal/freebsd/include -I../lib/eal/freebsd/include -Ilib/eal/x86/include -I../lib/eal/x86/include -Ilib/eal/common -I../lib/eal/common -Ilib/eal -I../lib/eal -Ilib/kvargs -I../lib/kvargs -Ilib/metrics -I../lib/metrics -Ilib/telemetry -I../lib/telemetry -Ilib/net -I../lib/net -Ilib/mbuf -I../lib/mbuf -Ilib/mempool -I../lib/mempool -Ilib/ring -I../lib/ring -Ilib/meter -I../lib/meter -Idrivers/bus/pci -I../drivers/bus/pci -I../drivers/bus/pci/bsd -Ilib/pci -I../lib/pci -Idrivers/bus/vdev -I../drivers/bus/vdev -Idrivers/common/sfc_efx -I../drivers/common/sfc_efx -Idrivers/common/sfc_efx/base -I../drivers/common/sfc_efx/base -fdiagnostics-color=always -pipe -D_FILE_OFFSET_BITS=64 -Wall -Winvalid-pch -Werror -O2 -g -include rte_config.h -Wextra -Wcast-qual -Wdeprecated -Wformat -Wformat-nonliteral -Wformat-security -Wmissing-declarations -Wmissing-prototypes -Wnested-externs -Wold-style-definition -Wpointer-arith -Wsign-compare -Wstrict-prototypes -Wundef -Wwrite-strings -Wno-address-of-packed-member -Wno-packed-not-aligned -Wno-missing-field-initializers -D_GNU_SOURCE -D__BSD_VISIBLE -fPIC -march=native -mno-avx512f -DALLOW_EXPERIMENTAL_API -DALLOW_INTERNAL_API -Wno-format-truncation -Wno-strict-aliasing -Wdisabled-optimization -Waggregate-return -Wbad-function-cast -DRTE_LOG_DEFAULT_LOGTYPE=pmd.net.sfc -MD -MQ drivers/libtmp_rte_net_sfc.a.p/net_sfc_sfc_flow.c.o -MF drivers/libtmp_rte_net_sfc.a.p/net_sfc_sfc_flow.c.o.d -o drivers/libtmp_rte_net_sfc.a.p/net_sfc_sfc_flow.c.o -c ../drivers/net/sfc/sfc_flow.c
../drivers/net/sfc/sfc_flow.c: In function 'sfc_flow_query':
../drivers/net/sfc/sfc_flow.c:2815:19: error: 'SFC_ETHDEV_STARTED' undeclared (first use in this function); did you mean 'SFC_ADAPTER_STARTED'?
 2815 |  if (sa->state != SFC_ETHDEV_STARTED) {
      |                   ^~~~~~~~~~~~~~~~~~
      |                   SFC_ADAPTER_STARTED
../drivers/net/sfc/sfc_flow.c:2815:19: note: each undeclared identifier is reported only once for each function it appears in
[1235/1951] Compiling C object drivers/libtmp_rte_net_sfc.a.p/net_sfc_sfc_ef10_essb_rx.c.o
[1236/1951] Compiling C object drivers/libtmp_rte_net_sfc.a.p/net_sfc_sfc_mae.c.o
[1237/1951] Compiling C object drivers/libtmp_rte_net_octeontx2.a.p/net_octeontx2_otx2_rx.c.o
[1238/1951] Compiling C object drivers/libtmp_rte_net_sfc.a.p/net_sfc_sfc_ef10_rx.c.o
[1239/1951] Compiling C object drivers/libtmp_rte_net_sfc.a.p/net_sfc_sfc_ef10_tx.c.o
ninja: build stopped




*Build Failed #10:
OS: RHEL83-64
Target: x86_64-native-linuxapp-gcc
FAILED: drivers/libtmp_rte_net_sfc.a.p/net_sfc_sfc_flow.c.o 
gcc -Idrivers/libtmp_rte_net_sfc.a.p -Idrivers -I../drivers -Idrivers/net/sfc -I../drivers/net/sfc -Ilib/ethdev -I../lib/ethdev -I. -I.. -Iconfig -I../config -Ilib/eal/include -I../lib/eal/include -Ilib/eal/linux/include -I../lib/eal/linux/include -Ilib/eal/x86/include -I../lib/eal/x86/include -Ilib/eal/common -I../lib/eal/common -Ilib/eal -I../lib/eal -Ilib/kvargs -I../lib/kvargs -Ilib/metrics -I../lib/metrics -Ilib/telemetry -I../lib/telemetry -Ilib/net -I../lib/net -Ilib/mbuf -I../lib/mbuf -Ilib/mempool -I../lib/mempool -Ilib/ring -I../lib/ring -Ilib/meter -I../lib/meter -Idrivers/bus/pci -I../drivers/bus/pci -I../drivers/bus/pci/linux -Ilib/pci -I../lib/pci -Idrivers/bus/vdev -I../drivers/bus/vdev -Idrivers/common/sfc_efx -I../drivers/common/sfc_efx -Idrivers/common/sfc_efx/base -I../drivers/common/sfc_efx/base -fdiagnostics-color=always -pipe -D_FILE_OFFSET_BITS=64 -Wall -Winvalid-pch -Werror -O3 -include rte_config.h -Wextra -Wcast-qual -Wdeprecated -Wformat -Wformat-nonliteral -Wformat-security -Wmissing-declarations -Wmissing-prototypes -Wnested-externs -Wold-style-definition -Wpointer-arith -Wsign-compare -Wstrict-prototypes -Wundef -Wwrite-strings -Wno-packed-not-aligned -Wno-missing-field-initializers -D_GNU_SOURCE -fPIC -march=native -DALLOW_EXPERIMENTAL_API -DALLOW_INTERNAL_API -Wno-format-truncation -Wno-strict-aliasing -Wdisabled-optimization -Waggregate-return -Wbad-function-cast -DRTE_LOG_DEFAULT_LOGTYPE=pmd.net.sfc -MD -MQ drivers/libtmp_rte_net_sfc.a.p/net_sfc_sfc_flow.c.o -MF drivers/libtmp_rte_net_sfc.a.p/net_sfc_sfc_flow.c.o.d -o drivers/libtmp_rte_net_sfc.a.p/net_sfc_sfc_flow.c.o -c ../drivers/net/sfc/sfc_flow.c
../drivers/net/sfc/sfc_flow.c: In function ‘sfc_flow_query’:
../drivers/net/sfc/sfc_flow.c:2815:19: error: ‘SFC_ETHDEV_STARTED’ undeclared (first use in this function); did you mean ‘SFC_ADAPTER_STARTED’?
  if (sa->state != SFC_ETHDEV_STARTED) {
                   ^~~~~~~~~~~~~~~~~~
                   SFC_ADAPTER_STARTED
../drivers/net/sfc/sfc_flow.c:2815:19: note: each undeclared identifier is reported only once for each function it appears in
[1638/2754] Generating rte_net_qede.pmd.c with a custom command
[1639/2754] Compiling C object drivers/libtmp_rte_net_sfc.a.p/net_sfc_sfc_ef10_essb_rx.c.o
[1640/2754] Compiling C object drivers/libtmp_rte_net_sfc.a.p/net_sfc_sfc_mae.c.o
[1641/2754] Compiling C object drivers/libtmp_rte_net_sfc.a.p/net_sfc_sfc_ef10_rx.c.o
[1642/2754] Compiling C object drivers/libtmp_rte_net_octeontx2.a.p/net_octeontx2_otx2_tx.c.o
[1643/2754] Compiling C object drivers/libtmp_rte_net_sfc.a.p/net_sfc_sfc_ef100_rx.c.o
[1644/2754] Compiling C object drivers/libtmp_rte_net_octeontx2.a.p/net_octeontx2_otx2_rx.c.o
[1645/2754] Compiling C object drivers/libtmp_rte_net_sfc.a.p/net_sfc_sfc_ef100_tx.c.o
[1646/2754] Compiling C object drivers/libtmp_rte_net_sfc.a.p/net_sfc_sfc_ef10_tx.c.o
ninja: build stopped




*Build Failed #11:
OS: SUSE15-64
Target: x86_64-native-linuxapp-clang
FAILED: drivers/libtmp_rte_net_sfc.a.p/net_sfc_sfc_flow.c.o 
clang -Idrivers/libtmp_rte_net_sfc.a.p -Idrivers -I../drivers -Idrivers/net/sfc -I../drivers/net/sfc -Ilib/ethdev -I../lib/ethdev -I. -I.. -Iconfig -I../config -Ilib/eal/include -I../lib/eal/include -Ilib/eal/linux/include -I../lib/eal/linux/include -Ilib/eal/x86/include -I../lib/eal/x86/include -Ilib/eal/common -I../lib/eal/common -Ilib/eal -I../lib/eal -Ilib/kvargs -I../lib/kvargs -Ilib/metrics -I../lib/metrics -Ilib/telemetry -I../lib/telemetry -Ilib/net -I../lib/net -Ilib/mbuf -I../lib/mbuf -Ilib/mempool -I../lib/mempool -Ilib/ring -I../lib/ring -Ilib/meter -I../lib/meter -Idrivers/bus/pci -I../drivers/bus/pci -I../drivers/bus/pci/linux -Ilib/pci -I../lib/pci -Idrivers/bus/vdev -I../drivers/bus/vdev -Idrivers/common/sfc_efx -I../drivers/common/sfc_efx -Idrivers/common/sfc_efx/base -I../drivers/common/sfc_efx/base -Xclang -fcolor-diagnostics -pipe -D_FILE_OFFSET_BITS=64 -Wall -Winvalid-pch -Werror -O3 -include rte_config.h -Wextra -Wcast-qual -Wdeprecated -Wformat -Wformat-nonliteral -Wformat-security -Wmissing-declarations -Wmissing-prototypes -Wnested-externs -Wold-style-definition -Wpointer-arith -Wsign-compare -Wstrict-prototypes -Wundef -Wwrite-strings -Wno-address-of-packed-member -Wno-missing-field-initializers -D_GNU_SOURCE -fPIC -march=native -DALLOW_EXPERIMENTAL_API -DALLOW_INTERNAL_API -Wno-strict-aliasing -Wdisabled-optimization -Waggregate-return -Wbad-function-cast -DRTE_LOG_DEFAULT_LOGTYPE=pmd.net.sfc -MD -MQ drivers/libtmp_rte_net_sfc.a.p/net_sfc_sfc_flow.c.o -MF drivers/libtmp_rte_net_sfc.a.p/net_sfc_sfc_flow.c.o.d -o drivers/libtmp_rte_net_sfc.a.p/net_sfc_sfc_flow.c.o -c ../drivers/net/sfc/sfc_flow.c
../drivers/net/sfc/sfc_flow.c:2815:19: error: use of undeclared identifier 'SFC_ETHDEV_STARTED'; did you mean 'SFC_ADAPTER_STARTED'?
        if (sa->state != SFC_ETHDEV_STARTED) {
                         ^~~~~~~~~~~~~~~~~~
                         SFC_ADAPTER_STARTED
../drivers/net/sfc/sfc.h:83:2: note: 'SFC_ADAPTER_STARTED' declared here
        SFC_ADAPTER_STARTED,
        ^
1 error generated.
[1641/2714] Compiling C object drivers/libtmp_rte_net_sfc.a.p/net_sfc_sfc_mae_counter.c.o
[1642/2714] Compiling C object drivers/libtmp_rte_net_sfc.a.p/net_sfc_sfc_service.c.o
[1643/2714] Compiling C object drivers/libtmp_rte_net_octeontx2.a.p/net_octeontx2_otx2_rx.c.o
[1644/2714] Compiling C object drivers/libtmp_rte_net_sfc.a.p/net_sfc_sfc_ef10_essb_rx.c.o
[1645/2714] Compiling C object drivers/libtmp_rte_net_sfc.a.p/net_sfc_sfc_ef10_tx.c.o
[1646/2714] Compiling C object drivers/libtmp_rte_net_sfc.a.p/net_sfc_sfc_mae.c.o
[1647/2714] Compiling C object drivers/libtmp_rte_net_sfc.a.p/net_sfc_sfc_ef10_rx.c.o
[1648/2714] Compiling C object drivers/libtmp_rte_net_sfc.a.p/net_sfc_sfc_ef100_rx.c.o
[1649/2714] Compiling C object drivers/libtmp_rte_net_sfc.a.p/net_sfc_sfc_ef100_tx.c.o
ninja: build stopped




*Build Failed #12:
OS: SUSE15-64
Target: x86_64-native-linuxapp-gcc
FAILED: drivers/libtmp_rte_net_sfc.a.p/net_sfc_sfc_flow.c.o 
gcc -Idrivers/libtmp_rte_net_sfc.a.p -Idrivers -I../drivers -Idrivers/net/sfc -I../drivers/net/sfc -Ilib/ethdev -I../lib/ethdev -I. -I.. -Iconfig -I../config -Ilib/eal/include -I../lib/eal/include -Ilib/eal/linux/include -I../lib/eal/linux/include -Ilib/eal/x86/include -I../lib/eal/x86/include -Ilib/eal/common -I../lib/eal/common -Ilib/eal -I../lib/eal -Ilib/kvargs -I../lib/kvargs -Ilib/metrics -I../lib/metrics -Ilib/telemetry -I../lib/telemetry -Ilib/net -I../lib/net -Ilib/mbuf -I../lib/mbuf -Ilib/mempool -I../lib/mempool -Ilib/ring -I../lib/ring -Ilib/meter -I../lib/meter -Idrivers/bus/pci -I../drivers/bus/pci -I../drivers/bus/pci/linux -Ilib/pci -I../lib/pci -Idrivers/bus/vdev -I../drivers/bus/vdev -Idrivers/common/sfc_efx -I../drivers/common/sfc_efx -Idrivers/common/sfc_efx/base -I../drivers/common/sfc_efx/base -fdiagnostics-color=always -pipe -D_FILE_OFFSET_BITS=64 -Wall -Winvalid-pch -Werror -O3 -include rte_config.h -Wextra -Wcast-qual -Wdeprecated -Wformat -Wformat-nonliteral -Wformat-security -Wmissing-declarations -Wmissing-prototypes -Wnested-externs -Wold-style-definition -Wpointer-arith -Wsign-compare -Wstrict-prototypes -Wundef -Wwrite-strings -Wno-missing-field-initializers -D_GNU_SOURCE -fPIC -march=native -DALLOW_EXPERIMENTAL_API -DALLOW_INTERNAL_API -Wno-format-truncation -Wno-strict-aliasing -Wdisabled-optimization -Waggregate-return -Wbad-function-cast -DRTE_LOG_DEFAULT_LOGTYPE=pmd.net.sfc -MD -MQ drivers/libtmp_rte_net_sfc.a.p/net_sfc_sfc_flow.c.o -MF drivers/libtmp_rte_net_sfc.a.p/net_sfc_sfc_flow.c.o.d -o drivers/libtmp_rte_net_sfc.a.p/net_sfc_sfc_flow.c.o -c ../drivers/net/sfc/sfc_flow.c
../drivers/net/sfc/sfc_flow.c: In function ‘sfc_flow_query’:
../drivers/net/sfc/sfc_flow.c:2815:19: error: ‘SFC_ETHDEV_STARTED’ undeclared (first use in this function); did you mean ‘SFC_ADAPTER_STARTED’?
  if (sa->state != SFC_ETHDEV_STARTED) {
                   ^~~~~~~~~~~~~~~~~~
                   SFC_ADAPTER_STARTED
../drivers/net/sfc/sfc_flow.c:2815:19: note: each undeclared identifier is reported only once for each function it appears in
[1645/2683] Generating rte_net_sfc_def with a custom command
[1646/2683] Compiling C object drivers/libtmp_rte_net_sfc.a.p/net_sfc_sfc_ef10_rx.c.o
[1647/2683] Compiling C object drivers/libtmp_rte_net_sfc.a.p/net_sfc_sfc_ef100_rx.c.o
[1648/2683] Compiling C object drivers/libtmp_rte_net_sfc.a.p/net_sfc_sfc_ef10_essb_rx.c.o
[1649/2683] Compiling C object drivers/libtmp_rte_net_sfc.a.p/net_sfc_sfc_ef100_tx.c.o
[1650/2683] Compiling C object drivers/libtmp_rte_net_softnic.a.p/net_softnic_parser.c.o
[1651/2683] Compiling C object drivers/libtmp_rte_net_sfc.a.p/net_sfc_sfc_ef10_tx.c.o
ninja: build stopped




*Build Failed #13:
OS: CentOsStream8-64
Target: x86_64-native-linuxapp-gcc
FAILED: drivers/libtmp_rte_net_sfc.a.p/net_sfc_sfc_flow.c.o 
gcc -Idrivers/libtmp_rte_net_sfc.a.p -Idrivers -I../drivers -Idrivers/net/sfc -I../drivers/net/sfc -Ilib/ethdev -I../lib/ethdev -I. -I.. -Iconfig -I../config -Ilib/eal/include -I../lib/eal/include -Ilib/eal/linux/include -I../lib/eal/linux/include -Ilib/eal/x86/include -I../lib/eal/x86/include -Ilib/eal/common -I../lib/eal/common -Ilib/eal -I../lib/eal -Ilib/kvargs -I../lib/kvargs -Ilib/metrics -I../lib/metrics -Ilib/telemetry -I../lib/telemetry -Ilib/net -I../lib/net -Ilib/mbuf -I../lib/mbuf -Ilib/mempool -I../lib/mempool -Ilib/ring -I../lib/ring -Ilib/meter -I../lib/meter -Idrivers/bus/pci -I../drivers/bus/pci -I../drivers/bus/pci/linux -Ilib/pci -I../lib/pci -Idrivers/bus/vdev -I../drivers/bus/vdev -Idrivers/common/sfc_efx -I../drivers/common/sfc_efx -Idrivers/common/sfc_efx/base -I../drivers/common/sfc_efx/base -fdiagnostics-color=always -pipe -D_FILE_OFFSET_BITS=64 -Wall -Winvalid-pch -Werror -O3 -include rte_config.h -Wextra -Wcast-qual -Wdeprecated -Wformat -Wformat-nonliteral -Wformat-security -Wmissing-declarations -Wmissing-prototypes -Wnested-externs -Wold-style-definition -Wpointer-arith -Wsign-compare -Wstrict-prototypes -Wundef -Wwrite-strings -Wno-packed-not-aligned -Wno-missing-field-initializers -D_GNU_SOURCE -fPIC -march=native -DALLOW_EXPERIMENTAL_API -DALLOW_INTERNAL_API -Wno-format-truncation -Wno-strict-aliasing -Wdisabled-optimization -Waggregate-return -Wbad-function-cast -DRTE_LOG_DEFAULT_LOGTYPE=pmd.net.sfc -MD -MQ drivers/libtmp_rte_net_sfc.a.p/net_sfc_sfc_flow.c.o -MF drivers/libtmp_rte_net_sfc.a.p/net_sfc_sfc_flow.c.o.d -o drivers/libtmp_rte_net_sfc.a.p/net_sfc_sfc_flow.c.o -c ../drivers/net/sfc/sfc_flow.c
../drivers/net/sfc/sfc_flow.c: In function ‘sfc_flow_query’:
../drivers/net/sfc/sfc_flow.c:2815:19: error: ‘SFC_ETHDEV_STARTED’ undeclared (first use in this function); did you mean ‘SFC_ADAPTER_STARTED’?
  if (sa->state != SFC_ETHDEV_STARTED) {
                   ^~~~~~~~~~~~~~~~~~
                   SFC_ADAPTER_STARTED
../drivers/net/sfc/sfc_flow.c:2815:19: note: each undeclared identifier is reported only once for each function it appears in
[1626/2744] Generating rte_net_softnic_mingw with a custom command
[1627/2744] Compiling C object drivers/libtmp_rte_net_sfc.a.p/net_sfc_sfc_service.c.o
[1628/2744] Compiling C object drivers/libtmp_rte_net_sfc.a.p/net_sfc_sfc_mae.c.o
[1629/2744] Generating rte_net_qede.pmd.c with a custom command
[1630/2744] Compiling C object drivers/libtmp_rte_net_sfc.a.p/net_sfc_sfc_ef10_essb_rx.c.o
[1631/2744] Compiling C object drivers/libtmp_rte_net_sfc.a.p/net_sfc_sfc_ef10_rx.c.o
[1632/2744] Compiling C object drivers/libtmp_rte_net_sfc.a.p/net_sfc_sfc_ef100_rx.c.o
[1633/2744] Compiling C object drivers/libtmp_rte_net_sfc.a.p/net_sfc_sfc_ef100_tx.c.o
[1634/2744] Compiling C object drivers/libtmp_rte_net_sfc.a.p/net_sfc_sfc_ef10_tx.c.o
[1635/2744] Compiling C object drivers/libtmp_rte_net_octeontx2.a.p/net_octeontx2_otx2_tx.c.o
[1636/2744] Compiling C object drivers/libtmp_rte_net_octeontx2.a.p/net_octeontx2_otx2_rx.c.o
ninja: build stopped




*Build Failed #14:
OS: UB2004-64
Target: x86_64-native-linuxapp-clang
FAILED: drivers/libtmp_rte_net_sfc.a.p/net_sfc_sfc_flow.c.o 
clang -Idrivers/libtmp_rte_net_sfc.a.p -Idrivers -I../drivers -Idrivers/net/sfc -I../drivers/net/sfc -Ilib/ethdev -I../lib/ethdev -I. -I.. -Iconfig -I../config -Ilib/eal/include -I../lib/eal/include -Ilib/eal/linux/include -I../lib/eal/linux/include -Ilib/eal/x86/include -I../lib/eal/x86/include -Ilib/eal/common -I../lib/eal/common -Ilib/eal -I../lib/eal -Ilib/kvargs -I../lib/kvargs -Ilib/metrics -I../lib/metrics -Ilib/telemetry -I../lib/telemetry -Ilib/net -I../lib/net -Ilib/mbuf -I../lib/mbuf -Ilib/mempool -I../lib/mempool -Ilib/ring -I../lib/ring -Ilib/meter -I../lib/meter -Idrivers/bus/pci -I../drivers/bus/pci -I../drivers/bus/pci/linux -Ilib/pci -I../lib/pci -Idrivers/bus/vdev -I../drivers/bus/vdev -Idrivers/common/sfc_efx -I../drivers/common/sfc_efx -Idrivers/common/sfc_efx/base -I../drivers/common/sfc_efx/base -Xclang -fcolor-diagnostics -pipe -D_FILE_OFFSET_BITS=64 -Wall -Winvalid-pch -Werror -O3 -include rte_config.h -Wextra -Wcast-qual -Wdeprecated -Wformat -Wformat-nonliteral -Wformat-security -Wmissing-declarations -Wmissing-prototypes -Wnested-externs -Wold-style-definition -Wpointer-arith -Wsign-compare -Wstrict-prototypes -Wundef -Wwrite-strings -Wno-address-of-packed-member -Wno-missing-field-initializers -D_GNU_SOURCE -fPIC -march=native -DALLOW_EXPERIMENTAL_API -DALLOW_INTERNAL_API -Wno-strict-aliasing -Wdisabled-optimization -Waggregate-return -Wbad-function-cast -DRTE_LOG_DEFAULT_LOGTYPE=pmd.net.sfc -MD -MQ drivers/libtmp_rte_net_sfc.a.p/net_sfc_sfc_flow.c.o -MF drivers/libtmp_rte_net_sfc.a.p/net_sfc_sfc_flow.c.o.d -o drivers/libtmp_rte_net_sfc.a.p/net_sfc_sfc_flow.c.o -c ../drivers/net/sfc/sfc_flow.c
../drivers/net/sfc/sfc_flow.c:2815:19: error: use of undeclared identifier 'SFC_ETHDEV_STARTED'; did you mean 'SFC_ADAPTER_STARTED'?
        if (sa->state != SFC_ETHDEV_STARTED) {
                         ^~~~~~~~~~~~~~~~~~
                         SFC_ADAPTER_STARTED
../drivers/net/sfc/sfc.h:83:2: note: 'SFC_ADAPTER_STARTED' declared here
        SFC_ADAPTER_STARTED,
        ^
1 error generated.
[1640/2741] Linking target drivers/librte_net_qede.so.21.3
[1641/2741] Compiling C object drivers/libtmp_rte_net_sfc.a.p/net_sfc_sfc_mae_counter.c.o
[1642/2741] Compiling C object drivers/libtmp_rte_net_sfc.a.p/net_sfc_sfc_mae.c.o
[1643/2741] Compiling C object drivers/libtmp_rte_net_sfc.a.p/net_sfc_sfc_ef10_essb_rx.c.o
[1644/2741] Compiling C object drivers/libtmp_rte_net_sfc.a.p/net_sfc_sfc_ef10_rx.c.o
[1645/2741] Compiling C object drivers/libtmp_rte_net_sfc.a.p/net_sfc_sfc_ef100_rx.c.o
[1646/2741] Compiling C object drivers/libtmp_rte_net_sfc.a.p/net_sfc_sfc_ef100_tx.c.o
[1647/2741] Compiling C object drivers/libtmp_rte_net_sfc.a.p/net_sfc_sfc_ef10_tx.c.o
[1648/2741] Compiling C object drivers/libtmp_rte_net_octeontx2.a.p/net_octeontx2_otx2_rx.c.o
ninja: build stopped




*Build Failed #15:
OS: UB2004-64
Target: x86_64-native-linuxapp-gcc
FAILED: drivers/libtmp_rte_net_sfc.a.p/net_sfc_sfc_flow.c.o 
gcc -Idrivers/libtmp_rte_net_sfc.a.p -Idrivers -I../drivers -Idrivers/net/sfc -I../drivers/net/sfc -Ilib/ethdev -I../lib/ethdev -I. -I.. -Iconfig -I../config -Ilib/eal/include -I../lib/eal/include -Ilib/eal/linux/include -I../lib/eal/linux/include -Ilib/eal/x86/include -I../lib/eal/x86/include -Ilib/eal/common -I../lib/eal/common -Ilib/eal -I../lib/eal -Ilib/kvargs -I../lib/kvargs -Ilib/metrics -I../lib/metrics -Ilib/telemetry -I../lib/telemetry -Ilib/net -I../lib/net -Ilib/mbuf -I../lib/mbuf -Ilib/mempool -I../lib/mempool -Ilib/ring -I../lib/ring -Ilib/meter -I../lib/meter -Idrivers/bus/pci -I../drivers/bus/pci -I../drivers/bus/pci/linux -Ilib/pci -I../lib/pci -Idrivers/bus/vdev -I../drivers/bus/vdev -Idrivers/common/sfc_efx -I../drivers/common/sfc_efx -Idrivers/common/sfc_efx/base -I../drivers/common/sfc_efx/base -fdiagnostics-color=always -pipe -D_FILE_OFFSET_BITS=64 -Wall -Winvalid-pch -Werror -O3 -include rte_config.h -Wextra -Wcast-qual -Wdeprecated -Wformat -Wformat-nonliteral -Wformat-security -Wmissing-declarations -Wmissing-prototypes -Wnested-externs -Wold-style-definition -Wpointer-arith -Wsign-compare -Wstrict-prototypes -Wundef -Wwrite-strings -Wno-address-of-packed-member -Wno-packed-not-aligned -Wno-missing-field-initializers -Wno-zero-length-bounds -D_GNU_SOURCE -fPIC -march=native -DALLOW_EXPERIMENTAL_API -DALLOW_INTERNAL_API -Wno-format-truncation -Wno-strict-aliasing -Wdisabled-optimization -Waggregate-return -Wbad-function-cast -DRTE_LOG_DEFAULT_LOGTYPE=pmd.net.sfc -MD -MQ drivers/libtmp_rte_net_sfc.a.p/net_sfc_sfc_flow.c.o -MF drivers/libtmp_rte_net_sfc.a.p/net_sfc_sfc_flow.c.o.d -o drivers/libtmp_rte_net_sfc.a.p/net_sfc_sfc_flow.c.o -c ../drivers/net/sfc/sfc_flow.c
../drivers/net/sfc/sfc_flow.c: In function ‘sfc_flow_query’:
../drivers/net/sfc/sfc_flow.c:2815:19: error: ‘SFC_ETHDEV_STARTED’ undeclared (first use in this function); did you mean ‘SFC_ADAPTER_STARTED’?
 2815 |  if (sa->state != SFC_ETHDEV_STARTED) {
      |                   ^~~~~~~~~~~~~~~~~~
      |                   SFC_ADAPTER_STARTED
../drivers/net/sfc/sfc_flow.c:2815:19: note: each undeclared identifier is reported only once for each function it appears in
[1633/2741] Compiling C object drivers/libtmp_rte_net_sfc.a.p/net_sfc_sfc_mae_counter.c.o
[1634/2741] Compiling C object drivers/libtmp_rte_net_sfc.a.p/net_sfc_sfc_mae.c.o
[1635/2741] Compiling C object drivers/libtmp_rte_net_sfc.a.p/net_sfc_sfc_ef10_essb_rx.c.o
[1636/2741] Generating rte_net_qede.pmd.c with a custom command
[1637/2741] Compiling C object drivers/libtmp_rte_net_sfc.a.p/net_sfc_sfc_ef10_rx.c.o
[1638/2741] Compiling C object drivers/libtmp_rte_net_sfc.a.p/net_sfc_sfc_ef100_rx.c.o
[1639/2741] Compiling C object drivers/libtmp_rte_net_sfc.a.p/net_sfc_sfc_ef10_tx.c.o
[1640/2741] Compiling C object drivers/libtmp_rte_net_octeontx2.a.p/net_octeontx2_otx2_tx.c.o
[1641/2741] Compiling C object drivers/libtmp_rte_net_octeontx2.a.p/net_octeontx2_otx2_rx.c.o
ninja: build stopped




*Build Failed #16:
OS: UB2004-64
Target: x86_64-native-linuxapp-icc
FAILED: drivers/libtmp_rte_net_sfc.a.p/net_sfc_sfc_flow.c.o 
icc -Idrivers/libtmp_rte_net_sfc.a.p -Idrivers -I../drivers -Idrivers/net/sfc -I../drivers/net/sfc -Ilib/ethdev -I../lib/ethdev -I. -I.. -Iconfig -I../config -Ilib/eal/include -I../lib/eal/include -Ilib/eal/linux/include -I../lib/eal/linux/include -Ilib/eal/x86/include -I../lib/eal/x86/include -Ilib/eal/common -I../lib/eal/common -Ilib/eal -I../lib/eal -Ilib/kvargs -I../lib/kvargs -Ilib/metrics -I../lib/metrics -Ilib/telemetry -I../lib/telemetry -Ilib/net -I../lib/net -Ilib/mbuf -I../lib/mbuf -Ilib/mempool -I../lib/mempool -Ilib/ring -I../lib/ring -Ilib/meter -I../lib/meter -Idrivers/bus/pci -I../drivers/bus/pci -I../drivers/bus/pci/linux -Ilib/pci -I../lib/pci -Idrivers/bus/vdev -I../drivers/bus/vdev -Idrivers/common/sfc_efx -I../drivers/common/sfc_efx -Idrivers/common/sfc_efx/base -I../drivers/common/sfc_efx/base -pipe -D_FILE_OFFSET_BITS=64 -Wall -w3 -diag-disable:remark -Werror -O3 -include rte_config.h -Wextra -Wcast-qual -Wdeprecated -Wformat -Wformat-security -Wmissing-declarations -Wmissing-prototypes -Wold-style-definition -Wpointer-arith -Wsign-compare -Wstrict-prototypes -Wundef -Wwrite-strings -Wno-missing-field-initializers -diag-disable=181 -diag-disable=188 -diag-disable=2203 -diag-disable=2279 -diag-disable=2557 -diag-disable=3179 -diag-disable=3656 -D_GNU_SOURCE -fPIC -march=native -DALLOW_EXPERIMENTAL_API -DALLOW_INTERNAL_API -Wno-strict-aliasing -Wdisabled-optimization -DRTE_LOG_DEFAULT_LOGTYPE=pmd.net.sfc -MD -MQ drivers/libtmp_rte_net_sfc.a.p/net_sfc_sfc_flow.c.o -MF drivers/libtmp_rte_net_sfc.a.p/net_sfc_sfc_flow.c.o.d -o drivers/libtmp_rte_net_sfc.a.p/net_sfc_sfc_flow.c.o -c ../drivers/net/sfc/sfc_flow.c
../drivers/net/sfc/sfc_flow.c(2815): error: identifier "SFC_ETHDEV_STARTED" is undefined
  	if (sa->state != SFC_ETHDEV_STARTED) {
  	                 ^

compilation aborted for ../drivers/net/sfc/sfc_flow.c (code 2)
[1608/2694] Compiling C object drivers/librte_net_qede.a.p/meson-generated_.._rte_net_qede.pmd.c.o
[1609/2694] Compiling C object drivers/libtmp_rte_net_sfc.a.p/net_sfc_sfc_rx.c.o
[1610/2694] Compiling C object drivers/librte_net_qede.so.21.3.p/meson-generated_.._rte_net_qede.pmd.c.o
[1611/2694] Compiling C object drivers/librte_net_pcap.so.21.3.p/meson-generated_.._rte_net_pcap.pmd.c.o
[1612/2694] Compiling C object drivers/libtmp_rte_net_sfc.a.p/net_sfc_sfc_mae_counter.c.o
[1613/2694] Compiling C object drivers/libtmp_rte_net_sfc.a.p/net_sfc_sfc_tx.c.o
[1614/2694] Compiling C object drivers/libtmp_rte_net_sfc.a.p/net_sfc_sfc_mae.c.o
[1615/2694] Compiling C object drivers/libtmp_rte_net_octeontx2.a.p/net_octeontx2_otx2_rx.c.o
[1616/2694] Compiling C object drivers/libtmp_rte_net_octeontx2.a.p/net_octeontx2_otx2_tx.c.o
ninja: build stopped




*Build Failed #17:
OS: UB2104-64
Target: x86_64-native-linuxapp-gcc
FAILED: drivers/libtmp_rte_net_sfc.a.p/net_sfc_sfc_flow.c.o 
gcc -Idrivers/libtmp_rte_net_sfc.a.p -Idrivers -I../drivers -Idrivers/net/sfc -I../drivers/net/sfc -Ilib/ethdev -I../lib/ethdev -I. -I.. -Iconfig -I../config -Ilib/eal/include -I../lib/eal/include -Ilib/eal/linux/include -I../lib/eal/linux/include -Ilib/eal/x86/include -I../lib/eal/x86/include -Ilib/eal/common -I../lib/eal/common -Ilib/eal -I../lib/eal -Ilib/kvargs -I../lib/kvargs -Ilib/metrics -I../lib/metrics -Ilib/telemetry -I../lib/telemetry -Ilib/net -I../lib/net -Ilib/mbuf -I../lib/mbuf -Ilib/mempool -I../lib/mempool -Ilib/ring -I../lib/ring -Ilib/meter -I../lib/meter -Idrivers/bus/pci -I../drivers/bus/pci -I../drivers/bus/pci/linux -Ilib/pci -I../lib/pci -Idrivers/bus/vdev -I../drivers/bus/vdev -Idrivers/common/sfc_efx -I../drivers/common/sfc_efx -Idrivers/common/sfc_efx/base -I../drivers/common/sfc_efx/base -fdiagnostics-color=always -pipe -D_FILE_OFFSET_BITS=64 -Wall -Winvalid-pch -Werror -O3 -include rte_config.h -Wextra -Wcast-qual -Wdeprecated -Wformat -Wformat-nonliteral -Wformat-security -Wmissing-declarations -Wmissing-prototypes -Wnested-externs -Wold-style-definition -Wpointer-arith -Wsign-compare -Wstrict-prototypes -Wundef -Wwrite-strings -Wno-address-of-packed-member -Wno-packed-not-aligned -Wno-missing-field-initializers -Wno-zero-length-bounds -D_GNU_SOURCE -fPIC -march=native -DALLOW_EXPERIMENTAL_API -DALLOW_INTERNAL_API -Wno-format-truncation -Wno-strict-aliasing -Wdisabled-optimization -Waggregate-return -Wbad-function-cast -DRTE_LOG_DEFAULT_LOGTYPE=pmd.net.sfc -MD -MQ drivers/libtmp_rte_net_sfc.a.p/net_sfc_sfc_flow.c.o -MF drivers/libtmp_rte_net_sfc.a.p/net_sfc_sfc_flow.c.o.d -o drivers/libtmp_rte_net_sfc.a.p/net_sfc_sfc_flow.c.o -c ../drivers/net/sfc/sfc_flow.c
../drivers/net/sfc/sfc_flow.c: In function ‘sfc_flow_query’:
../drivers/net/sfc/sfc_flow.c:2815:19: error: ‘SFC_ETHDEV_STARTED’ undeclared (first use in this function); did you mean ‘SFC_ADAPTER_STARTED’?
 2815 |  if (sa->state != SFC_ETHDEV_STARTED) {
      |                   ^~~~~~~~~~~~~~~~~~
      |                   SFC_ADAPTER_STARTED
../drivers/net/sfc/sfc_flow.c:2815:19: note: each undeclared identifier is reported only once for each function it appears in
[1632/2754] Compiling C object drivers/libtmp_rte_net_sfc.a.p/net_sfc_sfc_mae_counter.c.o
[1633/2754] Compiling C object drivers/libtmp_rte_net_sfc.a.p/net_sfc_sfc_mae.c.o
[1634/2754] Compiling C object drivers/libtmp_rte_net_sfc.a.p/net_sfc_sfc_ef10_essb_rx.c.o
[1635/2754] Compiling C object drivers/libtmp_rte_net_sfc.a.p/net_sfc_sfc_ef10_rx.c.o
[1636/2754] Compiling C object drivers/libtmp_rte_net_sfc.a.p/net_sfc_sfc_ef100_rx.c.o
[1637/2754] Compiling C object drivers/libtmp_rte_net_octeontx2.a.p/net_octeontx2_otx2_rx.c.o
[1638/2754] Compiling C object drivers/libtmp_rte_net_sfc.a.p/net_sfc_sfc_ef100_tx.c.o
[1639/2754] Compiling C object drivers/libtmp_rte_net_sfc.a.p/net_sfc_sfc_ef10_tx.c.o
[1640/2754] Compiling C object drivers/libtmp_rte_net_octeontx2.a.p/net_octeontx2_otx2_tx.c.o
ninja: build stopped




*Build Failed #18:
OS: UB2004-64
Target: x86_64-native-linuxapp-doc
FAILED: drivers/a715181@@tmp_rte_net_sfc@sta/net_sfc_sfc_flow.c.o 
gcc -Idrivers/a715181@@tmp_rte_net_sfc@sta -Idrivers -I../drivers -Idrivers/net/sfc -I../drivers/net/sfc -Ilib/ethdev -I../lib/ethdev -I. -I../ -Iconfig -I../config -Ilib/eal/include -I../lib/eal/include -Ilib/eal/linux/include -I../lib/eal/linux/include -Ilib/eal/x86/include -I../lib/eal/x86/include -Ilib/eal/common -I../lib/eal/common -Ilib/eal -I../lib/eal -Ilib/kvargs -I../lib/kvargs -Ilib/telemetry/../metrics -I../lib/telemetry/../metrics -Ilib/telemetry -I../lib/telemetry -Ilib/net -I../lib/net -Ilib/mbuf -I../lib/mbuf -Ilib/mempool -I../lib/mempool -Ilib/ring -I../lib/ring -Ilib/meter -I../lib/meter -Idrivers/bus/pci -I../drivers/bus/pci -I../drivers/bus/pci/linux -Ilib/pci -I../lib/pci -Idrivers/bus/vdev -I../drivers/bus/vdev -Idrivers/common/sfc_efx -I../drivers/common/sfc_efx -Idrivers/common/sfc_efx/base -I../drivers/common/sfc_efx/base -fdiagnostics-color=always -pipe -D_FILE_OFFSET_BITS=64 -Wall -Winvalid-pch -Werror -O3 -include rte_config.h -Wextra -Wcast-qual -Wdeprecated -Wformat -Wformat-nonliteral -Wformat-security -Wmissing-declarations -Wmissing-prototypes -Wnested-externs -Wold-style-definition -Wpointer-arith -Wsign-compare -Wstrict-prototypes -Wundef -Wwrite-strings -Wno-address-of-packed-member -Wno-packed-not-aligned -Wno-missing-field-initializers -Wno-zero-length-bounds -D_GNU_SOURCE -fPIC -march=native -DALLOW_EXPERIMENTAL_API -DALLOW_INTERNAL_API -Wno-format-truncation -Wno-strict-aliasing -Wdisabled-optimization -Waggregate-return -Wbad-function-cast -DRTE_LOG_DEFAULT_LOGTYPE=pmd.net.sfc -MD -MQ 'drivers/a715181@@tmp_rte_net_sfc@sta/net_sfc_sfc_flow.c.o' -MF 'drivers/a715181@@tmp_rte_net_sfc@sta/net_sfc_sfc_flow.c.o.d' -o 'drivers/a715181@@tmp_rte_net_sfc@sta/net_sfc_sfc_flow.c.o' -c ../drivers/net/sfc/sfc_flow.c
../drivers/net/sfc/sfc_flow.c: In function ‘sfc_flow_query’:
../drivers/net/sfc/sfc_flow.c:2815:19: error: ‘SFC_ETHDEV_STARTED’ undeclared (first use in this function); did you mean ‘SFC_ADAPTER_STARTED’?
 2815 |  if (sa->state != SFC_ETHDEV_STARTED) {
      |                   ^~~~~~~~~~~~~~~~~~
      |                   SFC_ADAPTER_STARTED
../drivers/net/sfc/sfc_flow.c:2815:19: note: each undeclared identifier is reported only once for each function it appears in
[1609/2503] Compiling C object 'drivers/a715181@@tmp_rte_net_qede@sta/net_qede_qede_debug.c.o'.
[1610/2503] Compiling C object 'drivers/a715181@@tmp_rte_net_sfc@sta/net_sfc_sfc_mae_counter.c.o'.
[1611/2503] Compiling C object 'drivers/a715181@@tmp_rte_net_sfc@sta/net_sfc_sfc_mae.c.o'.
[1612/2503] Compiling C object 'drivers/a715181@@tmp_rte_net_sfc@sta/net_sfc_sfc_ef10_essb_rx.c.o'.
[1613/2503] Compiling C object 'drivers/a715181@@tmp_rte_net_sfc@sta/net_sfc_sfc_ef10_rx.c.o'.
[1614/2503] Compiling C object 'drivers/a715181@@tmp_rte_net_sfc@sta/net_sfc_sfc_ef100_rx.c.o'.
[1615/2503] Compiling C object 'drivers/a715181@@tmp_rte_net_sfc@sta/net_sfc_sfc_ef10_tx.c.o'.
[1616/2503] Compiling C object 'drivers/a715181@@tmp_rte_net_octeontx2@sta/net_octeontx2_otx2_tx.c.o'.
[1617/2503] Compiling C object 'drivers/a715181@@tmp_rte_net_octeontx2@sta/net_octeontx2_otx2_rx.c.o'.
ninja: build stopped




*Build Failed #19:
OS: FC34-64
Target: x86_64-native-linuxapp-gcc
FAILED: drivers/libtmp_rte_net_sfc.a.p/net_sfc_sfc_flow.c.o 
gcc -Idrivers/libtmp_rte_net_sfc.a.p -Idrivers -I../drivers -Idrivers/net/sfc -I../drivers/net/sfc -Ilib/ethdev -I../lib/ethdev -I. -I.. -Iconfig -I../config -Ilib/eal/include -I../lib/eal/include -Ilib/eal/linux/include -I../lib/eal/linux/include -Ilib/eal/x86/include -I../lib/eal/x86/include -Ilib/eal/common -I../lib/eal/common -Ilib/eal -I../lib/eal -Ilib/kvargs -I../lib/kvargs -Ilib/metrics -I../lib/metrics -Ilib/telemetry -I../lib/telemetry -Ilib/net -I../lib/net -Ilib/mbuf -I../lib/mbuf -Ilib/mempool -I../lib/mempool -Ilib/ring -I../lib/ring -Ilib/meter -I../lib/meter -Idrivers/bus/pci -I../drivers/bus/pci -I../drivers/bus/pci/linux -Ilib/pci -I../lib/pci -Idrivers/bus/vdev -I../drivers/bus/vdev -Idrivers/common/sfc_efx -I../drivers/common/sfc_efx -Idrivers/common/sfc_efx/base -I../drivers/common/sfc_efx/base -fdiagnostics-color=always -pipe -D_FILE_OFFSET_BITS=64 -Wall -Winvalid-pch -Werror -O3 -include rte_config.h -Wextra -Wcast-qual -Wdeprecated -Wformat -Wformat-nonliteral -Wformat-security -Wmissing-declarations -Wmissing-prototypes -Wnested-externs -Wold-style-definition -Wpointer-arith -Wsign-compare -Wstrict-prototypes -Wundef -Wwrite-strings -Wno-address-of-packed-member -Wno-packed-not-aligned -Wno-missing-field-initializers -Wno-zero-length-bounds -D_GNU_SOURCE -fPIC -march=native -DALLOW_EXPERIMENTAL_API -DALLOW_INTERNAL_API -Wno-format-truncation -Wno-strict-aliasing -Wdisabled-optimization -Waggregate-return -Wbad-function-cast -DRTE_LOG_DEFAULT_LOGTYPE=pmd.net.sfc -MD -MQ drivers/libtmp_rte_net_sfc.a.p/net_sfc_sfc_flow.c.o -MF drivers/libtmp_rte_net_sfc.a.p/net_sfc_sfc_flow.c.o.d -o drivers/libtmp_rte_net_sfc.a.p/net_sfc_sfc_flow.c.o -c ../drivers/net/sfc/sfc_flow.c
../drivers/net/sfc/sfc_flow.c: In function ‘sfc_flow_query’:
../drivers/net/sfc/sfc_flow.c:2815:26: error: ‘SFC_ETHDEV_STARTED’ undeclared (first use in this function); did you mean ‘SFC_ADAPTER_STARTED’?
 2815 |         if (sa->state != SFC_ETHDEV_STARTED) {
      |                          ^~~~~~~~~~~~~~~~~~
      |                          SFC_ADAPTER_STARTED
../drivers/net/sfc/sfc_flow.c:2815:26: note: each undeclared identifier is reported only once for each function it appears in
[1639/2753] Generating rte_net_sfc_def with a custom command
[1640/2753] Generating rte_net_qede.pmd.c with a custom command
[1641/2753] Compiling C object drivers/libtmp_rte_net_sfc.a.p/net_sfc_sfc_mae.c.o
[1642/2753] Compiling C object drivers/libtmp_rte_net_sfc.a.p/net_sfc_sfc_ef10_essb_rx.c.o
[1643/2753] Compiling C object drivers/libtmp_rte_net_softnic.a.p/net_softnic_parser.c.o
[1644/2753] Compiling C object drivers/libtmp_rte_net_sfc.a.p/net_sfc_sfc_ef100_rx.c.o
[1645/2753] Compiling C object drivers/libtmp_rte_net_sfc.a.p/net_sfc_sfc_ef10_rx.c.o
[1646/2753] Compiling C object drivers/libtmp_rte_net_sfc.a.p/net_sfc_sfc_ef100_tx.c.o
[1647/2753] Compiling C object drivers/libtmp_rte_net_sfc.a.p/net_sfc_sfc_ef10_tx.c.o
[1648/2753] Compiling C object drivers/libtmp_rte_net_octeontx2.a.p/net_octeontx2_otx2_tx.c.o
[1649/2753] Compiling C object drivers/libtmp_rte_net_octeontx2.a.p/net_octeontx2_otx2_rx.c.o
ninja: build stopped




*Build Failed #20:
OS: FC34-64
Target: x86_64-native-linuxapp-clang
FAILED: drivers/libtmp_rte_net_sfc.a.p/net_sfc_sfc_flow.c.o 
clang -Idrivers/libtmp_rte_net_sfc.a.p -Idrivers -I../drivers -Idrivers/net/sfc -I../drivers/net/sfc -Ilib/ethdev -I../lib/ethdev -I. -I.. -Iconfig -I../config -Ilib/eal/include -I../lib/eal/include -Ilib/eal/linux/include -I../lib/eal/linux/include -Ilib/eal/x86/include -I../lib/eal/x86/include -Ilib/eal/common -I../lib/eal/common -Ilib/eal -I../lib/eal -Ilib/kvargs -I../lib/kvargs -Ilib/metrics -I../lib/metrics -Ilib/telemetry -I../lib/telemetry -Ilib/net -I../lib/net -Ilib/mbuf -I../lib/mbuf -Ilib/mempool -I../lib/mempool -Ilib/ring -I../lib/ring -Ilib/meter -I../lib/meter -Idrivers/bus/pci -I../drivers/bus/pci -I../drivers/bus/pci/linux -Ilib/pci -I../lib/pci -Idrivers/bus/vdev -I../drivers/bus/vdev -Idrivers/common/sfc_efx -I../drivers/common/sfc_efx -Idrivers/common/sfc_efx/base -I../drivers/common/sfc_efx/base -Xclang -fcolor-diagnostics -pipe -D_FILE_OFFSET_BITS=64 -Wall -Winvalid-pch -Werror -O3 -include rte_config.h -Wextra -Wcast-qual -Wdeprecated -Wformat -Wformat-nonliteral -Wformat-security -Wmissing-declarations -Wmissing-prototypes -Wnested-externs -Wold-style-definition -Wpointer-arith -Wsign-compare -Wstrict-prototypes -Wundef -Wwrite-strings -Wno-address-of-packed-member -Wno-missing-field-initializers -D_GNU_SOURCE -fPIC -march=native -DALLOW_EXPERIMENTAL_API -DALLOW_INTERNAL_API -Wno-strict-aliasing -Wdisabled-optimization -Waggregate-return -Wbad-function-cast -DRTE_LOG_DEFAULT_LOGTYPE=pmd.net.sfc -MD -MQ drivers/libtmp_rte_net_sfc.a.p/net_sfc_sfc_flow.c.o -MF drivers/libtmp_rte_net_sfc.a.p/net_sfc_sfc_flow.c.o.d -o drivers/libtmp_rte_net_sfc.a.p/net_sfc_sfc_flow.c.o -c ../drivers/net/sfc/sfc_flow.c
../drivers/net/sfc/sfc_flow.c:2815:19: error: use of undeclared identifier 'SFC_ETHDEV_STARTED'; did you mean 'SFC_ADAPTER_STARTED'?
        if (sa->state != SFC_ETHDEV_STARTED) {
                         ^~~~~~~~~~~~~~~~~~
                         SFC_ADAPTER_STARTED
../drivers/net/sfc/sfc.h:83:2: note: 'SFC_ADAPTER_STARTED' declared here
        SFC_ADAPTER_STARTED,
        ^
1 error generated.
[1644/2753] Compiling C object drivers/libtmp_rte_net_sfc.a.p/net_sfc_sfc_mae_counter.c.o
[1645/2753] Compiling C object drivers/libtmp_rte_net_sfc.a.p/net_sfc_sfc_mae.c.o
[1646/2753] Compiling C object drivers/libtmp_rte_net_octeontx2.a.p/net_octeontx2_otx2_rx.c.o
[1647/2753] Compiling C object drivers/libtmp_rte_net_sfc.a.p/net_sfc_sfc_ef10_essb_rx.c.o
[1648/2753] Compiling C object drivers/libtmp_rte_net_sfc.a.p/net_sfc_sfc_ef10_rx.c.o
[1649/2753] Compiling C object drivers/libtmp_rte_net_sfc.a.p/net_sfc_sfc_ef100_rx.c.o
[1650/2753] Compiling C object drivers/libtmp_rte_net_sfc.a.p/net_sfc_sfc_ef10_tx.c.o
[1651/2753] Compiling C object drivers/libtmp_rte_net_sfc.a.p/net_sfc_sfc_ef100_tx.c.o
[1652/2753] Compiling C object drivers/libtmp_rte_net_softnic.a.p/net_softnic_parser.c.o
ninja: build stopped


DPDK STV team

^ permalink raw reply	[flat|nested] 3+ messages in thread

end of thread, other threads:[~2021-06-11  3:26 UTC | newest]

Thread overview: 3+ messages (download: mbox.gz / follow: Atom feed)
-- links below jump to the message on this page --
2021-06-10 10:37 [dpdk-test-report] |FAILURE| pw(93898) sid(17238) [v2, 20/20] net/sfc: support flow API query for count actions sys_stv
  -- strict thread matches above, loose matches on Subject: below --
2021-06-11  3:26 sys_stv
2021-06-10  9:30 sys_stv

automatic DPDK test reports

This inbox may be cloned and mirrored by anyone:

	git clone --mirror https://inbox.dpdk.org/test-report/0 test-report/git/0.git

	# If you have public-inbox 1.1+ installed, you may
	# initialize and index your mirror using the following commands:
	public-inbox-init -V2 test-report test-report/ https://inbox.dpdk.org/test-report \
		test-report@dpdk.org
	public-inbox-index test-report

Example config snippet for mirrors.
Newsgroup available over NNTP:
	nntp://inbox.dpdk.org/inbox.dpdk.test-report


AGPL code for this site: git clone https://public-inbox.org/public-inbox.git