automatic DPDK test reports
 help / color / mirror / Atom feed
* [dpdk-test-report] |FAILURE| pw(86988) [RFC, V2] app/testpmd: support multi-process
@ 2021-01-20 16:30 sys_stv
  0 siblings, 0 replies; only message in thread
From: sys_stv @ 2021-01-20 16:30 UTC (permalink / raw)
  To: test-report

[-- Attachment #1: Type: text/plain, Size: 70544 bytes --]


Test-Label: Intel-compilation
Test-Status: FAILURE
http://dpdk.org/patch/86988

_Compilation issues_

Submitter: Lijun Ou <oulijun@huawei.com>
Date: 2021-01-20 14:06:15
Reply_mail: 1611151575-10095-1-git-send-email-oulijun@huawei.com

DPDK git baseline: Repo:dpdk-next-net, CommitID: 4080917cbcb8fb41bf6b3618039a72cee0b7525e


Meson Build Summary: 22 Builds Done, 18 Successful, 4 Failures, 0 Blocked

+------------------+------------+--------------+------------+------------+-----------+----------+
| os               | gcc-static | clang-static | icc-static | gcc-shared | gcc-debug | document |
+------------------+------------+--------------+------------+------------+-----------+----------+
| UB2004-64        | FAIL       | pass         | pass       |            |           | pass     |
| RHEL83-64        | pass       |              |            |            |           |          |
| FC33-64          | FAIL       | FAIL         |            |            |           |          |
| CentOsStream8-64 | pass       |              |            |            |           |          |
| UB2010-64        | FAIL       |              |            |            |           |          |
| WIN10-64         |            | pass         |            |            |           |          |
| UB2004-32        | pass       |              |            |            |           |          |
| CENTOS83-64      | pass       | pass         | pass       | pass       | pass      |          |
| FreeBSD1201-64   | pass       | pass         |            | pass       | pass      |          |
| SUSE15-64        | pass       | pass         |            |            |           |          |
+------------------+------------+--------------+------------+------------+-----------+----------+
Test environment and configuration as below:


OS: UB2004-64
	Kernel Version: 5.6.0-050600-generic
	CPU info: Intel(R) Xeon(R) Platinum 8180 CPU @ 2.50GHz
	GCC Version: gcc (Ubuntu 10-20200416-0ubuntu1) 10.0.1 20200416 (experimental) [master revision 3c3f12e2a76:dcee354ce56:44b326839d864fc10c459916abcc97f35a9ac3de]
	Clang Version: 10.0.0-4ubuntu1
	x86_64-native-linuxapp-clang
	x86_64-native-linuxapp-gcc
	x86_64-native-linuxapp-icc
	x86_64-native-linuxapp-doc

OS: RHEL83-64
	Kernel Version: 4.18.0-240.el8.x86_64
	CPU info: Intel(R) Xeon(R) CPU E5-2699 v4 @ 2.20GHz
	GCC Version: gcc (GCC) 8.3.1 20191121 (Red Hat 8.3.1-5)
	Clang Version: 10.0.1 (Red Hat 10.0.1-1.module+el8.3.0+7459+90c24896)
	x86_64-native-linuxapp-gcc

OS: FC33-64
	Kernel Version: 5.8.16-300.fc33.x86_64
	CPU info: Intel(R) Xeon(R) CPU E5-2699 v4 @ 2.20GHz
	GCC Version: gcc (GCC) 10.2.1 20201005 (Red Hat 10.2.1-5)
	Clang Version: 11.0.0 (Fedora 11.0.0-1.fc33)
	x86_64-native-linuxapp-gcc
	x86_64-native-linuxapp-clang

OS: CentOsStream8-64
	Kernel Version: 4.18.0-257.el8.x86_64
	CPU info: Intel(R) Xeon(R) CPU E5-2699 v4 @ 2.20GHz
	GCC Version: gcc (GCC) 8.4.1 20200928 (Red Hat 8.4.1-1)
	Clang Version: 11.0.0 (Red Hat 11.0.0-0.2.rc2.module_el8.4.0+533+50191577)
	x86_64-native-linuxapp-gcc

OS: UB2010-64
	Kernel Version: 5.8.0-25-generic
	CPU info: Intel(R) Xeon(R) CPU E5-2699 v4 @ 2.20GHz
	GCC Version: gcc (Ubuntu 10.2.0-13ubuntu1) 10.2.0
	Clang Version: 11.0.0-2
	x86_64-native-linuxapp-gcc

OS: WIN10-64
	Kernel Version: N/A
	CPU info: N/A
	GCC Version: N/A
	Clang Version: Clang 8.0.0
	x86_64-windows-clang

OS: UB2004-32
	Kernel Version: 5.6.0-050600-generic
	CPU info: Intel(R) Xeon(R) Platinum 8180 CPU @ 2.50GHz
	GCC Version: gcc (Ubuntu 9.3.0-10ubuntu2) 9.3.0
	Clang Version: 10.0.0-4ubuntu1
	i686-native-linuxapp-gcc

OS: CENTOS83-64
	Kernel Version: 4.18.0-240.1.1.el8_3.x86_64
	CPU info: Intel(R) Xeon(R) Platinum 8180 CPU @ 2.50GHz
	GCC Version: gcc (GCC) 8.3.1 20191121 (Red Hat 8.3.1-5)
	Clang Version: 10.0.1 (Red Hat 10.0.1-1.module_el8.3.0+467+cb298d5b)
	x86_64-native-linuxapp-gcc
	x86_64-native-linuxapp-clang
	x86_64-native-linuxapp-icc
	x86_64-native-linuxapp-gcc+shared
	x86_64-native-linuxapp-gcc+debug

OS: FreeBSD1201-64
	Kernel Version: 12.1-RELEASE
	CPU info: Intel(R) Xeon(R) CPU E5-2699 v3 @ 2.30GHz (2294.74-MHz K8-class CPU)
	GCC Version: gcc (FreeBSD Ports Collection) 9.2.0
	Clang Version: 8.0.1 (tags/RELEASE_801/final 366581) (based on LLVM 8.0.1)
	x86_64-native-bsdapp-gcc
	x86_64-native-bsdapp-clang
	x86_64-native-bsdapp-gcc+shared
	x86_64-native-bsdapp-gcc+debug

OS: SUSE15-64
	Kernel Version: 5.3.18-lp152.57-default
	CPU info: Intel(R) Xeon(R) CPU E5-2699 v4 @ 2.20GHz
	GCC Version: gcc (SUSE Linux) 7.5.0
	Clang Version: 9.0.1
	x86_64-native-linuxapp-clang
	x86_64-native-linuxapp-gcc



*Build Failed #1:
OS: FC33-64
Target: x86_64-native-linuxapp-gcc
FAILED: app/dpdk-testpmd 
gcc  -o app/dpdk-testpmd app/dpdk-testpmd.p/test-pmd_5tswap.c.o app/dpdk-testpmd.p/test-pmd_cmdline.c.o app/dpdk-testpmd.p/test-pmd_cmdline_flow.c.o app/dpdk-testpmd.p/test-pmd_cmdline_mtr.c.o app/dpdk-testpmd.p/test-pmd_cmdline_tm.c.o app/dpdk-testpmd.p/test-pmd_config.c.o app/dpdk-testpmd.p/test-pmd_csumonly.c.o app/dpdk-testpmd.p/test-pmd_flowgen.c.o app/dpdk-testpmd.p/test-pmd_icmpecho.c.o app/dpdk-testpmd.p/test-pmd_ieee1588fwd.c.o app/dpdk-testpmd.p/test-pmd_iofwd.c.o app/dpdk-testpmd.p/test-pmd_macfwd.c.o app/dpdk-testpmd.p/test-pmd_macswap.c.o app/dpdk-testpmd.p/test-pmd_noisy_vnf.c.o app/dpdk-testpmd.p/test-pmd_parameters.c.o app/dpdk-testpmd.p/test-pmd_rxonly.c.o app/dpdk-testpmd.p/test-pmd_testpmd.c.o app/dpdk-testpmd.p/test-pmd_txonly.c.o app/dpdk-testpmd.p/test-pmd_util.c.o app/dpdk-testpmd.p/test-pmd_bpf_cmd.c.o -Wl,--as-needed -Wl,--no-undefined -Wl,-O1 -Wl,--whole-archive -Wl,--start-group lib/librte_node.a lib/librte_graph.a lib/librte_bpf.a lib/librte_flow_classify.a lib/librte_pipeline.a lib/librte_table.a lib/librte_port.a lib/librte_fib.a lib/librte_ipsec.a lib/librte_vhost.a lib/librte_stack.a lib/librte_security.a lib/librte_sched.a lib/librte_reorder.a lib/librte_rib.a lib/librte_regexdev.a lib/librte_rawdev.a lib/librte_pdump.a lib/librte_power.a lib/librte_member.a lib/librte_lpm.a lib/librte_latencystats.a lib/librte_kni.a lib/librte_jobstats.a lib/librte_ip_frag.a lib/librte_gso.a lib/librte_gro.a lib/librte_eventdev.a lib/librte_efd.a lib/librte_distributor.a lib/librte_cryptodev.a lib/librte_compressdev.a lib/librte_cfgfile.a lib/librte_bitratestats.a lib/librte_bbdev.a lib/librte_acl.a lib/librte_timer.a lib/librte_hash.a lib/librte_metrics.a lib/librte_cmdline.a lib/librte_pci.a lib/librte_ethdev.a lib/librte_meter.a lib/librte_net.a lib/librte_mbuf.a lib/librte_mempool.a lib/librte_rcu.a lib/librte_ring.a lib/librte_eal.a lib/librte_telemetry.a lib/librte_kvargs.a drivers/librte_common_cpt.a drivers/librte_common_dpaax.a drivers/librte_common_iavf.a drivers/librte_common_octeontx.a drivers/librte_common_octeontx2.a drivers/librte_common_sfc_efx.a drivers/librte_bus_dpaa.a drivers/librte_bus_fslmc.a drivers/librte_bus_ifpga.a drivers/librte_bus_pci.a drivers/librte_bus_vdev.a drivers/librte_bus_vmbus.a drivers/librte_common_qat.a drivers/librte_mempool_bucket.a drivers/librte_mempool_dpaa.a drivers/librte_mempool_dpaa2.a drivers/librte_mempool_octeontx.a drivers/librte_mempool_octeontx2.a drivers/librte_mempool_ring.a drivers/librte_mempool_stack.a drivers/librte_net_af_packet.a drivers/librte_net_ark.a drivers/librte_net_atlantic.a drivers/librte_net_avp.a drivers/librte_net_axgbe.a drivers/librte_net_bond.a drivers/librte_net_bnx2x.a drivers/librte_net_bnxt.a drivers/librte_net_cxgbe.a drivers/librte_net_dpaa.a drivers/librte_net_dpaa2.a drivers/librte_net_e1000.a drivers/librte_net_ena.a drivers/librte_net_enetc.a drivers/librte_net_enic.a drivers/librte_net_failsafe.a drivers/librte_net_fm10k.a drivers/librte_net_i40e.a drivers/librte_net_hinic.a drivers/librte_net_hns3.a drivers/librte_net_iavf.a drivers/librte_net_ice.a drivers/librte_net_igc.a drivers/librte_net_ionic.a drivers/librte_net_ipn3ke.a drivers/librte_net_ixgbe.a drivers/librte_net_kni.a drivers/librte_net_liquidio.a drivers/librte_net_memif.a drivers/librte_net_netvsc.a drivers/librte_net_nfp.a drivers/librte_net_null.a drivers/librte_net_octeontx.a drivers/librte_net_octeontx2.a drivers/librte_net_pcap.a drivers/librte_net_pfe.a drivers/librte_net_qede.a drivers/librte_net_ring.a drivers/librte_net_sfc.a drivers/librte_net_softnic.a drivers/librte_net_tap.a drivers/librte_net_thunderx.a drivers/librte_net_txgbe.a drivers/librte_net_vdev_netvsc.a drivers/librte_net_vhost.a drivers/librte_net_virtio.a drivers/librte_net_vmxnet3.a drivers/librte_raw_dpaa2_cmdif.a drivers/librte_raw_dpaa2_qdma.a drivers/librte_raw_ifpga.a drivers/librte_raw_ioat.a drivers/librte_raw_ntb.a drivers/librte_raw_octeontx2_dma.a drivers/librte_raw_octeontx2_ep.a drivers/librte_raw_skeleton.a drivers/librte_crypto_aesni_gcm.a drivers/librte_crypto_aesni_mb.a drivers/librte_crypto_bcmfs.a drivers/librte_crypto_caam_jr.a drivers/librte_crypto_ccp.a drivers/librte_crypto_dpaa_sec.a drivers/librte_crypto_dpaa2_sec.a drivers/librte_crypto_kasumi.a drivers/librte_crypto_nitrox.a drivers/librte_crypto_null.a drivers/librte_crypto_octeontx.a drivers/librte_crypto_octeontx2.a drivers/librte_crypto_openssl.a drivers/librte_crypto_scheduler.a drivers/librte_crypto_snow3g.a drivers/librte_crypto_virtio.a drivers/librte_crypto_zuc.a drivers/librte_compress_isal.a drivers/librte_compress_octeontx.a drivers/librte_compress_zlib.a drivers/librte_regex_octeontx2.a drivers/librte_vdpa_ifc.a drivers/librte_event_dlb.a drivers/librte_event_dlb2.a drivers/librte_event_dpaa.a drivers/librte_event_dpaa2.a drivers/librte_event_octeontx2.a drivers/librte_event_opdl.a drivers/librte_event_skeleton.a drivers/librte_event_sw.a drivers/librte_event_dsw.a drivers/librte_event_octeontx.a drivers/librte_baseband_null.a drivers/librte_baseband_turbo_sw.a drivers/librte_baseband_fpga_lte_fec.a drivers/librte_baseband_fpga_5gnr_fec.a drivers/librte_baseband_acc100.a -Wl,--no-whole-archive -Wl,--no-as-needed -pthread -lm -ldl -lnuma -lfdt -Wl,--export-dynamic /usr/lib64/libpcap.so /usr/lib64/libcrypto.so /usr/lib64/libz.so /usr/lib/gcc/x86_64-redhat-linux/10/../../../../lib64/librt.so -lIPSec_MB -lIPSec_MB -lIPSec_MB -lIPSec_MB -lIPSec_MB /usr/lib64/libisal.so -Wl,--end-group -Wl,-rpath,XXXXXXXXXXXXXXXXXXXXXXXXXXXXX
/usr/bin/ld: app/dpdk-testpmd.p/test-pmd_cmdline.c.o:(.bss+0x0): multiple definition of `testpmd_cl'; app/dpdk-testpmd.p/test-pmd_5tswap.c.o:(.bss+0x0): first defined here
/usr/bin/ld: app/dpdk-testpmd.p/test-pmd_cmdline.c.o:(.bss+0xc): multiple definition of `f_quit'; app/dpdk-testpmd.p/test-pmd_5tswap.c.o:(.bss+0xc): first defined here
/usr/bin/ld: app/dpdk-testpmd.p/test-pmd_cmdline.c.o:(.bss+0x8): multiple definition of `testpmd_fd_copy'; app/dpdk-testpmd.p/test-pmd_5tswap.c.o:(.bss+0x8): first defined here
/usr/bin/ld: app/dpdk-testpmd.p/test-pmd_cmdline_flow.c.o:(.bss+0x4320): multiple definition of `testpmd_cl'; app/dpdk-testpmd.p/test-pmd_5tswap.c.o:(.bss+0x0): first defined here
/usr/bin/ld: app/dpdk-testpmd.p/test-pmd_cmdline_flow.c.o:(.bss+0x4328): multiple definition of `testpmd_fd_copy'; app/dpdk-testpmd.p/test-pmd_5tswap.c.o:(.bss+0x8): first defined here
/usr/bin/ld: app/dpdk-testpmd.p/test-pmd_cmdline_flow.c.o:(.bss+0x432c): multiple definition of `f_quit'; app/dpdk-testpmd.p/test-pmd_5tswap.c.o:(.bss+0xc): first defined here
/usr/bin/ld: app/dpdk-testpmd.p/test-pmd_cmdline_mtr.c.o:(.bss+0x0): multiple definition of `testpmd_cl'; app/dpdk-testpmd.p/test-pmd_5tswap.c.o:(.bss+0x0): first defined here
/usr/bin/ld: app/dpdk-testpmd.p/test-pmd_cmdline_mtr.c.o:(.bss+0x8): multiple definition of `testpmd_fd_copy'; app/dpdk-testpmd.p/test-pmd_5tswap.c.o:(.bss+0x8): first defined here
/usr/bin/ld: app/dpdk-testpmd.p/test-pmd_cmdline_mtr.c.o:(.bss+0xc): multiple definition of `f_quit'; app/dpdk-testpmd.p/test-pmd_5tswap.c.o:(.bss+0xc): first defined here
/usr/bin/ld: app/dpdk-testpmd.p/test-pmd_cmdline_tm.c.o:(.bss+0x0): multiple definition of `testpmd_cl'; app/dpdk-testpmd.p/test-pmd_5tswap.c.o:(.bss+0x0): first defined here
/usr/bin/ld: app/dpdk-testpmd.p/test-pmd_cmdline_tm.c.o:(.bss+0x8): multiple definition of `testpmd_fd_copy'; app/dpdk-testpmd.p/test-pmd_5tswap.c.o:(.bss+0x8): first defined here
/usr/bin/ld: app/dpdk-testpmd.p/test-pmd_cmdline_tm.c.o:(.bss+0xc): multiple definition of `f_quit'; app/dpdk-testpmd.p/test-pmd_5tswap.c.o:(.bss+0xc): first defined here
/usr/bin/ld: app/dpdk-testpmd.p/test-pmd_config.c.o:(.bss+0x0): multiple definition of `testpmd_cl'; app/dpdk-testpmd.p/test-pmd_5tswap.c.o:(.bss+0x0): first defined here
/usr/bin/ld: app/dpdk-testpmd.p/test-pmd_config.c.o:(.bss+0x8): multiple definition of `testpmd_fd_copy'; app/dpdk-testpmd.p/test-pmd_5tswap.c.o:(.bss+0x8): first defined here
/usr/bin/ld: app/dpdk-testpmd.p/test-pmd_config.c.o:(.bss+0xc): multiple definition of `f_quit'; app/dpdk-testpmd.p/test-pmd_5tswap.c.o:(.bss+0xc): first defined here
/usr/bin/ld: app/dpdk-testpmd.p/test-pmd_csumonly.c.o:(.bss+0x0): multiple definition of `testpmd_cl'; app/dpdk-testpmd.p/test-pmd_5tswap.c.o:(.bss+0x0): first defined here
/usr/bin/ld: app/dpdk-testpmd.p/test-pmd_csumonly.c.o:(.bss+0x8): multiple definition of `testpmd_fd_copy'; app/dpdk-testpmd.p/test-pmd_5tswap.c.o:(.bss+0x8): first defined here
/usr/bin/ld: app/dpdk-testpmd.p/test-pmd_csumonly.c.o:(.bss+0xc): multiple definition of `f_quit'; app/dpdk-testpmd.p/test-pmd_5tswap.c.o:(.bss+0xc): first defined here
/usr/bin/ld: app/dpdk-testpmd.p/test-pmd_flowgen.c.o:(.bss+0x0): multiple definition of `testpmd_cl'; app/dpdk-testpmd.p/test-pmd_5tswap.c.o:(.bss+0x0): first defined here
/usr/bin/ld: app/dpdk-testpmd.p/test-pmd_flowgen.c.o:(.bss+0x8): multiple definition of `testpmd_fd_copy'; app/dpdk-testpmd.p/test-pmd_5tswap.c.o:(.bss+0x8): first defined here
/usr/bin/ld: app/dpdk-testpmd.p/test-pmd_flowgen.c.o:(.bss+0xc): multiple definition of `f_quit'; app/dpdk-testpmd.p/test-pmd_5tswap.c.o:(.bss+0xc): first defined here
/usr/bin/ld: app/dpdk-testpmd.p/test-pmd_icmpecho.c.o:(.bss+0x0): multiple definition of `testpmd_cl'; app/dpdk-testpmd.p/test-pmd_5tswap.c.o:(.bss+0x0): first defined here
/usr/bin/ld: app/dpdk-testpmd.p/test-pmd_icmpecho.c.o:(.bss+0x8): multiple definition of `testpmd_fd_copy'; app/dpdk-testpmd.p/test-pmd_5tswap.c.o:(.bss+0x8): first defined here
/usr/bin/ld: app/dpdk-testpmd.p/test-pmd_icmpecho.c.o:(.bss+0xc): multiple definition of `f_quit'; app/dpdk-testpmd.p/test-pmd_5tswap.c.o:(.bss+0xc): first defined here
/usr/bin/ld: app/dpdk-testpmd.p/test-pmd_ieee1588fwd.c.o:(.bss+0x0): multiple definition of `testpmd_cl'; app/dpdk-testpmd.p/test-pmd_5tswap.c.o:(.bss+0x0): first defined here
/usr/bin/ld: app/dpdk-testpmd.p/test-pmd_ieee1588fwd.c.o:(.bss+0x8): multiple definition of `testpmd_fd_copy'; app/dpdk-testpmd.p/test-pmd_5tswap.c.o:(.bss+0x8): first defined here
/usr/bin/ld: app/dpdk-testpmd.p/test-pmd_ieee1588fwd.c.o:(.bss+0xc): multiple definition of `f_quit'; app/dpdk-testpmd.p/test-pmd_5tswap.c.o:(.bss+0xc): first defined here
/usr/bin/ld: app/dpdk-testpmd.p/test-pmd_iofwd.c.o:(.bss+0x0): multiple definition of `testpmd_cl'; app/dpdk-testpmd.p/test-pmd_5tswap.c.o:(.bss+0x0): first defined here
/usr/bin/ld: app/dpdk-testpmd.p/test-pmd_iofwd.c.o:(.bss+0x8): multiple definition of `testpmd_fd_copy'; app/dpdk-testpmd.p/test-pmd_5tswap.c.o:(.bss+0x8): first defined here
/usr/bin/ld: app/dpdk-testpmd.p/test-pmd_iofwd.c.o:(.bss+0xc): multiple definition of `f_quit'; app/dpdk-testpmd.p/test-pmd_5tswap.c.o:(.bss+0xc): first defined here
/usr/bin/ld: app/dpdk-testpmd.p/test-pmd_macfwd.c.o:(.bss+0x0): multiple definition of `testpmd_cl'; app/dpdk-testpmd.p/test-pmd_5tswap.c.o:(.bss+0x0): first defined here
/usr/bin/ld: app/dpdk-testpmd.p/test-pmd_macfwd.c.o:(.bss+0x8): multiple definition of `testpmd_fd_copy'; app/dpdk-testpmd.p/test-pmd_5tswap.c.o:(.bss+0x8): first defined here
/usr/bin/ld: app/dpdk-testpmd.p/test-pmd_macfwd.c.o:(.bss+0xc): multiple definition of `f_quit'; app/dpdk-testpmd.p/test-pmd_5tswap.c.o:(.bss+0xc): first defined here
/usr/bin/ld: app/dpdk-testpmd.p/test-pmd_macswap.c.o:(.bss+0x0): multiple definition of `testpmd_cl'; app/dpdk-testpmd.p/test-pmd_5tswap.c.o:(.bss+0x0): first defined here
/usr/bin/ld: app/dpdk-testpmd.p/test-pmd_macswap.c.o:(.bss+0x8): multiple definition of `testpmd_fd_copy'; app/dpdk-testpmd.p/test-pmd_5tswap.c.o:(.bss+0x8): first defined here
/usr/bin/ld: app/dpdk-testpmd.p/test-pmd_macswap.c.o:(.bss+0xc): multiple definition of `f_quit'; app/dpdk-testpmd.p/test-pmd_5tswap.c.o:(.bss+0xc): first defined here
/usr/bin/ld: app/dpdk-testpmd.p/test-pmd_noisy_vnf.c.o:(.bss+0x100): multiple definition of `testpmd_cl'; app/dpdk-testpmd.p/test-pmd_5tswap.c.o:(.bss+0x0): first defined here
/usr/bin/ld: app/dpdk-testpmd.p/test-pmd_noisy_vnf.c.o:(.bss+0x108): multiple definition of `testpmd_fd_copy'; app/dpdk-testpmd.p/test-pmd_5tswap.c.o:(.bss+0x8): first defined here
/usr/bin/ld: app/dpdk-testpmd.p/test-pmd_noisy_vnf.c.o:(.bss+0x10c): multiple definition of `f_quit'; app/dpdk-testpmd.p/test-pmd_5tswap.c.o:(.bss+0xc): first defined here
/usr/bin/ld: app/dpdk-testpmd.p/test-pmd_parameters.c.o:(.bss+0x0): multiple definition of `testpmd_cl'; app/dpdk-testpmd.p/test-pmd_5tswap.c.o:(.bss+0x0): first defined here
/usr/bin/ld: app/dpdk-testpmd.p/test-pmd_parameters.c.o:(.bss+0x8): multiple definition of `testpmd_fd_copy'; app/dpdk-testpmd.p/test-pmd_5tswap.c.o:(.bss+0x8): first defined here
/usr/bin/ld: app/dpdk-testpmd.p/test-pmd_parameters.c.o:(.bss+0xc): multiple definition of `f_quit'; app/dpdk-testpmd.p/test-pmd_5tswap.c.o:(.bss+0xc): first defined here
/usr/bin/ld: app/dpdk-testpmd.p/test-pmd_rxonly.c.o:(.bss+0x0): multiple definition of `testpmd_cl'; app/dpdk-testpmd.p/test-pmd_5tswap.c.o:(.bss+0x0): first defined here
/usr/bin/ld: app/dpdk-testpmd.p/test-pmd_rxonly.c.o:(.bss+0x8): multiple definition of `testpmd_fd_copy'; app/dpdk-testpmd.p/test-pmd_5tswap.c.o:(.bss+0x8): first defined here
/usr/bin/ld: app/dpdk-testpmd.p/test-pmd_rxonly.c.o:(.bss+0xc): multiple definition of `f_quit'; app/dpdk-testpmd.p/test-pmd_5tswap.c.o:(.bss+0xc): first defined here
/usr/bin/ld: app/dpdk-testpmd.p/test-pmd_testpmd.c.o:(.bss+0x2978): multiple definition of `f_quit'; app/dpdk-testpmd.p/test-pmd_5tswap.c.o:(.bss+0xc): first defined here
/usr/bin/ld: app/dpdk-testpmd.p/test-pmd_testpmd.c.o:(.data+0x6c0): multiple definition of `testpmd_fd_copy'; app/dpdk-testpmd.p/test-pmd_5tswap.c.o:(.bss+0x8): first defined here
/usr/bin/ld: app/dpdk-testpmd.p/test-pmd_testpmd.c.o:(.bss+0x2970): multiple definition of `testpmd_cl'; app/dpdk-testpmd.p/test-pmd_5tswap.c.o:(.bss+0x0): first defined here
/usr/bin/ld: app/dpdk-testpmd.p/test-pmd_txonly.c.o:(.bss+0x0): multiple definition of `testpmd_cl'; app/dpdk-testpmd.p/test-pmd_5tswap.c.o:(.bss+0x0): first defined here
/usr/bin/ld: app/dpdk-testpmd.p/test-pmd_txonly.c.o:(.bss+0x8): multiple definition of `testpmd_fd_copy'; app/dpdk-testpmd.p/test-pmd_5tswap.c.o:(.bss+0x8): first defined here
/usr/bin/ld: app/dpdk-testpmd.p/test-pmd_txonly.c.o:(.bss+0xc): multiple definition of `f_quit'; app/dpdk-testpmd.p/test-pmd_5tswap.c.o:(.bss+0xc): first defined here
/usr/bin/ld: app/dpdk-testpmd.p/test-pmd_util.c.o:(.bss+0x0): multiple definition of `testpmd_cl'; app/dpdk-testpmd.p/test-pmd_5tswap.c.o:(.bss+0x0): first defined here
/usr/bin/ld: app/dpdk-testpmd.p/test-pmd_util.c.o:(.bss+0x8): multiple definition of `testpmd_fd_copy'; app/dpdk-testpmd.p/test-pmd_5tswap.c.o:(.bss+0x8): first defined here
/usr/bin/ld: app/dpdk-testpmd.p/test-pmd_util.c.o:(.bss+0xc): multiple definition of `f_quit'; app/dpdk-testpmd.p/test-pmd_5tswap.c.o:(.bss+0xc): first defined here
/usr/bin/ld: app/dpdk-testpmd.p/test-pmd_bpf_cmd.c.o:(.bss+0x0): multiple definition of `testpmd_cl'; app/dpdk-testpmd.p/test-pmd_5tswap.c.o:(.bss+0x0): first defined here
/usr/bin/ld: app/dpdk-testpmd.p/test-pmd_bpf_cmd.c.o:(.bss+0x8): multiple definition of `testpmd_fd_copy'; app/dpdk-testpmd.p/test-pmd_5tswap.c.o:(.bss+0x8): first defined here
/usr/bin/ld: app/dpdk-testpmd.p/test-pmd_bpf_cmd.c.o:(.bss+0xc): multiple definition of `f_quit'; app/dpdk-testpmd.p/test-pmd_5tswap.c.o:(.bss+0xc): first defined here
collect2: error: ld returned 1 exit status
[2770/2824] Linking target app/test/dpdk-test
[2771/2824] Linking target app/dpdk-test-sad
[2772/2824] Linking target examples/dpdk-cmdline
[2773/2824] Linking target examples/dpdk-ethtool
[2774/2824] Linking target examples/dpdk-distributor
[2775/2824] Linking target app/dpdk-test-regex
[2776/2824] Linking target examples/dpdk-bond
[2777/2824] Linking target examples/dpdk-bbdev_app
[2778/2824] Linking target examples/dpdk-eventdev_pipeline
[2779/2824] Linking target examples/dpdk-l2fwd
[2780/2824] Linking target examples/dpdk-helloworld
ninja: build stopped




*Build Failed #2:
OS: FC33-64
Target: x86_64-native-linuxapp-clang
FAILED: app/dpdk-testpmd 
clang  -o app/dpdk-testpmd app/dpdk-testpmd.p/test-pmd_5tswap.c.o app/dpdk-testpmd.p/test-pmd_cmdline.c.o app/dpdk-testpmd.p/test-pmd_cmdline_flow.c.o app/dpdk-testpmd.p/test-pmd_cmdline_mtr.c.o app/dpdk-testpmd.p/test-pmd_cmdline_tm.c.o app/dpdk-testpmd.p/test-pmd_config.c.o app/dpdk-testpmd.p/test-pmd_csumonly.c.o app/dpdk-testpmd.p/test-pmd_flowgen.c.o app/dpdk-testpmd.p/test-pmd_icmpecho.c.o app/dpdk-testpmd.p/test-pmd_ieee1588fwd.c.o app/dpdk-testpmd.p/test-pmd_iofwd.c.o app/dpdk-testpmd.p/test-pmd_macfwd.c.o app/dpdk-testpmd.p/test-pmd_macswap.c.o app/dpdk-testpmd.p/test-pmd_noisy_vnf.c.o app/dpdk-testpmd.p/test-pmd_parameters.c.o app/dpdk-testpmd.p/test-pmd_rxonly.c.o app/dpdk-testpmd.p/test-pmd_testpmd.c.o app/dpdk-testpmd.p/test-pmd_txonly.c.o app/dpdk-testpmd.p/test-pmd_util.c.o app/dpdk-testpmd.p/test-pmd_bpf_cmd.c.o -Wl,--as-needed -Wl,--no-undefined -Wl,-O1 -Wl,--whole-archive -Wl,--start-group lib/librte_node.a lib/librte_graph.a lib/librte_bpf.a lib/librte_flow_classify.a lib/librte_pipeline.a lib/librte_table.a lib/librte_port.a lib/librte_fib.a lib/librte_ipsec.a lib/librte_vhost.a lib/librte_stack.a lib/librte_security.a lib/librte_sched.a lib/librte_reorder.a lib/librte_rib.a lib/librte_regexdev.a lib/librte_rawdev.a lib/librte_pdump.a lib/librte_power.a lib/librte_member.a lib/librte_lpm.a lib/librte_latencystats.a lib/librte_kni.a lib/librte_jobstats.a lib/librte_ip_frag.a lib/librte_gso.a lib/librte_gro.a lib/librte_eventdev.a lib/librte_efd.a lib/librte_distributor.a lib/librte_cryptodev.a lib/librte_compressdev.a lib/librte_cfgfile.a lib/librte_bitratestats.a lib/librte_bbdev.a lib/librte_acl.a lib/librte_timer.a lib/librte_hash.a lib/librte_metrics.a lib/librte_cmdline.a lib/librte_pci.a lib/librte_ethdev.a lib/librte_meter.a lib/librte_net.a lib/librte_mbuf.a lib/librte_mempool.a lib/librte_rcu.a lib/librte_ring.a lib/librte_eal.a lib/librte_telemetry.a lib/librte_kvargs.a drivers/librte_common_cpt.a drivers/librte_common_dpaax.a drivers/librte_common_iavf.a drivers/librte_common_octeontx.a drivers/librte_common_octeontx2.a drivers/librte_common_sfc_efx.a drivers/librte_bus_dpaa.a drivers/librte_bus_fslmc.a drivers/librte_bus_ifpga.a drivers/librte_bus_pci.a drivers/librte_bus_vdev.a drivers/librte_bus_vmbus.a drivers/librte_common_qat.a drivers/librte_mempool_bucket.a drivers/librte_mempool_dpaa.a drivers/librte_mempool_dpaa2.a drivers/librte_mempool_octeontx.a drivers/librte_mempool_octeontx2.a drivers/librte_mempool_ring.a drivers/librte_mempool_stack.a drivers/librte_net_af_packet.a drivers/librte_net_ark.a drivers/librte_net_atlantic.a drivers/librte_net_avp.a drivers/librte_net_axgbe.a drivers/librte_net_bond.a drivers/librte_net_bnx2x.a drivers/librte_net_bnxt.a drivers/librte_net_cxgbe.a drivers/librte_net_dpaa.a drivers/librte_net_dpaa2.a drivers/librte_net_e1000.a drivers/librte_net_ena.a drivers/librte_net_enetc.a drivers/librte_net_enic.a drivers/librte_net_failsafe.a drivers/librte_net_fm10k.a drivers/librte_net_i40e.a drivers/librte_net_hinic.a drivers/librte_net_hns3.a drivers/librte_net_iavf.a drivers/librte_net_ice.a drivers/librte_net_igc.a drivers/librte_net_ionic.a drivers/librte_net_ipn3ke.a drivers/librte_net_ixgbe.a drivers/librte_net_kni.a drivers/librte_net_liquidio.a drivers/librte_net_memif.a drivers/librte_net_netvsc.a drivers/librte_net_nfp.a drivers/librte_net_null.a drivers/librte_net_octeontx.a drivers/librte_net_octeontx2.a drivers/librte_net_pcap.a drivers/librte_net_pfe.a drivers/librte_net_qede.a drivers/librte_net_ring.a drivers/librte_net_sfc.a drivers/librte_net_softnic.a drivers/librte_net_tap.a drivers/librte_net_thunderx.a drivers/librte_net_txgbe.a drivers/librte_net_vdev_netvsc.a drivers/librte_net_vhost.a drivers/librte_net_virtio.a drivers/librte_net_vmxnet3.a drivers/librte_raw_dpaa2_cmdif.a drivers/librte_raw_dpaa2_qdma.a drivers/librte_raw_ifpga.a drivers/librte_raw_ioat.a drivers/librte_raw_ntb.a drivers/librte_raw_octeontx2_dma.a drivers/librte_raw_octeontx2_ep.a drivers/librte_raw_skeleton.a drivers/librte_crypto_aesni_gcm.a drivers/librte_crypto_aesni_mb.a drivers/librte_crypto_bcmfs.a drivers/librte_crypto_caam_jr.a drivers/librte_crypto_ccp.a drivers/librte_crypto_dpaa_sec.a drivers/librte_crypto_dpaa2_sec.a drivers/librte_crypto_kasumi.a drivers/librte_crypto_nitrox.a drivers/librte_crypto_null.a drivers/librte_crypto_octeontx.a drivers/librte_crypto_octeontx2.a drivers/librte_crypto_openssl.a drivers/librte_crypto_scheduler.a drivers/librte_crypto_snow3g.a drivers/librte_crypto_virtio.a drivers/librte_crypto_zuc.a drivers/librte_compress_isal.a drivers/librte_compress_octeontx.a drivers/librte_compress_zlib.a drivers/librte_regex_octeontx2.a drivers/librte_vdpa_ifc.a drivers/librte_event_dlb.a drivers/librte_event_dlb2.a drivers/librte_event_dpaa.a drivers/librte_event_dpaa2.a drivers/librte_event_octeontx2.a drivers/librte_event_opdl.a drivers/librte_event_skeleton.a drivers/librte_event_sw.a drivers/librte_event_dsw.a drivers/librte_event_octeontx.a drivers/librte_baseband_null.a drivers/librte_baseband_turbo_sw.a drivers/librte_baseband_fpga_lte_fec.a drivers/librte_baseband_fpga_5gnr_fec.a drivers/librte_baseband_acc100.a -Wl,--no-whole-archive -Wl,--no-as-needed -pthread -lm -ldl -lnuma -lfdt -Wl,--export-dynamic /usr/lib64/libpcap.so /usr/lib64/libcrypto.so /usr/lib64/libz.so /usr/bin/../lib/gcc/x86_64-redhat-linux/10/../../../../lib64/librt.so -lIPSec_MB -lIPSec_MB -lIPSec_MB -lIPSec_MB -lIPSec_MB /usr/lib64/libisal.so -Wl,--end-group -Wl,-rpath,XXXXXXXXXXXXXXXXXXXXXXXXXXXXX
/usr/bin/ld: app/dpdk-testpmd.p/test-pmd_cmdline.c.o:(.bss+0x8): multiple definition of `f_quit'; app/dpdk-testpmd.p/test-pmd_5tswap.c.o:(.bss+0x0): first defined here
/usr/bin/ld: app/dpdk-testpmd.p/test-pmd_cmdline.c.o:(.bss+0x0): multiple definition of `testpmd_cl'; app/dpdk-testpmd.p/test-pmd_5tswap.c.o:(.bss+0x8): first defined here
/usr/bin/ld: app/dpdk-testpmd.p/test-pmd_cmdline.c.o:(.bss+0xc): multiple definition of `testpmd_fd_copy'; app/dpdk-testpmd.p/test-pmd_5tswap.c.o:(.bss+0x4): first defined here
/usr/bin/ld: app/dpdk-testpmd.p/test-pmd_cmdline_flow.c.o:(.bss+0x0): multiple definition of `f_quit'; app/dpdk-testpmd.p/test-pmd_5tswap.c.o:(.bss+0x0): first defined here
/usr/bin/ld: app/dpdk-testpmd.p/test-pmd_cmdline_flow.c.o:(.bss+0x8): multiple definition of `testpmd_cl'; app/dpdk-testpmd.p/test-pmd_5tswap.c.o:(.bss+0x8): first defined here
/usr/bin/ld: app/dpdk-testpmd.p/test-pmd_cmdline_flow.c.o:(.bss+0x4): multiple definition of `testpmd_fd_copy'; app/dpdk-testpmd.p/test-pmd_5tswap.c.o:(.bss+0x4): first defined here
/usr/bin/ld: app/dpdk-testpmd.p/test-pmd_cmdline_mtr.c.o:(.bss+0x0): multiple definition of `f_quit'; app/dpdk-testpmd.p/test-pmd_5tswap.c.o:(.bss+0x0): first defined here
/usr/bin/ld: app/dpdk-testpmd.p/test-pmd_cmdline_mtr.c.o:(.bss+0x8): multiple definition of `testpmd_cl'; app/dpdk-testpmd.p/test-pmd_5tswap.c.o:(.bss+0x8): first defined here
/usr/bin/ld: app/dpdk-testpmd.p/test-pmd_cmdline_mtr.c.o:(.bss+0x4): multiple definition of `testpmd_fd_copy'; app/dpdk-testpmd.p/test-pmd_5tswap.c.o:(.bss+0x4): first defined here
/usr/bin/ld: app/dpdk-testpmd.p/test-pmd_cmdline_tm.c.o:(.bss+0x0): multiple definition of `f_quit'; app/dpdk-testpmd.p/test-pmd_5tswap.c.o:(.bss+0x0): first defined here
/usr/bin/ld: app/dpdk-testpmd.p/test-pmd_cmdline_tm.c.o:(.bss+0x8): multiple definition of `testpmd_cl'; app/dpdk-testpmd.p/test-pmd_5tswap.c.o:(.bss+0x8): first defined here
/usr/bin/ld: app/dpdk-testpmd.p/test-pmd_cmdline_tm.c.o:(.bss+0x4): multiple definition of `testpmd_fd_copy'; app/dpdk-testpmd.p/test-pmd_5tswap.c.o:(.bss+0x4): first defined here
/usr/bin/ld: app/dpdk-testpmd.p/test-pmd_config.c.o:(.bss+0x600): multiple definition of `f_quit'; app/dpdk-testpmd.p/test-pmd_5tswap.c.o:(.bss+0x0): first defined here
/usr/bin/ld: app/dpdk-testpmd.p/test-pmd_config.c.o:(.bss+0x608): multiple definition of `testpmd_cl'; app/dpdk-testpmd.p/test-pmd_5tswap.c.o:(.bss+0x8): first defined here
/usr/bin/ld: app/dpdk-testpmd.p/test-pmd_config.c.o:(.bss+0x604): multiple definition of `testpmd_fd_copy'; app/dpdk-testpmd.p/test-pmd_5tswap.c.o:(.bss+0x4): first defined here
/usr/bin/ld: app/dpdk-testpmd.p/test-pmd_csumonly.c.o:(.bss+0x0): multiple definition of `f_quit'; app/dpdk-testpmd.p/test-pmd_5tswap.c.o:(.bss+0x0): first defined here
/usr/bin/ld: app/dpdk-testpmd.p/test-pmd_csumonly.c.o:(.bss+0x8): multiple definition of `testpmd_cl'; app/dpdk-testpmd.p/test-pmd_5tswap.c.o:(.bss+0x8): first defined here
/usr/bin/ld: app/dpdk-testpmd.p/test-pmd_csumonly.c.o:(.bss+0x4): multiple definition of `testpmd_fd_copy'; app/dpdk-testpmd.p/test-pmd_5tswap.c.o:(.bss+0x4): first defined here
/usr/bin/ld: app/dpdk-testpmd.p/test-pmd_flowgen.c.o:(.bss+0x0): multiple definition of `f_quit'; app/dpdk-testpmd.p/test-pmd_5tswap.c.o:(.bss+0x0): first defined here
/usr/bin/ld: app/dpdk-testpmd.p/test-pmd_flowgen.c.o:(.bss+0x8): multiple definition of `testpmd_cl'; app/dpdk-testpmd.p/test-pmd_5tswap.c.o:(.bss+0x8): first defined here
/usr/bin/ld: app/dpdk-testpmd.p/test-pmd_flowgen.c.o:(.bss+0x4): multiple definition of `testpmd_fd_copy'; app/dpdk-testpmd.p/test-pmd_5tswap.c.o:(.bss+0x4): first defined here
/usr/bin/ld: app/dpdk-testpmd.p/test-pmd_icmpecho.c.o:(.bss+0x0): multiple definition of `f_quit'; app/dpdk-testpmd.p/test-pmd_5tswap.c.o:(.bss+0x0): first defined here
/usr/bin/ld: app/dpdk-testpmd.p/test-pmd_icmpecho.c.o:(.bss+0x8): multiple definition of `testpmd_cl'; app/dpdk-testpmd.p/test-pmd_5tswap.c.o:(.bss+0x8): first defined here
/usr/bin/ld: app/dpdk-testpmd.p/test-pmd_icmpecho.c.o:(.bss+0x4): multiple definition of `testpmd_fd_copy'; app/dpdk-testpmd.p/test-pmd_5tswap.c.o:(.bss+0x4): first defined here
/usr/bin/ld: app/dpdk-testpmd.p/test-pmd_ieee1588fwd.c.o:(.bss+0x0): multiple definition of `f_quit'; app/dpdk-testpmd.p/test-pmd_5tswap.c.o:(.bss+0x0): first defined here
/usr/bin/ld: app/dpdk-testpmd.p/test-pmd_ieee1588fwd.c.o:(.bss+0x8): multiple definition of `testpmd_cl'; app/dpdk-testpmd.p/test-pmd_5tswap.c.o:(.bss+0x8): first defined here
/usr/bin/ld: app/dpdk-testpmd.p/test-pmd_ieee1588fwd.c.o:(.bss+0x4): multiple definition of `testpmd_fd_copy'; app/dpdk-testpmd.p/test-pmd_5tswap.c.o:(.bss+0x4): first defined here
/usr/bin/ld: app/dpdk-testpmd.p/test-pmd_iofwd.c.o:(.bss+0x0): multiple definition of `f_quit'; app/dpdk-testpmd.p/test-pmd_5tswap.c.o:(.bss+0x0): first defined here
/usr/bin/ld: app/dpdk-testpmd.p/test-pmd_iofwd.c.o:(.bss+0x8): multiple definition of `testpmd_cl'; app/dpdk-testpmd.p/test-pmd_5tswap.c.o:(.bss+0x8): first defined here
/usr/bin/ld: app/dpdk-testpmd.p/test-pmd_iofwd.c.o:(.bss+0x4): multiple definition of `testpmd_fd_copy'; app/dpdk-testpmd.p/test-pmd_5tswap.c.o:(.bss+0x4): first defined here
/usr/bin/ld: app/dpdk-testpmd.p/test-pmd_macfwd.c.o:(.bss+0x0): multiple definition of `f_quit'; app/dpdk-testpmd.p/test-pmd_5tswap.c.o:(.bss+0x0): first defined here
/usr/bin/ld: app/dpdk-testpmd.p/test-pmd_macfwd.c.o:(.bss+0x8): multiple definition of `testpmd_cl'; app/dpdk-testpmd.p/test-pmd_5tswap.c.o:(.bss+0x8): first defined here
/usr/bin/ld: app/dpdk-testpmd.p/test-pmd_macfwd.c.o:(.bss+0x4): multiple definition of `testpmd_fd_copy'; app/dpdk-testpmd.p/test-pmd_5tswap.c.o:(.bss+0x4): first defined here
/usr/bin/ld: app/dpdk-testpmd.p/test-pmd_macswap.c.o:(.bss+0x0): multiple definition of `f_quit'; app/dpdk-testpmd.p/test-pmd_5tswap.c.o:(.bss+0x0): first defined here
/usr/bin/ld: app/dpdk-testpmd.p/test-pmd_macswap.c.o:(.bss+0x8): multiple definition of `testpmd_cl'; app/dpdk-testpmd.p/test-pmd_5tswap.c.o:(.bss+0x8): first defined here
/usr/bin/ld: app/dpdk-testpmd.p/test-pmd_macswap.c.o:(.bss+0x4): multiple definition of `testpmd_fd_copy'; app/dpdk-testpmd.p/test-pmd_5tswap.c.o:(.bss+0x4): first defined here
/usr/bin/ld: app/dpdk-testpmd.p/test-pmd_noisy_vnf.c.o:(.bss+0x0): multiple definition of `f_quit'; app/dpdk-testpmd.p/test-pmd_5tswap.c.o:(.bss+0x0): first defined here
/usr/bin/ld: app/dpdk-testpmd.p/test-pmd_noisy_vnf.c.o:(.bss+0x8): multiple definition of `testpmd_cl'; app/dpdk-testpmd.p/test-pmd_5tswap.c.o:(.bss+0x8): first defined here
/usr/bin/ld: app/dpdk-testpmd.p/test-pmd_noisy_vnf.c.o:(.bss+0x4): multiple definition of `testpmd_fd_copy'; app/dpdk-testpmd.p/test-pmd_5tswap.c.o:(.bss+0x4): first defined here
/usr/bin/ld: app/dpdk-testpmd.p/test-pmd_parameters.c.o:(.bss+0x0): multiple definition of `f_quit'; app/dpdk-testpmd.p/test-pmd_5tswap.c.o:(.bss+0x0): first defined here
/usr/bin/ld: app/dpdk-testpmd.p/test-pmd_parameters.c.o:(.bss+0x8): multiple definition of `testpmd_cl'; app/dpdk-testpmd.p/test-pmd_5tswap.c.o:(.bss+0x8): first defined here
/usr/bin/ld: app/dpdk-testpmd.p/test-pmd_parameters.c.o:(.bss+0x4): multiple definition of `testpmd_fd_copy'; app/dpdk-testpmd.p/test-pmd_5tswap.c.o:(.bss+0x4): first defined here
/usr/bin/ld: app/dpdk-testpmd.p/test-pmd_rxonly.c.o:(.bss+0x0): multiple definition of `f_quit'; app/dpdk-testpmd.p/test-pmd_5tswap.c.o:(.bss+0x0): first defined here
/usr/bin/ld: app/dpdk-testpmd.p/test-pmd_rxonly.c.o:(.bss+0x8): multiple definition of `testpmd_cl'; app/dpdk-testpmd.p/test-pmd_5tswap.c.o:(.bss+0x8): first defined here
/usr/bin/ld: app/dpdk-testpmd.p/test-pmd_rxonly.c.o:(.bss+0x4): multiple definition of `testpmd_fd_copy'; app/dpdk-testpmd.p/test-pmd_5tswap.c.o:(.bss+0x4): first defined here
/usr/bin/ld: app/dpdk-testpmd.p/test-pmd_testpmd.c.o:(.bss+0x12f0): multiple definition of `f_quit'; app/dpdk-testpmd.p/test-pmd_5tswap.c.o:(.bss+0x0): first defined here
/usr/bin/ld: app/dpdk-testpmd.p/test-pmd_testpmd.c.o:(.bss+0x12f8): multiple definition of `testpmd_cl'; app/dpdk-testpmd.p/test-pmd_5tswap.c.o:(.bss+0x8): first defined here
/usr/bin/ld: app/dpdk-testpmd.p/test-pmd_testpmd.c.o:(.data+0x0): multiple definition of `testpmd_fd_copy'; app/dpdk-testpmd.p/test-pmd_5tswap.c.o:(.bss+0x4): first defined here
/usr/bin/ld: app/dpdk-testpmd.p/test-pmd_txonly.c.o:(.bss+0x0): multiple definition of `f_quit'; app/dpdk-testpmd.p/test-pmd_5tswap.c.o:(.bss+0x0): first defined here
/usr/bin/ld: app/dpdk-testpmd.p/test-pmd_txonly.c.o:(.bss+0x8): multiple definition of `testpmd_cl'; app/dpdk-testpmd.p/test-pmd_5tswap.c.o:(.bss+0x8): first defined here
/usr/bin/ld: app/dpdk-testpmd.p/test-pmd_txonly.c.o:(.bss+0x4): multiple definition of `testpmd_fd_copy'; app/dpdk-testpmd.p/test-pmd_5tswap.c.o:(.bss+0x4): first defined here
/usr/bin/ld: app/dpdk-testpmd.p/test-pmd_util.c.o:(.bss+0x0): multiple definition of `f_quit'; app/dpdk-testpmd.p/test-pmd_5tswap.c.o:(.bss+0x0): first defined here
/usr/bin/ld: app/dpdk-testpmd.p/test-pmd_util.c.o:(.bss+0x8): multiple definition of `testpmd_cl'; app/dpdk-testpmd.p/test-pmd_5tswap.c.o:(.bss+0x8): first defined here
/usr/bin/ld: app/dpdk-testpmd.p/test-pmd_util.c.o:(.bss+0x4): multiple definition of `testpmd_fd_copy'; app/dpdk-testpmd.p/test-pmd_5tswap.c.o:(.bss+0x4): first defined here
/usr/bin/ld: app/dpdk-testpmd.p/test-pmd_bpf_cmd.c.o:(.bss+0x0): multiple definition of `f_quit'; app/dpdk-testpmd.p/test-pmd_5tswap.c.o:(.bss+0x0): first defined here
/usr/bin/ld: app/dpdk-testpmd.p/test-pmd_bpf_cmd.c.o:(.bss+0x8): multiple definition of `testpmd_cl'; app/dpdk-testpmd.p/test-pmd_5tswap.c.o:(.bss+0x8): first defined here
/usr/bin/ld: app/dpdk-testpmd.p/test-pmd_bpf_cmd.c.o:(.bss+0x4): multiple definition of `testpmd_fd_copy'; app/dpdk-testpmd.p/test-pmd_5tswap.c.o:(.bss+0x4): first defined here
clang-11: error: linker command failed with exit code 1 (use -v to see invocation)
[2766/2824] Linking target app/dpdk-test-pipeline
[2767/2824] Linking target app/dpdk-test-flow-perf
[2768/2824] Linking target examples/dpdk-vhost_blk
[2769/2824] Linking target examples/dpdk-bond
[2770/2824] Linking target app/dpdk-test-eventdev
[2771/2824] Linking target app/dpdk-test-sad
[2772/2824] Linking target app/dpdk-test-regex
[2773/2824] Linking target examples/dpdk-bbdev_app
[2774/2824] Compiling C object app/test/dpdk-test.p/test_ring_perf.c.o
ninja: build stopped




*Build Failed #3:
OS: UB2004-64
Target: x86_64-native-linuxapp-gcc
FAILED: app/dpdk-testpmd 
gcc  -o app/dpdk-testpmd app/dpdk-testpmd.p/test-pmd_5tswap.c.o app/dpdk-testpmd.p/test-pmd_cmdline.c.o app/dpdk-testpmd.p/test-pmd_cmdline_flow.c.o app/dpdk-testpmd.p/test-pmd_cmdline_mtr.c.o app/dpdk-testpmd.p/test-pmd_cmdline_tm.c.o app/dpdk-testpmd.p/test-pmd_config.c.o app/dpdk-testpmd.p/test-pmd_csumonly.c.o app/dpdk-testpmd.p/test-pmd_flowgen.c.o app/dpdk-testpmd.p/test-pmd_icmpecho.c.o app/dpdk-testpmd.p/test-pmd_ieee1588fwd.c.o app/dpdk-testpmd.p/test-pmd_iofwd.c.o app/dpdk-testpmd.p/test-pmd_macfwd.c.o app/dpdk-testpmd.p/test-pmd_macswap.c.o app/dpdk-testpmd.p/test-pmd_noisy_vnf.c.o app/dpdk-testpmd.p/test-pmd_parameters.c.o app/dpdk-testpmd.p/test-pmd_rxonly.c.o app/dpdk-testpmd.p/test-pmd_testpmd.c.o app/dpdk-testpmd.p/test-pmd_txonly.c.o app/dpdk-testpmd.p/test-pmd_util.c.o app/dpdk-testpmd.p/test-pmd_bpf_cmd.c.o -Wl,--as-needed -Wl,--no-undefined -Wl,-O1 -Wl,--whole-archive -Wl,--start-group lib/librte_node.a lib/librte_graph.a lib/librte_bpf.a lib/librte_flow_classify.a lib/librte_pipeline.a lib/librte_table.a lib/librte_port.a lib/librte_fib.a lib/librte_ipsec.a lib/librte_vhost.a lib/librte_stack.a lib/librte_security.a lib/librte_sched.a lib/librte_reorder.a lib/librte_rib.a lib/librte_regexdev.a lib/librte_rawdev.a lib/librte_pdump.a lib/librte_power.a lib/librte_member.a lib/librte_lpm.a lib/librte_latencystats.a lib/librte_kni.a lib/librte_jobstats.a lib/librte_ip_frag.a lib/librte_gso.a lib/librte_gro.a lib/librte_eventdev.a lib/librte_efd.a lib/librte_distributor.a lib/librte_cryptodev.a lib/librte_compressdev.a lib/librte_cfgfile.a lib/librte_bitratestats.a lib/librte_bbdev.a lib/librte_acl.a lib/librte_timer.a lib/librte_hash.a lib/librte_metrics.a lib/librte_cmdline.a lib/librte_pci.a lib/librte_ethdev.a lib/librte_meter.a lib/librte_net.a lib/librte_mbuf.a lib/librte_mempool.a lib/librte_rcu.a lib/librte_ring.a lib/librte_eal.a lib/librte_telemetry.a lib/librte_kvargs.a drivers/librte_common_cpt.a drivers/librte_common_dpaax.a drivers/librte_common_iavf.a drivers/librte_common_octeontx.a drivers/librte_common_octeontx2.a drivers/librte_common_sfc_efx.a drivers/librte_bus_dpaa.a drivers/librte_bus_fslmc.a drivers/librte_bus_ifpga.a drivers/librte_bus_pci.a drivers/librte_bus_vdev.a drivers/librte_bus_vmbus.a drivers/librte_common_qat.a drivers/librte_mempool_bucket.a drivers/librte_mempool_dpaa.a drivers/librte_mempool_dpaa2.a drivers/librte_mempool_octeontx.a drivers/librte_mempool_octeontx2.a drivers/librte_mempool_ring.a drivers/librte_mempool_stack.a drivers/librte_net_af_packet.a drivers/librte_net_ark.a drivers/librte_net_atlantic.a drivers/librte_net_avp.a drivers/librte_net_axgbe.a drivers/librte_net_bond.a drivers/librte_net_bnx2x.a drivers/librte_net_bnxt.a drivers/librte_net_cxgbe.a drivers/librte_net_dpaa.a drivers/librte_net_dpaa2.a drivers/librte_net_e1000.a drivers/librte_net_ena.a drivers/librte_net_enetc.a drivers/librte_net_enic.a drivers/librte_net_failsafe.a drivers/librte_net_fm10k.a drivers/librte_net_i40e.a drivers/librte_net_hinic.a drivers/librte_net_hns3.a drivers/librte_net_iavf.a drivers/librte_net_ice.a drivers/librte_net_igc.a drivers/librte_net_ionic.a drivers/librte_net_ipn3ke.a drivers/librte_net_ixgbe.a drivers/librte_net_kni.a drivers/librte_net_liquidio.a drivers/librte_net_memif.a drivers/librte_net_netvsc.a drivers/librte_net_nfp.a drivers/librte_net_null.a drivers/librte_net_octeontx.a drivers/librte_net_octeontx2.a drivers/librte_net_pcap.a drivers/librte_net_pfe.a drivers/librte_net_qede.a drivers/librte_net_ring.a drivers/librte_net_sfc.a drivers/librte_net_softnic.a drivers/librte_net_tap.a drivers/librte_net_thunderx.a drivers/librte_net_txgbe.a drivers/librte_net_vdev_netvsc.a drivers/librte_net_vhost.a drivers/librte_net_virtio.a drivers/librte_net_vmxnet3.a drivers/librte_raw_dpaa2_cmdif.a drivers/librte_raw_dpaa2_qdma.a drivers/librte_raw_ifpga.a drivers/librte_raw_ioat.a drivers/librte_raw_ntb.a drivers/librte_raw_octeontx2_dma.a drivers/librte_raw_octeontx2_ep.a drivers/librte_raw_skeleton.a drivers/librte_crypto_aesni_gcm.a drivers/librte_crypto_aesni_mb.a drivers/librte_crypto_bcmfs.a drivers/librte_crypto_caam_jr.a drivers/librte_crypto_ccp.a drivers/librte_crypto_dpaa_sec.a drivers/librte_crypto_dpaa2_sec.a drivers/librte_crypto_kasumi.a drivers/librte_crypto_nitrox.a drivers/librte_crypto_null.a drivers/librte_crypto_octeontx.a drivers/librte_crypto_octeontx2.a drivers/librte_crypto_openssl.a drivers/librte_crypto_scheduler.a drivers/librte_crypto_snow3g.a drivers/librte_crypto_virtio.a drivers/librte_crypto_zuc.a drivers/librte_compress_octeontx.a drivers/librte_compress_zlib.a drivers/librte_regex_octeontx2.a drivers/librte_vdpa_ifc.a drivers/librte_event_dlb.a drivers/librte_event_dlb2.a drivers/librte_event_dpaa.a drivers/librte_event_dpaa2.a drivers/librte_event_octeontx2.a drivers/librte_event_opdl.a drivers/librte_event_skeleton.a drivers/librte_event_sw.a drivers/librte_event_dsw.a drivers/librte_event_octeontx.a drivers/librte_baseband_null.a drivers/librte_baseband_turbo_sw.a drivers/librte_baseband_fpga_lte_fec.a drivers/librte_baseband_fpga_5gnr_fec.a drivers/librte_baseband_acc100.a -Wl,--no-whole-archive -Wl,--no-as-needed -pthread -lm -ldl -lnuma -lfdt -Wl,--export-dynamic /usr/lib/x86_64-linux-gnu/libelf.so /usr/lib/x86_64-linux-gnu/libpcap.so /usr/lib/x86_64-linux-gnu/libcrypto.so /usr/lib/x86_64-linux-gnu/libz.so /usr/lib/gcc/x86_64-linux-gnu/10/../../../x86_64-linux-gnu/librt.so -lIPSec_MB -lIPSec_MB -lIPSec_MB -lIPSec_MB -lIPSec_MB -Wl,--end-group -Wl,-rpath,XXXXXXXXXXXXXXXXXXXXXXXXXXXXX
/usr/bin/ld: app/dpdk-testpmd.p/test-pmd_cmdline.c.o:(.bss+0x0): multiple definition of `testpmd_cl'; app/dpdk-testpmd.p/test-pmd_5tswap.c.o:(.bss+0x0): first defined here
/usr/bin/ld: app/dpdk-testpmd.p/test-pmd_cmdline.c.o:(.bss+0xc): multiple definition of `f_quit'; app/dpdk-testpmd.p/test-pmd_5tswap.c.o:(.bss+0xc): first defined here
/usr/bin/ld: app/dpdk-testpmd.p/test-pmd_cmdline.c.o:(.bss+0x8): multiple definition of `testpmd_fd_copy'; app/dpdk-testpmd.p/test-pmd_5tswap.c.o:(.bss+0x8): first defined here
/usr/bin/ld: app/dpdk-testpmd.p/test-pmd_cmdline_flow.c.o:(.bss+0x4320): multiple definition of `testpmd_cl'; app/dpdk-testpmd.p/test-pmd_5tswap.c.o:(.bss+0x0): first defined here
/usr/bin/ld: app/dpdk-testpmd.p/test-pmd_cmdline_flow.c.o:(.bss+0x4328): multiple definition of `testpmd_fd_copy'; app/dpdk-testpmd.p/test-pmd_5tswap.c.o:(.bss+0x8): first defined here
/usr/bin/ld: app/dpdk-testpmd.p/test-pmd_cmdline_flow.c.o:(.bss+0x432c): multiple definition of `f_quit'; app/dpdk-testpmd.p/test-pmd_5tswap.c.o:(.bss+0xc): first defined here
/usr/bin/ld: app/dpdk-testpmd.p/test-pmd_cmdline_mtr.c.o:(.bss+0x0): multiple definition of `testpmd_cl'; app/dpdk-testpmd.p/test-pmd_5tswap.c.o:(.bss+0x0): first defined here
/usr/bin/ld: app/dpdk-testpmd.p/test-pmd_cmdline_mtr.c.o:(.bss+0x8): multiple definition of `testpmd_fd_copy'; app/dpdk-testpmd.p/test-pmd_5tswap.c.o:(.bss+0x8): first defined here
/usr/bin/ld: app/dpdk-testpmd.p/test-pmd_cmdline_mtr.c.o:(.bss+0xc): multiple definition of `f_quit'; app/dpdk-testpmd.p/test-pmd_5tswap.c.o:(.bss+0xc): first defined here
/usr/bin/ld: app/dpdk-testpmd.p/test-pmd_cmdline_tm.c.o:(.bss+0x0): multiple definition of `testpmd_cl'; app/dpdk-testpmd.p/test-pmd_5tswap.c.o:(.bss+0x0): first defined here
/usr/bin/ld: app/dpdk-testpmd.p/test-pmd_cmdline_tm.c.o:(.bss+0x8): multiple definition of `testpmd_fd_copy'; app/dpdk-testpmd.p/test-pmd_5tswap.c.o:(.bss+0x8): first defined here
/usr/bin/ld: app/dpdk-testpmd.p/test-pmd_cmdline_tm.c.o:(.bss+0xc): multiple definition of `f_quit'; app/dpdk-testpmd.p/test-pmd_5tswap.c.o:(.bss+0xc): first defined here
/usr/bin/ld: app/dpdk-testpmd.p/test-pmd_config.c.o:(.bss+0x0): multiple definition of `testpmd_cl'; app/dpdk-testpmd.p/test-pmd_5tswap.c.o:(.bss+0x0): first defined here
/usr/bin/ld: app/dpdk-testpmd.p/test-pmd_config.c.o:(.bss+0x8): multiple definition of `testpmd_fd_copy'; app/dpdk-testpmd.p/test-pmd_5tswap.c.o:(.bss+0x8): first defined here
/usr/bin/ld: app/dpdk-testpmd.p/test-pmd_config.c.o:(.bss+0xc): multiple definition of `f_quit'; app/dpdk-testpmd.p/test-pmd_5tswap.c.o:(.bss+0xc): first defined here
/usr/bin/ld: app/dpdk-testpmd.p/test-pmd_csumonly.c.o:(.bss+0x0): multiple definition of `testpmd_cl'; app/dpdk-testpmd.p/test-pmd_5tswap.c.o:(.bss+0x0): first defined here
/usr/bin/ld: app/dpdk-testpmd.p/test-pmd_csumonly.c.o:(.bss+0x8): multiple definition of `testpmd_fd_copy'; app/dpdk-testpmd.p/test-pmd_5tswap.c.o:(.bss+0x8): first defined here
/usr/bin/ld: app/dpdk-testpmd.p/test-pmd_csumonly.c.o:(.bss+0xc): multiple definition of `f_quit'; app/dpdk-testpmd.p/test-pmd_5tswap.c.o:(.bss+0xc): first defined here
/usr/bin/ld: app/dpdk-testpmd.p/test-pmd_flowgen.c.o:(.bss+0x0): multiple definition of `testpmd_cl'; app/dpdk-testpmd.p/test-pmd_5tswap.c.o:(.bss+0x0): first defined here
/usr/bin/ld: app/dpdk-testpmd.p/test-pmd_flowgen.c.o:(.bss+0x8): multiple definition of `testpmd_fd_copy'; app/dpdk-testpmd.p/test-pmd_5tswap.c.o:(.bss+0x8): first defined here
/usr/bin/ld: app/dpdk-testpmd.p/test-pmd_flowgen.c.o:(.bss+0xc): multiple definition of `f_quit'; app/dpdk-testpmd.p/test-pmd_5tswap.c.o:(.bss+0xc): first defined here
/usr/bin/ld: app/dpdk-testpmd.p/test-pmd_icmpecho.c.o:(.bss+0x0): multiple definition of `testpmd_cl'; app/dpdk-testpmd.p/test-pmd_5tswap.c.o:(.bss+0x0): first defined here
/usr/bin/ld: app/dpdk-testpmd.p/test-pmd_icmpecho.c.o:(.bss+0x8): multiple definition of `testpmd_fd_copy'; app/dpdk-testpmd.p/test-pmd_5tswap.c.o:(.bss+0x8): first defined here
/usr/bin/ld: app/dpdk-testpmd.p/test-pmd_icmpecho.c.o:(.bss+0xc): multiple definition of `f_quit'; app/dpdk-testpmd.p/test-pmd_5tswap.c.o:(.bss+0xc): first defined here
/usr/bin/ld: app/dpdk-testpmd.p/test-pmd_ieee1588fwd.c.o:(.bss+0x0): multiple definition of `testpmd_cl'; app/dpdk-testpmd.p/test-pmd_5tswap.c.o:(.bss+0x0): first defined here
/usr/bin/ld: app/dpdk-testpmd.p/test-pmd_ieee1588fwd.c.o:(.bss+0x8): multiple definition of `testpmd_fd_copy'; app/dpdk-testpmd.p/test-pmd_5tswap.c.o:(.bss+0x8): first defined here
/usr/bin/ld: app/dpdk-testpmd.p/test-pmd_ieee1588fwd.c.o:(.bss+0xc): multiple definition of `f_quit'; app/dpdk-testpmd.p/test-pmd_5tswap.c.o:(.bss+0xc): first defined here
/usr/bin/ld: app/dpdk-testpmd.p/test-pmd_iofwd.c.o:(.bss+0x0): multiple definition of `testpmd_cl'; app/dpdk-testpmd.p/test-pmd_5tswap.c.o:(.bss+0x0): first defined here
/usr/bin/ld: app/dpdk-testpmd.p/test-pmd_iofwd.c.o:(.bss+0x8): multiple definition of `testpmd_fd_copy'; app/dpdk-testpmd.p/test-pmd_5tswap.c.o:(.bss+0x8): first defined here
/usr/bin/ld: app/dpdk-testpmd.p/test-pmd_iofwd.c.o:(.bss+0xc): multiple definition of `f_quit'; app/dpdk-testpmd.p/test-pmd_5tswap.c.o:(.bss+0xc): first defined here
/usr/bin/ld: app/dpdk-testpmd.p/test-pmd_macfwd.c.o:(.bss+0x0): multiple definition of `testpmd_cl'; app/dpdk-testpmd.p/test-pmd_5tswap.c.o:(.bss+0x0): first defined here
/usr/bin/ld: app/dpdk-testpmd.p/test-pmd_macfwd.c.o:(.bss+0x8): multiple definition of `testpmd_fd_copy'; app/dpdk-testpmd.p/test-pmd_5tswap.c.o:(.bss+0x8): first defined here
/usr/bin/ld: app/dpdk-testpmd.p/test-pmd_macfwd.c.o:(.bss+0xc): multiple definition of `f_quit'; app/dpdk-testpmd.p/test-pmd_5tswap.c.o:(.bss+0xc): first defined here
/usr/bin/ld: app/dpdk-testpmd.p/test-pmd_macswap.c.o:(.bss+0x0): multiple definition of `testpmd_cl'; app/dpdk-testpmd.p/test-pmd_5tswap.c.o:(.bss+0x0): first defined here
/usr/bin/ld: app/dpdk-testpmd.p/test-pmd_macswap.c.o:(.bss+0x8): multiple definition of `testpmd_fd_copy'; app/dpdk-testpmd.p/test-pmd_5tswap.c.o:(.bss+0x8): first defined here
/usr/bin/ld: app/dpdk-testpmd.p/test-pmd_macswap.c.o:(.bss+0xc): multiple definition of `f_quit'; app/dpdk-testpmd.p/test-pmd_5tswap.c.o:(.bss+0xc): first defined here
/usr/bin/ld: app/dpdk-testpmd.p/test-pmd_noisy_vnf.c.o:(.bss+0x100): multiple definition of `testpmd_cl'; app/dpdk-testpmd.p/test-pmd_5tswap.c.o:(.bss+0x0): first defined here
/usr/bin/ld: app/dpdk-testpmd.p/test-pmd_noisy_vnf.c.o:(.bss+0x108): multiple definition of `testpmd_fd_copy'; app/dpdk-testpmd.p/test-pmd_5tswap.c.o:(.bss+0x8): first defined here
/usr/bin/ld: app/dpdk-testpmd.p/test-pmd_noisy_vnf.c.o:(.bss+0x10c): multiple definition of `f_quit'; app/dpdk-testpmd.p/test-pmd_5tswap.c.o:(.bss+0xc): first defined here
/usr/bin/ld: app/dpdk-testpmd.p/test-pmd_parameters.c.o:(.bss+0x0): multiple definition of `testpmd_cl'; app/dpdk-testpmd.p/test-pmd_5tswap.c.o:(.bss+0x0): first defined here
/usr/bin/ld: app/dpdk-testpmd.p/test-pmd_parameters.c.o:(.bss+0x8): multiple definition of `testpmd_fd_copy'; app/dpdk-testpmd.p/test-pmd_5tswap.c.o:(.bss+0x8): first defined here
/usr/bin/ld: app/dpdk-testpmd.p/test-pmd_parameters.c.o:(.bss+0xc): multiple definition of `f_quit'; app/dpdk-testpmd.p/test-pmd_5tswap.c.o:(.bss+0xc): first defined here
/usr/bin/ld: app/dpdk-testpmd.p/test-pmd_rxonly.c.o:(.bss+0x0): multiple definition of `testpmd_cl'; app/dpdk-testpmd.p/test-pmd_5tswap.c.o:(.bss+0x0): first defined here
/usr/bin/ld: app/dpdk-testpmd.p/test-pmd_rxonly.c.o:(.bss+0x8): multiple definition of `testpmd_fd_copy'; app/dpdk-testpmd.p/test-pmd_5tswap.c.o:(.bss+0x8): first defined here
/usr/bin/ld: app/dpdk-testpmd.p/test-pmd_rxonly.c.o:(.bss+0xc): multiple definition of `f_quit'; app/dpdk-testpmd.p/test-pmd_5tswap.c.o:(.bss+0xc): first defined here
/usr/bin/ld: app/dpdk-testpmd.p/test-pmd_testpmd.c.o:(.bss+0x2978): multiple definition of `f_quit'; app/dpdk-testpmd.p/test-pmd_5tswap.c.o:(.bss+0xc): first defined here
/usr/bin/ld: app/dpdk-testpmd.p/test-pmd_testpmd.c.o:(.data+0x644): multiple definition of `testpmd_fd_copy'; app/dpdk-testpmd.p/test-pmd_5tswap.c.o:(.bss+0x8): first defined here
/usr/bin/ld: app/dpdk-testpmd.p/test-pmd_testpmd.c.o:(.bss+0x2970): multiple definition of `testpmd_cl'; app/dpdk-testpmd.p/test-pmd_5tswap.c.o:(.bss+0x0): first defined here
/usr/bin/ld: app/dpdk-testpmd.p/test-pmd_txonly.c.o:(.bss+0x0): multiple definition of `testpmd_cl'; app/dpdk-testpmd.p/test-pmd_5tswap.c.o:(.bss+0x0): first defined here
/usr/bin/ld: app/dpdk-testpmd.p/test-pmd_txonly.c.o:(.bss+0x8): multiple definition of `testpmd_fd_copy'; app/dpdk-testpmd.p/test-pmd_5tswap.c.o:(.bss+0x8): first defined here
/usr/bin/ld: app/dpdk-testpmd.p/test-pmd_txonly.c.o:(.bss+0xc): multiple definition of `f_quit'; app/dpdk-testpmd.p/test-pmd_5tswap.c.o:(.bss+0xc): first defined here
/usr/bin/ld: app/dpdk-testpmd.p/test-pmd_util.c.o:(.bss+0x0): multiple definition of `testpmd_cl'; app/dpdk-testpmd.p/test-pmd_5tswap.c.o:(.bss+0x0): first defined here
/usr/bin/ld: app/dpdk-testpmd.p/test-pmd_util.c.o:(.bss+0x8): multiple definition of `testpmd_fd_copy'; app/dpdk-testpmd.p/test-pmd_5tswap.c.o:(.bss+0x8): first defined here
/usr/bin/ld: app/dpdk-testpmd.p/test-pmd_util.c.o:(.bss+0xc): multiple definition of `f_quit'; app/dpdk-testpmd.p/test-pmd_5tswap.c.o:(.bss+0xc): first defined here
/usr/bin/ld: app/dpdk-testpmd.p/test-pmd_bpf_cmd.c.o:(.bss+0x0): multiple definition of `testpmd_cl'; app/dpdk-testpmd.p/test-pmd_5tswap.c.o:(.bss+0x0): first defined here
/usr/bin/ld: app/dpdk-testpmd.p/test-pmd_bpf_cmd.c.o:(.bss+0x8): multiple definition of `testpmd_fd_copy'; app/dpdk-testpmd.p/test-pmd_5tswap.c.o:(.bss+0x8): first defined here
/usr/bin/ld: app/dpdk-testpmd.p/test-pmd_bpf_cmd.c.o:(.bss+0xc): multiple definition of `f_quit'; app/dpdk-testpmd.p/test-pmd_5tswap.c.o:(.bss+0xc): first defined here
collect2: error: ld returned 1 exit status
[2756/2811] Linking target examples/dpdk-vmdq
[2757/2811] Linking target examples/dpdk-bbdev_app
[2758/2811] Linking target app/dpdk-test-regex
[2759/2811] Linking target app/dpdk-test-pipeline
[2760/2811] Linking target app/dpdk-test-sad
[2761/2811] Linking target app/test/dpdk-test
[2762/2811] Linking target examples/dpdk-bond
[2763/2811] Linking target examples/dpdk-cmdline
[2764/2811] Linking target examples/dpdk-ethtool
ninja: build stopped




*Build Failed #4:
OS: UB2010-64
Target: x86_64-native-linuxapp-gcc
FAILED: app/dpdk-testpmd 
gcc  -o app/dpdk-testpmd 'app/a172ced@@dpdk-testpmd@exe/test-pmd_5tswap.c.o' 'app/a172ced@@dpdk-testpmd@exe/test-pmd_cmdline.c.o' 'app/a172ced@@dpdk-testpmd@exe/test-pmd_cmdline_flow.c.o' 'app/a172ced@@dpdk-testpmd@exe/test-pmd_cmdline_mtr.c.o' 'app/a172ced@@dpdk-testpmd@exe/test-pmd_cmdline_tm.c.o' 'app/a172ced@@dpdk-testpmd@exe/test-pmd_config.c.o' 'app/a172ced@@dpdk-testpmd@exe/test-pmd_csumonly.c.o' 'app/a172ced@@dpdk-testpmd@exe/test-pmd_flowgen.c.o' 'app/a172ced@@dpdk-testpmd@exe/test-pmd_icmpecho.c.o' 'app/a172ced@@dpdk-testpmd@exe/test-pmd_ieee1588fwd.c.o' 'app/a172ced@@dpdk-testpmd@exe/test-pmd_iofwd.c.o' 'app/a172ced@@dpdk-testpmd@exe/test-pmd_macfwd.c.o' 'app/a172ced@@dpdk-testpmd@exe/test-pmd_macswap.c.o' 'app/a172ced@@dpdk-testpmd@exe/test-pmd_noisy_vnf.c.o' 'app/a172ced@@dpdk-testpmd@exe/test-pmd_parameters.c.o' 'app/a172ced@@dpdk-testpmd@exe/test-pmd_rxonly.c.o' 'app/a172ced@@dpdk-testpmd@exe/test-pmd_testpmd.c.o' 'app/a172ced@@dpdk-testpmd@exe/test-pmd_txonly.c.o' 'app/a172ced@@dpdk-testpmd@exe/test-pmd_util.c.o' 'app/a172ced@@dpdk-testpmd@exe/test-pmd_bpf_cmd.c.o' -Wl,--as-needed -Wl,--no-undefined -Wl,-O1 -Wl,--whole-archive -Wl,--start-group lib/librte_node.a lib/librte_graph.a lib/librte_bpf.a lib/librte_flow_classify.a lib/librte_pipeline.a lib/librte_table.a lib/librte_port.a lib/librte_fib.a lib/librte_ipsec.a lib/librte_vhost.a lib/librte_stack.a lib/librte_security.a lib/librte_sched.a lib/librte_reorder.a lib/librte_rib.a lib/librte_regexdev.a lib/librte_rawdev.a lib/librte_pdump.a lib/librte_power.a lib/librte_member.a lib/librte_lpm.a lib/librte_latencystats.a lib/librte_kni.a lib/librte_jobstats.a lib/librte_ip_frag.a lib/librte_gso.a lib/librte_gro.a lib/librte_eventdev.a lib/librte_efd.a lib/librte_distributor.a lib/librte_cryptodev.a lib/librte_compressdev.a lib/librte_cfgfile.a lib/librte_bitratestats.a lib/librte_bbdev.a lib/librte_acl.a lib/librte_timer.a lib/librte_hash.a lib/librte_metrics.a lib/librte_cmdline.a lib/librte_pci.a lib/librte_ethdev.a lib/librte_meter.a lib/librte_net.a lib/librte_mbuf.a lib/librte_mempool.a lib/librte_rcu.a lib/librte_ring.a lib/librte_eal.a lib/librte_telemetry.a lib/librte_kvargs.a drivers/librte_common_cpt.a drivers/librte_common_dpaax.a drivers/librte_common_iavf.a drivers/librte_common_octeontx.a drivers/librte_common_octeontx2.a drivers/librte_common_sfc_efx.a drivers/librte_bus_dpaa.a drivers/librte_bus_fslmc.a drivers/librte_bus_ifpga.a drivers/librte_bus_pci.a drivers/librte_bus_vdev.a drivers/librte_bus_vmbus.a drivers/librte_common_qat.a drivers/librte_mempool_bucket.a drivers/librte_mempool_dpaa.a drivers/librte_mempool_dpaa2.a drivers/librte_mempool_octeontx.a drivers/librte_mempool_octeontx2.a drivers/librte_mempool_ring.a drivers/librte_mempool_stack.a drivers/librte_net_af_packet.a drivers/librte_net_ark.a drivers/librte_net_atlantic.a drivers/librte_net_avp.a drivers/librte_net_axgbe.a drivers/librte_net_bond.a drivers/librte_net_bnx2x.a drivers/librte_net_bnxt.a drivers/librte_net_cxgbe.a drivers/librte_net_dpaa.a drivers/librte_net_dpaa2.a drivers/librte_net_e1000.a drivers/librte_net_ena.a drivers/librte_net_enetc.a drivers/librte_net_enic.a drivers/librte_net_failsafe.a drivers/librte_net_fm10k.a drivers/librte_net_i40e.a drivers/librte_net_hinic.a drivers/librte_net_hns3.a drivers/librte_net_iavf.a drivers/librte_net_ice.a drivers/librte_net_igc.a drivers/librte_net_ionic.a drivers/librte_net_ipn3ke.a drivers/librte_net_ixgbe.a drivers/librte_net_kni.a drivers/librte_net_liquidio.a drivers/librte_net_memif.a drivers/librte_net_netvsc.a drivers/librte_net_nfp.a drivers/librte_net_null.a drivers/librte_net_octeontx.a drivers/librte_net_octeontx2.a drivers/librte_net_pcap.a drivers/librte_net_pfe.a drivers/librte_net_qede.a drivers/librte_net_ring.a drivers/librte_net_sfc.a drivers/librte_net_softnic.a drivers/librte_net_tap.a drivers/librte_net_thunderx.a drivers/librte_net_txgbe.a drivers/librte_net_vdev_netvsc.a drivers/librte_net_vhost.a drivers/librte_net_virtio.a drivers/librte_net_vmxnet3.a drivers/librte_raw_dpaa2_cmdif.a drivers/librte_raw_dpaa2_qdma.a drivers/librte_raw_ifpga.a drivers/librte_raw_ioat.a drivers/librte_raw_ntb.a drivers/librte_raw_octeontx2_dma.a drivers/librte_raw_octeontx2_ep.a drivers/librte_raw_skeleton.a drivers/librte_crypto_aesni_gcm.a drivers/librte_crypto_aesni_mb.a drivers/librte_crypto_bcmfs.a drivers/librte_crypto_caam_jr.a drivers/librte_crypto_ccp.a drivers/librte_crypto_dpaa_sec.a drivers/librte_crypto_dpaa2_sec.a drivers/librte_crypto_kasumi.a drivers/librte_crypto_nitrox.a drivers/librte_crypto_null.a drivers/librte_crypto_octeontx.a drivers/librte_crypto_octeontx2.a drivers/librte_crypto_openssl.a drivers/librte_crypto_scheduler.a drivers/librte_crypto_snow3g.a drivers/librte_crypto_virtio.a drivers/librte_crypto_zuc.a drivers/librte_compress_octeontx.a drivers/librte_compress_zlib.a drivers/librte_regex_octeontx2.a drivers/librte_vdpa_ifc.a drivers/librte_event_dlb.a drivers/librte_event_dlb2.a drivers/librte_event_dpaa.a drivers/librte_event_dpaa2.a drivers/librte_event_octeontx2.a drivers/librte_event_opdl.a drivers/librte_event_skeleton.a drivers/librte_event_sw.a drivers/librte_event_dsw.a drivers/librte_event_octeontx.a drivers/librte_baseband_null.a drivers/librte_baseband_turbo_sw.a drivers/librte_baseband_fpga_lte_fec.a drivers/librte_baseband_fpga_5gnr_fec.a drivers/librte_baseband_acc100.a -Wl,--no-whole-archive -Wl,--no-as-needed -pthread -lm -ldl -lnuma -lfdt -Wl,--export-dynamic /usr/lib/x86_64-linux-gnu/libelf.so /usr/lib/x86_64-linux-gnu/libpcap.so /usr/lib/x86_64-linux-gnu/libcrypto.so /usr/lib/x86_64-linux-gnu/libz.so /usr/lib/gcc/x86_64-linux-gnu/10/../../../x86_64-linux-gnu/librt.so -lIPSec_MB -lIPSec_MB -lIPSec_MB -lIPSec_MB -lIPSec_MB -Wl,--end-group -Wl,-rpath,XXXXXXXXXXXXXXXXXXXXXXXXXXXXX
/usr/bin/ld: app/a172ced@@dpdk-testpmd@exe/test-pmd_cmdline.c.o:(.bss+0x0): multiple definition of `testpmd_cl'; app/a172ced@@dpdk-testpmd@exe/test-pmd_5tswap.c.o:(.bss+0x0): first defined here
/usr/bin/ld: app/a172ced@@dpdk-testpmd@exe/test-pmd_cmdline.c.o:(.bss+0xc): multiple definition of `f_quit'; app/a172ced@@dpdk-testpmd@exe/test-pmd_5tswap.c.o:(.bss+0xc): first defined here
/usr/bin/ld: app/a172ced@@dpdk-testpmd@exe/test-pmd_cmdline.c.o:(.bss+0x8): multiple definition of `testpmd_fd_copy'; app/a172ced@@dpdk-testpmd@exe/test-pmd_5tswap.c.o:(.bss+0x8): first defined here
/usr/bin/ld: app/a172ced@@dpdk-testpmd@exe/test-pmd_cmdline_flow.c.o:(.bss+0x4320): multiple definition of `testpmd_cl'; app/a172ced@@dpdk-testpmd@exe/test-pmd_5tswap.c.o:(.bss+0x0): first defined here
/usr/bin/ld: app/a172ced@@dpdk-testpmd@exe/test-pmd_cmdline_flow.c.o:(.bss+0x4328): multiple definition of `testpmd_fd_copy'; app/a172ced@@dpdk-testpmd@exe/test-pmd_5tswap.c.o:(.bss+0x8): first defined here
/usr/bin/ld: app/a172ced@@dpdk-testpmd@exe/test-pmd_cmdline_flow.c.o:(.bss+0x432c): multiple definition of `f_quit'; app/a172ced@@dpdk-testpmd@exe/test-pmd_5tswap.c.o:(.bss+0xc): first defined here
/usr/bin/ld: app/a172ced@@dpdk-testpmd@exe/test-pmd_cmdline_mtr.c.o:(.bss+0x0): multiple definition of `testpmd_cl'; app/a172ced@@dpdk-testpmd@exe/test-pmd_5tswap.c.o:(.bss+0x0): first defined here
/usr/bin/ld: app/a172ced@@dpdk-testpmd@exe/test-pmd_cmdline_mtr.c.o:(.bss+0x8): multiple definition of `testpmd_fd_copy'; app/a172ced@@dpdk-testpmd@exe/test-pmd_5tswap.c.o:(.bss+0x8): first defined here
/usr/bin/ld: app/a172ced@@dpdk-testpmd@exe/test-pmd_cmdline_mtr.c.o:(.bss+0xc): multiple definition of `f_quit'; app/a172ced@@dpdk-testpmd@exe/test-pmd_5tswap.c.o:(.bss+0xc): first defined here
/usr/bin/ld: app/a172ced@@dpdk-testpmd@exe/test-pmd_cmdline_tm.c.o:(.bss+0x0): multiple definition of `testpmd_cl'; app/a172ced@@dpdk-testpmd@exe/test-pmd_5tswap.c.o:(.bss+0x0): first defined here
/usr/bin/ld: app/a172ced@@dpdk-testpmd@exe/test-pmd_cmdline_tm.c.o:(.bss+0x8): multiple definition of `testpmd_fd_copy'; app/a172ced@@dpdk-testpmd@exe/test-pmd_5tswap.c.o:(.bss+0x8): first defined here
/usr/bin/ld: app/a172ced@@dpdk-testpmd@exe/test-pmd_cmdline_tm.c.o:(.bss+0xc): multiple definition of `f_quit'; app/a172ced@@dpdk-testpmd@exe/test-pmd_5tswap.c.o:(.bss+0xc): first defined here
/usr/bin/ld: app/a172ced@@dpdk-testpmd@exe/test-pmd_config.c.o:(.bss+0x0): multiple definition of `testpmd_cl'; app/a172ced@@dpdk-testpmd@exe/test-pmd_5tswap.c.o:(.bss+0x0): first defined here
/usr/bin/ld: app/a172ced@@dpdk-testpmd@exe/test-pmd_config.c.o:(.bss+0x8): multiple definition of `testpmd_fd_copy'; app/a172ced@@dpdk-testpmd@exe/test-pmd_5tswap.c.o:(.bss+0x8): first defined here
/usr/bin/ld: app/a172ced@@dpdk-testpmd@exe/test-pmd_config.c.o:(.bss+0xc): multiple definition of `f_quit'; app/a172ced@@dpdk-testpmd@exe/test-pmd_5tswap.c.o:(.bss+0xc): first defined here
/usr/bin/ld: app/a172ced@@dpdk-testpmd@exe/test-pmd_csumonly.c.o:(.bss+0x0): multiple definition of `testpmd_cl'; app/a172ced@@dpdk-testpmd@exe/test-pmd_5tswap.c.o:(.bss+0x0): first defined here
/usr/bin/ld: app/a172ced@@dpdk-testpmd@exe/test-pmd_csumonly.c.o:(.bss+0x8): multiple definition of `testpmd_fd_copy'; app/a172ced@@dpdk-testpmd@exe/test-pmd_5tswap.c.o:(.bss+0x8): first defined here
/usr/bin/ld: app/a172ced@@dpdk-testpmd@exe/test-pmd_csumonly.c.o:(.bss+0xc): multiple definition of `f_quit'; app/a172ced@@dpdk-testpmd@exe/test-pmd_5tswap.c.o:(.bss+0xc): first defined here
/usr/bin/ld: app/a172ced@@dpdk-testpmd@exe/test-pmd_flowgen.c.o:(.bss+0x0): multiple definition of `testpmd_cl'; app/a172ced@@dpdk-testpmd@exe/test-pmd_5tswap.c.o:(.bss+0x0): first defined here
/usr/bin/ld: app/a172ced@@dpdk-testpmd@exe/test-pmd_flowgen.c.o:(.bss+0x8): multiple definition of `testpmd_fd_copy'; app/a172ced@@dpdk-testpmd@exe/test-pmd_5tswap.c.o:(.bss+0x8): first defined here
/usr/bin/ld: app/a172ced@@dpdk-testpmd@exe/test-pmd_flowgen.c.o:(.bss+0xc): multiple definition of `f_quit'; app/a172ced@@dpdk-testpmd@exe/test-pmd_5tswap.c.o:(.bss+0xc): first defined here
/usr/bin/ld: app/a172ced@@dpdk-testpmd@exe/test-pmd_icmpecho.c.o:(.bss+0x0): multiple definition of `testpmd_cl'; app/a172ced@@dpdk-testpmd@exe/test-pmd_5tswap.c.o:(.bss+0x0): first defined here
/usr/bin/ld: app/a172ced@@dpdk-testpmd@exe/test-pmd_icmpecho.c.o:(.bss+0x8): multiple definition of `testpmd_fd_copy'; app/a172ced@@dpdk-testpmd@exe/test-pmd_5tswap.c.o:(.bss+0x8): first defined here
/usr/bin/ld: app/a172ced@@dpdk-testpmd@exe/test-pmd_icmpecho.c.o:(.bss+0xc): multiple definition of `f_quit'; app/a172ced@@dpdk-testpmd@exe/test-pmd_5tswap.c.o:(.bss+0xc): first defined here
/usr/bin/ld: app/a172ced@@dpdk-testpmd@exe/test-pmd_ieee1588fwd.c.o:(.bss+0x0): multiple definition of `testpmd_cl'; app/a172ced@@dpdk-testpmd@exe/test-pmd_5tswap.c.o:(.bss+0x0): first defined here
/usr/bin/ld: app/a172ced@@dpdk-testpmd@exe/test-pmd_ieee1588fwd.c.o:(.bss+0x8): multiple definition of `testpmd_fd_copy'; app/a172ced@@dpdk-testpmd@exe/test-pmd_5tswap.c.o:(.bss+0x8): first defined here
/usr/bin/ld: app/a172ced@@dpdk-testpmd@exe/test-pmd_ieee1588fwd.c.o:(.bss+0xc): multiple definition of `f_quit'; app/a172ced@@dpdk-testpmd@exe/test-pmd_5tswap.c.o:(.bss+0xc): first defined here
/usr/bin/ld: app/a172ced@@dpdk-testpmd@exe/test-pmd_iofwd.c.o:(.bss+0x0): multiple definition of `testpmd_cl'; app/a172ced@@dpdk-testpmd@exe/test-pmd_5tswap.c.o:(.bss+0x0): first defined here
/usr/bin/ld: app/a172ced@@dpdk-testpmd@exe/test-pmd_iofwd.c.o:(.bss+0x8): multiple definition of `testpmd_fd_copy'; app/a172ced@@dpdk-testpmd@exe/test-pmd_5tswap.c.o:(.bss+0x8): first defined here
/usr/bin/ld: app/a172ced@@dpdk-testpmd@exe/test-pmd_iofwd.c.o:(.bss+0xc): multiple definition of `f_quit'; app/a172ced@@dpdk-testpmd@exe/test-pmd_5tswap.c.o:(.bss+0xc): first defined here
/usr/bin/ld: app/a172ced@@dpdk-testpmd@exe/test-pmd_macfwd.c.o:(.bss+0x0): multiple definition of `testpmd_cl'; app/a172ced@@dpdk-testpmd@exe/test-pmd_5tswap.c.o:(.bss+0x0): first defined here
/usr/bin/ld: app/a172ced@@dpdk-testpmd@exe/test-pmd_macfwd.c.o:(.bss+0x8): multiple definition of `testpmd_fd_copy'; app/a172ced@@dpdk-testpmd@exe/test-pmd_5tswap.c.o:(.bss+0x8): first defined here
/usr/bin/ld: app/a172ced@@dpdk-testpmd@exe/test-pmd_macfwd.c.o:(.bss+0xc): multiple definition of `f_quit'; app/a172ced@@dpdk-testpmd@exe/test-pmd_5tswap.c.o:(.bss+0xc): first defined here
/usr/bin/ld: app/a172ced@@dpdk-testpmd@exe/test-pmd_macswap.c.o:(.bss+0x0): multiple definition of `testpmd_cl'; app/a172ced@@dpdk-testpmd@exe/test-pmd_5tswap.c.o:(.bss+0x0): first defined here
/usr/bin/ld: app/a172ced@@dpdk-testpmd@exe/test-pmd_macswap.c.o:(.bss+0x8): multiple definition of `testpmd_fd_copy'; app/a172ced@@dpdk-testpmd@exe/test-pmd_5tswap.c.o:(.bss+0x8): first defined here
/usr/bin/ld: app/a172ced@@dpdk-testpmd@exe/test-pmd_macswap.c.o:(.bss+0xc): multiple definition of `f_quit'; app/a172ced@@dpdk-testpmd@exe/test-pmd_5tswap.c.o:(.bss+0xc): first defined here
/usr/bin/ld: app/a172ced@@dpdk-testpmd@exe/test-pmd_noisy_vnf.c.o:(.bss+0x100): multiple definition of `testpmd_cl'; app/a172ced@@dpdk-testpmd@exe/test-pmd_5tswap.c.o:(.bss+0x0): first defined here
/usr/bin/ld: app/a172ced@@dpdk-testpmd@exe/test-pmd_noisy_vnf.c.o:(.bss+0x108): multiple definition of `testpmd_fd_copy'; app/a172ced@@dpdk-testpmd@exe/test-pmd_5tswap.c.o:(.bss+0x8): first defined here
/usr/bin/ld: app/a172ced@@dpdk-testpmd@exe/test-pmd_noisy_vnf.c.o:(.bss+0x10c): multiple definition of `f_quit'; app/a172ced@@dpdk-testpmd@exe/test-pmd_5tswap.c.o:(.bss+0xc): first defined here
/usr/bin/ld: app/a172ced@@dpdk-testpmd@exe/test-pmd_parameters.c.o:(.bss+0x0): multiple definition of `testpmd_cl'; app/a172ced@@dpdk-testpmd@exe/test-pmd_5tswap.c.o:(.bss+0x0): first defined here
/usr/bin/ld: app/a172ced@@dpdk-testpmd@exe/test-pmd_parameters.c.o:(.bss+0x8): multiple definition of `testpmd_fd_copy'; app/a172ced@@dpdk-testpmd@exe/test-pmd_5tswap.c.o:(.bss+0x8): first defined here
/usr/bin/ld: app/a172ced@@dpdk-testpmd@exe/test-pmd_parameters.c.o:(.bss+0xc): multiple definition of `f_quit'; app/a172ced@@dpdk-testpmd@exe/test-pmd_5tswap.c.o:(.bss+0xc): first defined here
/usr/bin/ld: app/a172ced@@dpdk-testpmd@exe/test-pmd_rxonly.c.o:(.bss+0x0): multiple definition of `testpmd_cl'; app/a172ced@@dpdk-testpmd@exe/test-pmd_5tswap.c.o:(.bss+0x0): first defined here
/usr/bin/ld: app/a172ced@@dpdk-testpmd@exe/test-pmd_rxonly.c.o:(.bss+0x8): multiple definition of `testpmd_fd_copy'; app/a172ced@@dpdk-testpmd@exe/test-pmd_5tswap.c.o:(.bss+0x8): first defined here
/usr/bin/ld: app/a172ced@@dpdk-testpmd@exe/test-pmd_rxonly.c.o:(.bss+0xc): multiple definition of `f_quit'; app/a172ced@@dpdk-testpmd@exe/test-pmd_5tswap.c.o:(.bss+0xc): first defined here
/usr/bin/ld: app/a172ced@@dpdk-testpmd@exe/test-pmd_testpmd.c.o:(.bss+0x2978): multiple definition of `f_quit'; app/a172ced@@dpdk-testpmd@exe/test-pmd_5tswap.c.o:(.bss+0xc): first defined here
/usr/bin/ld: app/a172ced@@dpdk-testpmd@exe/test-pmd_testpmd.c.o:(.data+0x644): multiple definition of `testpmd_fd_copy'; app/a172ced@@dpdk-testpmd@exe/test-pmd_5tswap.c.o:(.bss+0x8): first defined here
/usr/bin/ld: app/a172ced@@dpdk-testpmd@exe/test-pmd_testpmd.c.o:(.bss+0x2970): multiple definition of `testpmd_cl'; app/a172ced@@dpdk-testpmd@exe/test-pmd_5tswap.c.o:(.bss+0x0): first defined here
/usr/bin/ld: app/a172ced@@dpdk-testpmd@exe/test-pmd_txonly.c.o:(.bss+0x0): multiple definition of `testpmd_cl'; app/a172ced@@dpdk-testpmd@exe/test-pmd_5tswap.c.o:(.bss+0x0): first defined here
/usr/bin/ld: app/a172ced@@dpdk-testpmd@exe/test-pmd_txonly.c.o:(.bss+0x8): multiple definition of `testpmd_fd_copy'; app/a172ced@@dpdk-testpmd@exe/test-pmd_5tswap.c.o:(.bss+0x8): first defined here
/usr/bin/ld: app/a172ced@@dpdk-testpmd@exe/test-pmd_txonly.c.o:(.bss+0xc): multiple definition of `f_quit'; app/a172ced@@dpdk-testpmd@exe/test-pmd_5tswap.c.o:(.bss+0xc): first defined here
/usr/bin/ld: app/a172ced@@dpdk-testpmd@exe/test-pmd_util.c.o:(.bss+0x0): multiple definition of `testpmd_cl'; app/a172ced@@dpdk-testpmd@exe/test-pmd_5tswap.c.o:(.bss+0x0): first defined here
/usr/bin/ld: app/a172ced@@dpdk-testpmd@exe/test-pmd_util.c.o:(.bss+0x8): multiple definition of `testpmd_fd_copy'; app/a172ced@@dpdk-testpmd@exe/test-pmd_5tswap.c.o:(.bss+0x8): first defined here
/usr/bin/ld: app/a172ced@@dpdk-testpmd@exe/test-pmd_util.c.o:(.bss+0xc): multiple definition of `f_quit'; app/a172ced@@dpdk-testpmd@exe/test-pmd_5tswap.c.o:(.bss+0xc): first defined here
/usr/bin/ld: app/a172ced@@dpdk-testpmd@exe/test-pmd_bpf_cmd.c.o:(.bss+0x0): multiple definition of `testpmd_cl'; app/a172ced@@dpdk-testpmd@exe/test-pmd_5tswap.c.o:(.bss+0x0): first defined here
/usr/bin/ld: app/a172ced@@dpdk-testpmd@exe/test-pmd_bpf_cmd.c.o:(.bss+0x8): multiple definition of `testpmd_fd_copy'; app/a172ced@@dpdk-testpmd@exe/test-pmd_5tswap.c.o:(.bss+0x8): first defined here
/usr/bin/ld: app/a172ced@@dpdk-testpmd@exe/test-pmd_bpf_cmd.c.o:(.bss+0xc): multiple definition of `f_quit'; app/a172ced@@dpdk-testpmd@exe/test-pmd_5tswap.c.o:(.bss+0xc): first defined here
collect2: error: ld returned 1 exit status
[2760/2814] Linking target app/dpdk-test-sad.
[2761/2814] Linking target app/test/dpdk-test.
[2762/2814] Linking target examples/dpdk-bbdev_app.
[2763/2814] Linking target examples/dpdk-cmdline.
[2764/2814] Linking target app/dpdk-test-pipeline.
[2765/2814] Linking target app/dpdk-test-regex.
[2766/2814] Linking target examples/dpdk-bond.
[2767/2814] Linking target examples/dpdk-distributor.
[2768/2814] Linking target examples/dpdk-eventdev_pipeline.
ninja: build stopped


DPDK STV team

^ permalink raw reply	[flat|nested] only message in thread

only message in thread, other threads:[~2021-01-20 16:30 UTC | newest]

Thread overview: (only message) (download: mbox.gz / follow: Atom feed)
-- links below jump to the message on this page --
2021-01-20 16:30 [dpdk-test-report] |FAILURE| pw(86988) [RFC, V2] app/testpmd: support multi-process sys_stv

automatic DPDK test reports

This inbox may be cloned and mirrored by anyone:

	git clone --mirror https://inbox.dpdk.org/test-report/0 test-report/git/0.git

	# If you have public-inbox 1.1+ installed, you may
	# initialize and index your mirror using the following commands:
	public-inbox-init -V2 test-report test-report/ https://inbox.dpdk.org/test-report \
		test-report@dpdk.org
	public-inbox-index test-report

Example config snippet for mirrors.
Newsgroup available over NNTP:
	nntp://inbox.dpdk.org/inbox.dpdk.test-report


AGPL code for this site: git clone https://public-inbox.org/public-inbox.git