automatic DPDK test reports
 help / color / mirror / Atom feed
* [dpdk-test-report] |FAILURE| pw71231[1/5] net/i40e: add private APIs
@ 2020-06-12  6:54 sys_stv
  0 siblings, 0 replies; only message in thread
From: sys_stv @ 2020-06-12  6:54 UTC (permalink / raw)
  To: test-report

[-- Attachment #1: Type: text/plain, Size: 82886 bytes --]

Test-Label: Intel-compilation
Test-Status: FAILURE
http://dpdk.org/patch/71231

_Compilation issues_

Submitter: Chenxu Di <chenxux.di@intel.com>
Date: 2020-06-11 06:01:38
Reply_mail: 20200611060142.75465-2-chenxux.di@intel.com
DPDK git baseline: Repo:dpdk-next-net, CommitID: 08ad28c22618cfb3de378292bc9fe5060c5e5c0a

Makefile build Summary: 23 Builds Done, 0 Successful, 23 Failures

Meson build Summary: 9 Builds Done, 2 Successful, 7 Failures

               +==============================================+===========+==========+
               |                   Makefile                   |   Meson   | Document |
+----------------+------+-------+------+------------+-----------+-----------+----------+
| os             | gcc  | clang | icc  | gcc+shared | gcc+debug | gcc/clang | pdf/html |
+----------------+------+-------+------+------------+-----------+-----------+----------+
| RHEL80-64      | FAIL |       |      |            |           |           |          |
| UB2004-64      | FAIL | FAIL  | FAIL |            |           | FAIL      |          |
| UB1804-64      | FAIL | FAIL  | FAIL |            |           | FAIL      | pass     |
| FC32-64        | FAIL | FAIL  |      |            |           |           |          |
| CENTOS77-64    | FAIL |       |      |            |           |           |          |
| WIN10-64       |      |       |      |            |           | pass      |          |
| CENTOS80-64    | FAIL | FAIL  | FAIL | FAIL       | FAIL      | FAIL      |          |
| FC31-64        |      |       |      |            |           | FAIL      |          |
| UB1804-32      | FAIL |       |      |            |           | FAIL      |          |
| FreeBSD1201-64 | FAIL | FAIL  |      | FAIL       | FAIL      | FAIL      |          |
| RHEL77-64      | FAIL |       |      |            |           |           |          |
| SUSE15-64      | FAIL | FAIL  |      |            |           | FAIL      |          |
+----------------+------+-------+------+------------+-----------+-----------+----------+

Test environment and configuration as below:

** Makefile build **


OS: UB2004-64
	Kernel Version: 5.4.0-26-generic
	CPU info: Intel(R) Xeon(R) Platinum 8180 CPU @ 2.50GHz
	GCC Version: gcc (Ubuntu 9.3.0-10ubuntu2) 9.3.0
	Clang Version: 10.0.0-4ubuntu1
	x86_64-native-linuxapp-clang
	x86_64-native-linuxapp-gcc
	x86_64-native-linuxapp-icc


OS: UB1804-64
	Kernel Version: 4.15.0-20-generic
	CPU info: Intel(R) Xeon(R) CPU E5-2699 v3 @ 2.30GHz
	GCC Version: gcc (Ubuntu 7.3.0-16ubuntu3) 7.3.0
	Clang Version: 6.0.0-1ubuntu2 (tags/RELEASE_600/final)
	x86_64-native-linuxapp-clang
	x86_64-native-linuxapp-gcc
	x86_64-native-linuxapp-icc


OS: FC32-64
	Kernel Version: 5.6.0-0.rc7.git0.2.fc32.x86_64
	CPU info: Intel(R) Xeon(R) CPU E5-2699 v4 @ 2.20GHz
	GCC Version: gcc (GCC) 10.0.1 20200311 (Red Hat 10.0.1-0.9)
	Clang Version: 10.0.0 (Fedora 10.0.0-0.3.rc4.fc32)
	x86_64-native-linuxapp-clang
	x86_64-native-linuxapp-gcc


OS: CENTOS77-64
	Kernel Version: 3.10.0-1062.9.1.el7.x86_64
	CPU info: Intel(R) Xeon(R) Platinum 8280M CPU @ 2.70GHz
	GCC Version: gcc (GCC) 4.8.5 20150623 (Red Hat 4.8.5-39)
	Clang Version: 3.4.2 (tags/RELEASE_34/dot2-final)
	x86_64-native-linuxapp-gcc


OS: CENTOS80-64
	Kernel Version: 4.18.0-80.11.2.el8_0.x86_64
	CPU info: Intel(R) Xeon(R) CPU E5-2699 v3 @ 2.30GHz
	GCC Version: gcc (GCC) 8.2.1 20180905 (Red Hat 8.2.1-3)
	Clang Version: 7.0.1 (tags/RELEASE_701/final)
	x86_64-native-linuxapp-clang
	x86_64-native-linuxapp-gcc
	x86_64-native-linuxapp-gcc+debug
	x86_64-native-linuxapp-gcc+shared
	x86_64-native-linuxapp-icc


OS: UB1804-32
	Kernel Version: 4.15.0-20-generic
	CPU info: Intel(R) Xeon(R) Platinum 8180 CPU @ 2.50GHz
	GCC Version: gcc (Ubuntu 7.5.0-3ubuntu1~18.04) 7.5.0
	Clang Version: 6.0.0-1ubuntu2 (tags/RELEASE_600/final)
	i686-native-linuxapp-gcc


OS: RHEL80-64
	Kernel Version: 4.18.0-80.el8.x86_64
	CPU info: Intel(R) Xeon(R) Platinum 8280M CPU @ 2.70GHz
	GCC Version: gcc (GCC) 8.2.1 20180905 (Red Hat 8.2.1-3)
	Clang Version: 6.0.1 (tags/RELEASE_601/final)
	x86_64-native-linuxapp-gcc


OS: FreeBSD1201-64
	Kernel Version: 12.1-RELEASE
	CPU info: Intel(R) Xeon(R) CPU E5-2699 v3 @ 2.30GHz (2294.74-MHz K8-class CPU)
	GCC Version: gcc (FreeBSD Ports Collection) 9.2.0
	Clang Version: 8.0.1 (tags/RELEASE_801/final 366581) (based on LLVM 8.0.1)
	x86_64-native-bsdapp-clang
	x86_64-native-bsdapp-gcc+debug
	x86_64-native-bsdapp-gcc+shared
	x86_64-native-bsdapp-gcc


OS: RHEL77-64
	Kernel Version: 3.10.0-1062.9.1.el7.x86_64
	CPU info: Intel(R) Xeon(R) CPU E5-2699 v3 @ 2.30GHz
	GCC Version: gcc (GCC) 4.8.5 20150623 (Red Hat 4.8.5-39)
	Clang Version: 3.4.2 (tags/RELEASE_34/dot2-final)
	x86_64-native-linuxapp-gcc


OS: SUSE15-64
	Kernel Version: 4.12.14-lp150.11-default
	CPU info: Intel(R) Xeon(R) CPU E5-2699 v4 @ 2.20GHz
	GCC Version: gcc (SUSE Linux) 7.3.1 20180323 [gcc-7-branch revision 258812]
	Clang Version: 5.0.1 (tags/RELEASE_501/final 312548)
	x86_64-native-linuxapp-clang
	x86_64-native-linuxapp-gcc


** Meson build **


OS: UB2004-64
	Kernel Version: 5.4.0-26-generic
	CPU info: Intel(R) Xeon(R) CPU E5-2699 v4 @ 2.20GHz
	GCC Version: gcc (Ubuntu 9.3.0-10ubuntu2) 9.3.0
	Clang Version: 10.0.0-4ubuntu1
	./build-gcc-static
	./build-gcc-shared
	./build-clang-static
	./build-clang-shared
	./build-x86-default


OS: UB1804-64
	Kernel Version: 4.15.0-20-generic
	CPU info: Intel(R) Xeon(R) Platinum 8180 CPU @ 2.50GHz
	GCC Version: gcc (Ubuntu 7.3.0-16ubuntu3) 7.3.0
	Clang Version: 6.0.0-1ubuntu2 (tags/RELEASE_600/final)
	x86_64-native-linuxapp-doc
	./build-gcc-static
	./build-gcc-shared
	./build-clang-static
	./build-clang-shared
	./build-x86-default


OS: WIN10-64
	Kernel Version: N/A
	CPU info: N/A
	GCC Version: N/A
	Clang Version: Clang 8.0.0
	x86_64-windows-clang


OS: CENTOS80-64
	Kernel Version: 4.18.0-147.8.1.el8_1.x86_64
	CPU info: Intel(R) Xeon(R) CPU E5-2699 v4 @ 2.20GHz
	GCC Version: gcc (GCC) 8.3.1 20190507 (Red Hat 8.3.1-4)
	Clang Version: 8.0.1 (Red Hat 8.0.1-1.module_el8.1.0+215+a01033fb)
	./build-gcc-static
	./build-gcc-shared
	./build-clang-static
	./build-clang-shared
	./build-x86-default


OS: FC31-64
	Kernel Version: 5.4.18-200.fc31.x86_64
	CPU info: Intel(R) Xeon(R) Platinum 8180 CPU @ 2.50GHz
	GCC Version: gcc (GCC) 9.2.1 20190827 (Red Hat 9.2.1-1)
	Clang Version: 9.0.0 (Fedora 9.0.0-1.fc31)
	./build-gcc-static
	./build-gcc-shared
	./build-clang-static
	./build-clang-shared
	./build-x86-default


OS: UB1804-32
	Kernel Version: 4.15.0-20-generic
	CPU info: Intel(R) Xeon(R) CPU E5-2699 v4 @ 2.20GHz
	GCC Version: gcc (Ubuntu 7.5.0-3ubuntu1~18.04) 7.5.0
	Clang Version: 6.0.0-1ubuntu2 (tags/RELEASE_600/final)
	./build-gcc-static
	./build-gcc-shared
	./build-clang-static
	./build-clang-shared
	./build-x86-default


OS: FreeBSD1201-64
	Kernel Version: 12.1-RELEASE
	CPU info: Intel(R) Xeon(R) CPU E5-2699 v4 @ 2.20GHz (2194.97-MHz K8-class CPU)
	GCC Version: gcc (FreeBSD Ports Collection) 9.2.0
	Clang Version: 8.0.1 (tags/RELEASE_801/final 366581) (based on LLVM 8.0.1)
	./build-gcc-static
	./build-gcc-shared
	./build-clang-static
	./build-clang-shared
	./build-x86-default


OS: SUSE15-64
	Kernel Version: 4.12.14-lp150.12.82-default
	CPU info: Intel(R) Xeon(R) CPU E5-2699 v4 @ 2.20GHz
	GCC Version: gcc (SUSE Linux) 7.4.1 20190905 [gcc-7-branch revision 275407]
	Clang Version: 5.0.1 (tags/RELEASE_501/final 312548)
	./build-gcc-static
	./build-gcc-shared
	./build-clang-static
	./build-clang-shared
	./build-x86-default


*Make Build Failed #1:
OS: CENTOS77-64
Target: x86_64-native-linuxapp-gcc
but is listed in version map
Please add __rte_experimental to the definition of rte_pmd_i40e_set_gre_key_len
  CC nfp_resource.o
make[6]: *** [rte_pmd_i40e.o] Error 1
make[5]: *** [i40e] Error 2
make[5]: *** Waiting for unfinished jobs....
  CC nfp_crc.o
  CC bnxt_flow.o
--
  CC ecore_spq.o
  CC otx2_flow.o
  CC ecore_init_ops.o
make[6]: *** [rte_pmd_ixgbe.o] Error 1
make[5]: *** [ixgbe] Error 2
  CC rte_pmd_bnxt.o
  CC otx2_link.o
  CC bnxt_rxtx_vec_sse.o
--
  INSTALL-LIB librte_pmd_bnxt.a
  AR librte_pmd_qede.a
  INSTALL-LIB librte_pmd_qede.a
make[4]: *** [net] Error 2
make[3]: *** [drivers] Error 2
make[2]: *** [all] Error 2
make[1]: *** [pre_install] Error 2
make: *** [install] Error 2


*Make Build Failed #2:
OS: CENTOS80-64
Target: x86_64-native-linuxapp-clang
rte_pmd_i40e_set_gre_key_len is not flagged as experimental
but is listed in version map
Please add __rte_experimental to the definition of rte_pmd_i40e_set_gre_key_len
make[6]: *** [/root/CENTOS80-64_K4.18.0_Clang7.0.1/x86_64-native-linuxapp-clang/c3f231f2a66b4fc68f893bf3ca90630b/dpdk/mk/internal/rte.compile-pre.mk:114: rte_pmd_i40e.o] Error 1
make[5]: *** [/root/CENTOS80-64_K4.18.0_Clang7.0.1/x86_64-native-linuxapp-clang/c3f231f2a66b4fc68f893bf3ca90630b/dpdk/mk/rte.subdir.mk:35: i40e] Error 2
make[5]: *** Waiting for unfinished jobs....
  CC nfp_nsp.o
  CC ixgbe_fdir.o
--
  CC nfp_net.o.pmd.o
  LD nfp_net.o
  CC fm10k_pf.o
make[6]: *** [/root/CENTOS80-64_K4.18.0_Clang7.0.1/x86_64-native-linuxapp-clang/c3f231f2a66b4fc68f893bf3ca90630b/dpdk/mk/internal/rte.compile-pre.mk:114: rte_pmd_ixgbe.o] Error 1
make[6]: *** Waiting for unfinished jobs....
  CC bnxt_rxr.o
  AR librte_pmd_nfp.a
--
  CC ecore_l2.o
  CC ecore_sp_commands.o
  CC fm10k_tlv.o
make[5]: *** [/root/CENTOS80-64_K4.18.0_Clang7.0.1/x86_64-native-linuxapp-clang/c3f231f2a66b4fc68f893bf3ca90630b/dpdk/mk/rte.subdir.mk:35: ixgbe] Error 2
  CC bnxt_txq.o
  CC ice_rxtx_vec_sse.o
  CC bnxt_txr.o
--
  AR librte_pmd_ice.a
  INSTALL-LIB librte_pmd_octeontx2.a
  INSTALL-LIB librte_pmd_ice.a
make[4]: *** [/root/CENTOS80-64_K4.18.0_Clang7.0.1/x86_64-native-linuxapp-clang/c3f231f2a66b4fc68f893bf3ca90630b/dpdk/mk/rte.subdir.mk:35: net] Error 2
make[3]: *** [/root/CENTOS80-64_K4.18.0_Clang7.0.1/x86_64-native-linuxapp-clang/c3f231f2a66b4fc68f893bf3ca90630b/dpdk/mk/rte.sdkbuild.mk:51: drivers] Error 2
make[2]: *** [/root/CENTOS80-64_K4.18.0_Clang7.0.1/x86_64-native-linuxapp-clang/c3f231f2a66b4fc68f893bf3ca90630b/dpdk/mk/rte.sdkroot.mk:99: all] Error 2
make[1]: *** [/root/CENTOS80-64_K4.18.0_Clang7.0.1/x86_64-native-linuxapp-clang/c3f231f2a66b4fc68f893bf3ca90630b/dpdk/mk/rte.sdkinstall.mk:61: pre_install] Error 2
make: *** [/root/CENTOS80-64_K4.18.0_Clang7.0.1/x86_64-native-linuxapp-clang/c3f231f2a66b4fc68f893bf3ca90630b/dpdk/mk/rte.sdkroot.mk:77: install] Error 2


*Make Build Failed #3:
OS: CENTOS80-64
Target: x86_64-native-linuxapp-gcc
but is listed in version map
Please add __rte_experimental to the definition of rte_pmd_i40e_set_gre_key_len
  CC ice_rxtx_vec_avx2.o
make[6]: *** [/root/CENTOS80-64_K4.18.0_GCC8.2.1/x86_64-native-linuxapp-gcc/c3f231f2a66b4fc68f893bf3ca90630b/dpdk/mk/internal/rte.compile-pre.mk:114: rte_pmd_i40e.o] Error 1
make[6]: *** Waiting for unfinished jobs....
  CC ice_generic_flow.o
  CC ice_dcf.o
--
  CC nfp_cpp_pcie_ops.o
  CC ice_dcf_ethdev.o
  AR librte_pmd_lio.a
make[5]: *** [/root/CENTOS80-64_K4.18.0_GCC8.2.1/x86_64-native-linuxapp-gcc/c3f231f2a66b4fc68f893bf3ca90630b/dpdk/mk/rte.subdir.mk:35: i40e] Error 2
make[5]: *** Waiting for unfinished jobs....
  INSTALL-LIB librte_pmd_lio.a
  CC nfp_mutex.o
--
  LD ixgbe_ethdev.o
  AR librte_pmd_nfp.a
  INSTALL-LIB librte_pmd_nfp.a
make[6]: *** [/root/CENTOS80-64_K4.18.0_GCC8.2.1/x86_64-native-linuxapp-gcc/c3f231f2a66b4fc68f893bf3ca90630b/dpdk/mk/internal/rte.compile-pre.mk:114: rte_pmd_ixgbe.o] Error 1
make[6]: *** Waiting for unfinished jobs....
make[5]: *** [/root/CENTOS80-64_K4.18.0_GCC8.2.1/x86_64-native-linuxapp-gcc/c3f231f2a66b4fc68f893bf3ca90630b/dpdk/mk/rte.subdir.mk:35: ixgbe] Error 2
make[4]: *** [/root/CENTOS80-64_K4.18.0_GCC8.2.1/x86_64-native-linuxapp-gcc/c3f231f2a66b4fc68f893bf3ca90630b/dpdk/mk/rte.subdir.mk:35: net] Error 2
make[3]: *** [/root/CENTOS80-64_K4.18.0_GCC8.2.1/x86_64-native-linuxapp-gcc/c3f231f2a66b4fc68f893bf3ca90630b/dpdk/mk/rte.sdkbuild.mk:51: drivers] Error 2
make[2]: *** [/root/CENTOS80-64_K4.18.0_GCC8.2.1/x86_64-native-linuxapp-gcc/c3f231f2a66b4fc68f893bf3ca90630b/dpdk/mk/rte.sdkroot.mk:99: all] Error 2
make[1]: *** [/root/CENTOS80-64_K4.18.0_GCC8.2.1/x86_64-native-linuxapp-gcc/c3f231f2a66b4fc68f893bf3ca90630b/dpdk/mk/rte.sdkinstall.mk:61: pre_install] Error 2
make: *** [/root/CENTOS80-64_K4.18.0_GCC8.2.1/x86_64-native-linuxapp-gcc/c3f231f2a66b4fc68f893bf3ca90630b/dpdk/mk/rte.sdkroot.mk:77: install] Error 2


*Make Build Failed #4:
OS: CENTOS80-64
Target: x86_64-native-linuxapp-gcc+debug
rte_pmd_i40e_set_gre_key_len is not flagged as experimental
but is listed in version map
Please add __rte_experimental to the definition of rte_pmd_i40e_set_gre_key_len
make[6]: *** [/root/CENTOS80-64_K4.18.0_GCC8.2.1/x86_64-native-linuxapp-gcc+debug/c3f231f2a66b4fc68f893bf3ca90630b/dpdk/mk/internal/rte.compile-pre.mk:114: rte_pmd_i40e.o] Error 1
make[6]: *** Waiting for unfinished jobs....
  CC bnxt_filter.o
  CC rte_eth_null.o
make[5]: *** [/root/CENTOS80-64_K4.18.0_GCC8.2.1/x86_64-native-linuxapp-gcc+debug/c3f231f2a66b4fc68f893bf3ca90630b/dpdk/mk/rte.subdir.mk:35: i40e] Error 2
make[5]: *** Waiting for unfinished jobs....
  CC hn_nvs.o
  CC bnxt_flow.o
--
Please add __rte_experimental to the definition of rte_pmd_ixgbe_get_fdir_stats
  CC tf_ulp/bnxt_ulp_flow.o
  CC tf_ulp/ulp_port_db.o
make[6]: *** [/root/CENTOS80-64_K4.18.0_GCC8.2.1/x86_64-native-linuxapp-gcc+debug/c3f231f2a66b4fc68f893bf3ca90630b/dpdk/mk/internal/rte.compile-pre.mk:114: rte_pmd_ixgbe.o] Error 1
make[5]: *** [/root/CENTOS80-64_K4.18.0_GCC8.2.1/x86_64-native-linuxapp-gcc+debug/c3f231f2a66b4fc68f893bf3ca90630b/dpdk/mk/rte.subdir.mk:35: ixgbe] Error 2
  AR librte_pmd_bnxt.a
  INSTALL-LIB librte_pmd_bnxt.a
make[4]: *** [/root/CENTOS80-64_K4.18.0_GCC8.2.1/x86_64-native-linuxapp-gcc+debug/c3f231f2a66b4fc68f893bf3ca90630b/dpdk/mk/rte.subdir.mk:35: net] Error 2
make[3]: *** [/root/CENTOS80-64_K4.18.0_GCC8.2.1/x86_64-native-linuxapp-gcc+debug/c3f231f2a66b4fc68f893bf3ca90630b/dpdk/mk/rte.sdkbuild.mk:51: drivers] Error 2
make[2]: *** [/root/CENTOS80-64_K4.18.0_GCC8.2.1/x86_64-native-linuxapp-gcc+debug/c3f231f2a66b4fc68f893bf3ca90630b/dpdk/mk/rte.sdkroot.mk:99: all] Error 2
make[1]: *** [/root/CENTOS80-64_K4.18.0_GCC8.2.1/x86_64-native-linuxapp-gcc+debug/c3f231f2a66b4fc68f893bf3ca90630b/dpdk/mk/rte.sdkinstall.mk:61: pre_install] Error 2
make: *** [/root/CENTOS80-64_K4.18.0_GCC8.2.1/x86_64-native-linuxapp-gcc+debug/c3f231f2a66b4fc68f893bf3ca90630b/dpdk/mk/rte.sdkroot.mk:77: install] Error 2


*Make Build Failed #5:
OS: CENTOS80-64
Target: x86_64-native-linuxapp-gcc+shared
  CC bnxt_flow.o
  CC ice_ethdev.o
  LD librte_pmd_netvsc.so.20.0.3
make[6]: *** [/root/CENTOS80-64_K4.18.0_GCC8.2.1/x86_64-native-linuxapp-gcc+shared/c3f231f2a66b4fc68f893bf3ca90630b/dpdk/mk/internal/rte.compile-pre.mk:114: rte_pmd_ixgbe.o] Error 1
make[6]: *** Waiting for unfinished jobs....
  CC octeontx_pkovf.o
  CC nfp_mip.o
make[5]: *** [/root/CENTOS80-64_K4.18.0_GCC8.2.1/x86_64-native-linuxapp-gcc+shared/c3f231f2a66b4fc68f893bf3ca90630b/dpdk/mk/rte.subdir.mk:35: ixgbe] Error 2
make[5]: *** Waiting for unfinished jobs....
  CC nfp_nffw.o
  PMDINFO octeontx_pkovf.o.pmd.c
--
  CC ice_switch_filter.o
  PMDINFO nfp_net.o.pmd.c
  CC nfp_net.o.pmd.o
make[6]: *** [/root/CENTOS80-64_K4.18.0_GCC8.2.1/x86_64-native-linuxapp-gcc+shared/c3f231f2a66b4fc68f893bf3ca90630b/dpdk/mk/internal/rte.compile-pre.mk:114: rte_pmd_i40e.o] Error 1
make[5]: *** [/root/CENTOS80-64_K4.18.0_GCC8.2.1/x86_64-native-linuxapp-gcc+shared/c3f231f2a66b4fc68f893bf3ca90630b/dpdk/mk/rte.subdir.mk:35: i40e] Error 2
  CC ice_fdir_filter.o
  LD nfp_net.o
  CC bnxt_stats.o
--
  LD librte_pmd_octeontx2.so.20.0.3
  INSTALL-LIB librte_pmd_bnxt.so.20.0.3
  INSTALL-LIB librte_pmd_octeontx2.so.20.0.3
make[4]: *** [/root/CENTOS80-64_K4.18.0_GCC8.2.1/x86_64-native-linuxapp-gcc+shared/c3f231f2a66b4fc68f893bf3ca90630b/dpdk/mk/rte.subdir.mk:35: net] Error 2
make[3]: *** [/root/CENTOS80-64_K4.18.0_GCC8.2.1/x86_64-native-linuxapp-gcc+shared/c3f231f2a66b4fc68f893bf3ca90630b/dpdk/mk/rte.sdkbuild.mk:51: drivers] Error 2
make[2]: *** [/root/CENTOS80-64_K4.18.0_GCC8.2.1/x86_64-native-linuxapp-gcc+shared/c3f231f2a66b4fc68f893bf3ca90630b/dpdk/mk/rte.sdkroot.mk:99: all] Error 2
make[1]: *** [/root/CENTOS80-64_K4.18.0_GCC8.2.1/x86_64-native-linuxapp-gcc+shared/c3f231f2a66b4fc68f893bf3ca90630b/dpdk/mk/rte.sdkinstall.mk:61: pre_install] Error 2
make: *** [/root/CENTOS80-64_K4.18.0_GCC8.2.1/x86_64-native-linuxapp-gcc+shared/c3f231f2a66b4fc68f893bf3ca90630b/dpdk/mk/rte.sdkroot.mk:77: install] Error 2


*Make Build Failed #6:
OS: CENTOS80-64
Target: x86_64-native-linuxapp-icc
but is listed in version map
Please add __rte_experimental to the definition of rte_pmd_i40e_set_gre_key_len
  CC i40e_rxtx_vec_avx2.o
make[6]: *** [/root/CENTOS80-64_K4.18.0_ICC19.0.0/x86_64-native-linuxapp-icc/c3f231f2a66b4fc68f893bf3ca90630b/dpdk/mk/internal/rte.compile-pre.mk:116: rte_pmd_i40e.o] Error 1
make[6]: *** Waiting for unfinished jobs....
== Build drivers/net/virtio
  CC bnxt_rxq.o
--
  CC rte_pmd_ixgbe.o
  CC bnxt_rxr.o
  CC nicvf_rxtx.o
make[5]: *** [/root/CENTOS80-64_K4.18.0_ICC19.0.0/x86_64-native-linuxapp-icc/c3f231f2a66b4fc68f893bf3ca90630b/dpdk/mk/rte.subdir.mk:37: i40e] Error 2
make[5]: *** Waiting for unfinished jobs....
  CC nicvf_hw.o
  CC vdev_netvsc.o
--
rte_pmd_ixgbe_get_fdir_stats is not flagged as experimental
but is listed in version map
Please add __rte_experimental to the definition of rte_pmd_ixgbe_get_fdir_stats
make[6]: *** [/root/CENTOS80-64_K4.18.0_ICC19.0.0/x86_64-native-linuxapp-icc/c3f231f2a66b4fc68f893bf3ca90630b/dpdk/mk/internal/rte.compile-pre.mk:114: rte_pmd_ixgbe.o] Error 1
make[5]: *** [/root/CENTOS80-64_K4.18.0_ICC19.0.0/x86_64-native-linuxapp-icc/c3f231f2a66b4fc68f893bf3ca90630b/dpdk/mk/rte.subdir.mk:37: ixgbe] Error 2
  CC otx2_rss.o
  CC ecore_sp_commands.o
  CC nicvf_mbox.o
--
  INSTALL-LIB librte_pmd_qede.a
  AR librte_pmd_octeontx2.a
  INSTALL-LIB librte_pmd_octeontx2.a
make[4]: *** [/root/CENTOS80-64_K4.18.0_ICC19.0.0/x86_64-native-linuxapp-icc/c3f231f2a66b4fc68f893bf3ca90630b/dpdk/mk/rte.subdir.mk:35: net] Error 2
make[3]: *** [/root/CENTOS80-64_K4.18.0_ICC19.0.0/x86_64-native-linuxapp-icc/c3f231f2a66b4fc68f893bf3ca90630b/dpdk/mk/rte.sdkbuild.mk:51: drivers] Error 2
make[2]: *** [/root/CENTOS80-64_K4.18.0_ICC19.0.0/x86_64-native-linuxapp-icc/c3f231f2a66b4fc68f893bf3ca90630b/dpdk/mk/rte.sdkroot.mk:99: all] Error 2
make[1]: *** [/root/CENTOS80-64_K4.18.0_ICC19.0.0/x86_64-native-linuxapp-icc/c3f231f2a66b4fc68f893bf3ca90630b/dpdk/mk/rte.sdkinstall.mk:61: pre_install] Error 2
make: *** [/root/CENTOS80-64_K4.18.0_ICC19.0.0/x86_64-native-linuxapp-icc/c3f231f2a66b4fc68f893bf3ca90630b/dpdk/mk/rte.sdkroot.mk:77: install] Error 2


*Make Build Failed #7:
OS: FC32-64
Target: x86_64-native-linuxapp-clang
but is listed in version map
Please add __rte_experimental to the definition of rte_pmd_i40e_set_gre_key_len
  CC ixgbe_ethdev.o
make[6]: *** [/root/FC32-64_K5.6.0_Clang10.0.0/x86_64-native-linuxapp-clang/c3f231f2a66b4fc68f893bf3ca90630b/dpdk/mk/internal/rte.compile-pre.mk:116: rte_pmd_i40e.o] Error 1
make[5]: *** [/root/FC32-64_K5.6.0_Clang10.0.0/x86_64-native-linuxapp-clang/c3f231f2a66b4fc68f893bf3ca90630b/dpdk/mk/rte.subdir.mk:35: i40e] Error 2
make[5]: *** Waiting for unfinished jobs....
  CC ecore_hw.o
  AR librte_pmd_netvsc.a
--
but is listed in version map
Please add __rte_experimental to the definition of rte_pmd_ixgbe_get_fdir_stats
  CC otx2_ethdev_irq.o
make[6]: *** [/root/FC32-64_K5.6.0_Clang10.0.0/x86_64-native-linuxapp-clang/c3f231f2a66b4fc68f893bf3ca90630b/dpdk/mk/internal/rte.compile-pre.mk:116: rte_pmd_ixgbe.o] Error 1
make[6]: *** Waiting for unfinished jobs....
  CC otx2_ethdev_ops.o
  CC otx2_ethdev_sec.o
  CC otx2_ethdev_debug.o
  CC otx2_ethdev_devargs.o
make[5]: *** [/root/FC32-64_K5.6.0_Clang10.0.0/x86_64-native-linuxapp-clang/c3f231f2a66b4fc68f893bf3ca90630b/dpdk/mk/rte.subdir.mk:35: ixgbe] Error 2
  PMDINFO otx2_ethdev.o.pmd.c
  CC otx2_ethdev.o.pmd.o
  LD otx2_ethdev.o
  AR librte_pmd_octeontx2.a
  INSTALL-LIB librte_pmd_octeontx2.a
make[4]: *** [/root/FC32-64_K5.6.0_Clang10.0.0/x86_64-native-linuxapp-clang/c3f231f2a66b4fc68f893bf3ca90630b/dpdk/mk/rte.subdir.mk:35: net] Error 2
make[3]: *** [/root/FC32-64_K5.6.0_Clang10.0.0/x86_64-native-linuxapp-clang/c3f231f2a66b4fc68f893bf3ca90630b/dpdk/mk/rte.sdkbuild.mk:51: drivers] Error 2
make[2]: *** [/root/FC32-64_K5.6.0_Clang10.0.0/x86_64-native-linuxapp-clang/c3f231f2a66b4fc68f893bf3ca90630b/dpdk/mk/rte.sdkroot.mk:99: all] Error 2
make[1]: *** [/root/FC32-64_K5.6.0_Clang10.0.0/x86_64-native-linuxapp-clang/c3f231f2a66b4fc68f893bf3ca90630b/dpdk/mk/rte.sdkinstall.mk:61: pre_install] Error 2
make: *** [/root/FC32-64_K5.6.0_Clang10.0.0/x86_64-native-linuxapp-clang/c3f231f2a66b4fc68f893bf3ca90630b/dpdk/mk/rte.sdkroot.mk:77: install] Error 2


*Make Build Failed #8:
OS: FC32-64
Target: x86_64-native-linuxapp-gcc
rte_pmd_i40e_set_gre_key_len is not flagged as experimental
but is listed in version map
Please add __rte_experimental to the definition of rte_pmd_i40e_set_gre_key_len
make[6]: *** [/root/FC32-64_K5.6.0_GCC10.0.1/x86_64-native-linuxapp-gcc/c3f231f2a66b4fc68f893bf3ca90630b/dpdk/mk/internal/rte.compile-pre.mk:116: rte_pmd_i40e.o] Error 1
make[5]: *** [/root/FC32-64_K5.6.0_GCC10.0.1/x86_64-native-linuxapp-gcc/c3f231f2a66b4fc68f893bf3ca90630b/dpdk/mk/rte.subdir.mk:37: i40e] Error 2
make[5]: *** Waiting for unfinished jobs....
  CC sfc_tx.o
  PMDINFO ice_ethdev.o.pmd.c
--
rte_pmd_ixgbe_get_fdir_stats is not flagged as experimental
but is listed in version map
Please add __rte_experimental to the definition of rte_pmd_ixgbe_get_fdir_stats
make[6]: *** [/root/FC32-64_K5.6.0_GCC10.0.1/x86_64-native-linuxapp-gcc/c3f231f2a66b4fc68f893bf3ca90630b/dpdk/mk/internal/rte.compile-pre.mk:116: rte_pmd_ixgbe.o] Error 1
make[5]: *** [/root/FC32-64_K5.6.0_GCC10.0.1/x86_64-native-linuxapp-gcc/c3f231f2a66b4fc68f893bf3ca90630b/dpdk/mk/rte.subdir.mk:35: ixgbe] Error 2
  CC sfc_dp.o
  CC sfc_ef10_rx.o
  CC bnxt_irq.o
--
  INSTALL-LIB librte_pmd_sfc_efx.a
  AR librte_pmd_octeontx2.a
  INSTALL-LIB librte_pmd_octeontx2.a
make[4]: *** [/root/FC32-64_K5.6.0_GCC10.0.1/x86_64-native-linuxapp-gcc/c3f231f2a66b4fc68f893bf3ca90630b/dpdk/mk/rte.subdir.mk:35: net] Error 2
make[3]: *** [/root/FC32-64_K5.6.0_GCC10.0.1/x86_64-native-linuxapp-gcc/c3f231f2a66b4fc68f893bf3ca90630b/dpdk/mk/rte.sdkbuild.mk:51: drivers] Error 2
make[2]: *** [/root/FC32-64_K5.6.0_GCC10.0.1/x86_64-native-linuxapp-gcc/c3f231f2a66b4fc68f893bf3ca90630b/dpdk/mk/rte.sdkroot.mk:99: all] Error 2
make[1]: *** [/root/FC32-64_K5.6.0_GCC10.0.1/x86_64-native-linuxapp-gcc/c3f231f2a66b4fc68f893bf3ca90630b/dpdk/mk/rte.sdkinstall.mk:61: pre_install] Error 2
make: *** [/root/FC32-64_K5.6.0_GCC10.0.1/x86_64-native-linuxapp-gcc/c3f231f2a66b4fc68f893bf3ca90630b/dpdk/mk/rte.sdkroot.mk:77: install] Error 2


*Make Build Failed #9:
OS: FreeBSD1201-64
Target: x86_64-native-bsdapp-clang
== Build drivers/common
awk -f /usr/src/sys/tools/makeobjops.awk /usr/src/sys/dev/pci/pci_if.m -h
Warning: Object directory not changed from original /root/FreeBSD1201-64_K12.1_Clang8.0.1/x86_64-native-bsdapp-clang/c3f231f2a66b4fc68f893bf3ca90630b/dpdk/x86_64-native-bsdapp-clang/build/kernel/freebsd/contigmem
cc  -Winline -Wall -Werror -include /root/FreeBSD1201-64_K12.1_Clang8.0.1/x86_64-native-bsdapp-clang/c3f231f2a66b4fc68f893bf3ca90630b/dpdk/x86_64-native-bsdapp-clang/include/rte_config.h  -Werror -D_KERNEL -DKLD_MODULE -nostdinc  -I/root/FreeBSD1201-64_K12.1_Clang8.0.1/x86_64-native-bsdapp-clang/c3f231f2a66b4fc68f893bf3ca90630b/dpdk/kernel/freebsd/contigmem -I/root/FreeBSD1201-64_K12.1_Clang8.0.1/x86_64-native-bsdapp-clang/c3f231f2a66b4fc68f893bf3ca90630b/dpdk/x86_64-native-bsdapp-clang/include -I. -I/usr/src/sys -I/usr/src/sys/contrib/ck/include -fno-common  -fno-omit-frame-pointer -mno-omit-leaf-frame-pointer -fdebug-prefix-map=./machine=/usr/src/sys/amd64/include -fdebug-prefix-map=./x86=/usr/src/sys/x86/include   -MD  -MF.depend.contigmem.o -MTcontigmem.o -mcmodel=kernel -mno-red-zone -mno-mmx -mno-sse -msoft-float  -fno-asynchronous-unwind-tables -ffreestanding -fwrapv -fstack-protector -Wall -Wredundant-decls -Wnested-externs -Wstrict-prototypes -Wmissing-prototypes -Wpointer-arith -Wcast-qual -Wundef -Wno-pointer-sign -D__printf__=__freebsd_kprintf__ -Wmissing-include-dirs -fdiagnostics-show-option -Wno-unknown-pragmas -Wno-error-tautological-compare -Wno-error-empty-body -Wno-error-parentheses-equality -Wno-error-unused-function -Wno-error-pointer-sign -Wno-error-shift-negative-value -Wno-address-of-packed-member  -mno-aes -mno-avx  -std=iso9899:1999 -c contigmem.c -o contigmem.o
Warning: Object directory not changed from original /root/FreeBSD1201-64_K12.1_Clang8.0.1/x86_64-native-bsdapp-clang/c3f231f2a66b4fc68f893bf3ca90630b/dpdk/x86_64-native-bsdapp-clang/build/kernel/freebsd/nic_uio
cc  -Winline -Wall -Werror -include /root/FreeBSD1201-64_K12.1_Clang8.0.1/x86_64-native-bsdapp-clang/c3f231f2a66b4fc68f893bf3ca90630b/dpdk/x86_64-native-bsdapp-clang/include/rte_config.h  -Werror -D_KERNEL -DKLD_MODULE -nostdinc  -I/root/FreeBSD1201-64_K12.1_Clang8.0.1/x86_64-native-bsdapp-clang/c3f231f2a66b4fc68f893bf3ca90630b/dpdk/kernel/freebsd/nic_uio -I/root/FreeBSD1201-64_K12.1_Clang8.0.1/x86_64-native-bsdapp-clang/c3f231f2a66b4fc68f893bf3ca90630b/dpdk/x86_64-native-bsdapp-clang/include -I. -I/usr/src/sys -I/usr/src/sys/contrib/ck/include -fno-common  -fno-omit-frame-pointer -mno-omit-leaf-frame-pointer -fdebug-prefix-map=./machine=/usr/src/sys/amd64/include -fdebug-prefix-map=./x86=/usr/src/sys/x86/include   -MD  -MF.depend.nic_uio.o -MTnic_uio.o -mcmodel=kernel -mno-red-zone -mno-mmx -mno-sse -msoft-float  -fno-asynchronous-unwind-tables -ffreestanding -fwrapv -fstack-protector -Wall -Wredundant-decls -Wnested-externs -Wstrict-prototypes -Wmissing-prototypes -Wpointer-arith -Wcast-qual -Wundef -Wno-pointer-sign -D__printf__=__freebsd_kprintf__ -Wmissing-include-dirs -fdiagnostics-show-option -Wno-unknown-pragmas -Wno-error-tautological-compare -Wno-error-empty-body -Wno-error-parentheses-equality -Wno-error-unused-function -Wno-error-pointer-sign -Wno-error-shift-negative-value -Wno-address-of-packed-member  -mno-aes -mno-avx  -std=iso9899:1999 -c nic_uio.c -o nic_uio.o
== Build drivers/common/cpt
== Build drivers/common/octeontx
== Build drivers/common/octeontx2
--
but is listed in version map
Please add __rte_experimental to the definition of rte_pmd_i40e_set_gre_key_len
  CC octeontx_ethdev.o
gmake[6]: *** [/root/FreeBSD1201-64_K12.1_Clang8.0.1/x86_64-native-bsdapp-clang/c3f231f2a66b4fc68f893bf3ca90630b/dpdk/mk/internal/rte.compile-pre.mk:116: rte_pmd_i40e.o] Error 1
gmake[6]: *** Waiting for unfinished jobs....
  CC ixgbe_rxtx.o
  CC octeontx_ethdev_ops.o
--
  LD octeontx_ethdev.o
  PMDINFO rte_eth_pcap.o.pmd.c
  CC rte_eth_pcap.o.pmd.o
gmake[5]: *** [/root/FreeBSD1201-64_K12.1_Clang8.0.1/x86_64-native-bsdapp-clang/c3f231f2a66b4fc68f893bf3ca90630b/dpdk/mk/rte.subdir.mk:35: i40e] Error 2
gmake[5]: *** Waiting for unfinished jobs....
  LD rte_eth_pcap.o
  CC bnxt_rxq.o
--
  CC tf_core/tf_msg.o
  CC otx2_ethdev.o
  CC otx2_flow_ctrl.o
gmake[6]: *** [/root/FreeBSD1201-64_K12.1_Clang8.0.1/x86_64-native-bsdapp-clang/c3f231f2a66b4fc68f893bf3ca90630b/dpdk/mk/internal/rte.compile-pre.mk:114: rte_pmd_ixgbe.o] Error 1
gmake[6]: *** Waiting for unfinished jobs....
  CC tf_core/stack.o
  CC tf_core/rand.o
--
  CC tf_core/tf_em.o
  CC otx2_ethdev_irq.o
  CC otx2_flow_utils.o
gmake[5]: *** [/root/FreeBSD1201-64_K12.1_Clang8.0.1/x86_64-native-bsdapp-clang/c3f231f2a66b4fc68f893bf3ca90630b/dpdk/mk/rte.subdir.mk:35: ixgbe] Error 2
  CC tf_core/tf_rm.o
  CC otx2_ethdev_ops.o
  CC otx2_ethdev_sec.o
--
  INSTALL-LIB librte_pmd_octeontx2.a
  AR librte_pmd_bnxt.a
  INSTALL-LIB librte_pmd_bnxt.a
gmake[4]: *** [/root/FreeBSD1201-64_K12.1_Clang8.0.1/x86_64-native-bsdapp-clang/c3f231f2a66b4fc68f893bf3ca90630b/dpdk/mk/rte.subdir.mk:35: net] Error 2
gmake[3]: *** [/root/FreeBSD1201-64_K12.1_Clang8.0.1/x86_64-native-bsdapp-clang/c3f231f2a66b4fc68f893bf3ca90630b/dpdk/mk/rte.sdkbuild.mk:51: drivers] Error 2
gmake[2]: *** [/root/FreeBSD1201-64_K12.1_Clang8.0.1/x86_64-native-bsdapp-clang/c3f231f2a66b4fc68f893bf3ca90630b/dpdk/mk/rte.sdkroot.mk:99: all] Error 2
gmake[1]: *** [/root/FreeBSD1201-64_K12.1_Clang8.0.1/x86_64-native-bsdapp-clang/c3f231f2a66b4fc68f893bf3ca90630b/dpdk/mk/rte.sdkinstall.mk:61: pre_install] Error 2
gmake: *** [/root/FreeBSD1201-64_K12.1_Clang8.0.1/x86_64-native-bsdapp-clang/c3f231f2a66b4fc68f893bf3ca90630b/dpdk/mk/rte.sdkroot.mk:77: install] Error 2


*Make Build Failed #10:
OS: FreeBSD1201-64
Target: x86_64-native-bsdapp-gcc+debug
awk -f /usr/src/sys/tools/makeobjops.awk /usr/src/sys/kern/bus_if.m -h
awk -f /usr/src/sys/tools/makeobjops.awk /usr/src/sys/dev/pci/pci_if.m -h
Warning: Object directory not changed from original /root/FreeBSD1201-64_K12.1_GCC7.3.0/x86_64-native-bsdapp-gcc+debug/c3f231f2a66b4fc68f893bf3ca90630b/dpdk/x86_64-native-bsdapp-gcc/build/kernel/freebsd/contigmem
cc  -Winline -Wall -Werror -include /root/FreeBSD1201-64_K12.1_GCC7.3.0/x86_64-native-bsdapp-gcc+debug/c3f231f2a66b4fc68f893bf3ca90630b/dpdk/x86_64-native-bsdapp-gcc/include/rte_config.h  -Werror -D_KERNEL -DKLD_MODULE -nostdinc  -I/root/FreeBSD1201-64_K12.1_GCC7.3.0/x86_64-native-bsdapp-gcc+debug/c3f231f2a66b4fc68f893bf3ca90630b/dpdk/kernel/freebsd/contigmem -I/root/FreeBSD1201-64_K12.1_GCC7.3.0/x86_64-native-bsdapp-gcc+debug/c3f231f2a66b4fc68f893bf3ca90630b/dpdk/x86_64-native-bsdapp-gcc/include -I. -I/usr/src/sys -I/usr/src/sys/contrib/ck/include -fno-common  -fno-omit-frame-pointer -mno-omit-leaf-frame-pointer -fdebug-prefix-map=./machine=/usr/src/sys/amd64/include -fdebug-prefix-map=./x86=/usr/src/sys/x86/include   -MD  -MF.depend.contigmem.o -MTcontigmem.o -mcmodel=kernel -mno-red-zone -mno-mmx -mno-sse -msoft-float  -fno-asynchronous-unwind-tables -ffreestanding -fwrapv -fstack-protector -Wall -Wredundant-decls -Wnested-externs -Wstrict-prototypes -Wmissing-prototypes -Wpointer-arith -Wcast-qual -Wundef -Wno-pointer-sign -D__printf__=__freebsd_kprintf__ -Wmissing-include-dirs -fdiagnostics-show-option -Wno-unknown-pragmas -Wno-error-tautological-compare -Wno-error-empty-body -Wno-error-parentheses-equality -Wno-error-unused-function -Wno-error-pointer-sign -Wno-error-shift-negative-value -Wno-address-of-packed-member  -mno-aes -mno-avx  -std=iso9899:1999 -c contigmem.c -o contigmem.o
Warning: Object directory not changed from original /root/FreeBSD1201-64_K12.1_GCC7.3.0/x86_64-native-bsdapp-gcc+debug/c3f231f2a66b4fc68f893bf3ca90630b/dpdk/x86_64-native-bsdapp-gcc/build/kernel/freebsd/nic_uio
cc  -Winline -Wall -Werror -include /root/FreeBSD1201-64_K12.1_GCC7.3.0/x86_64-native-bsdapp-gcc+debug/c3f231f2a66b4fc68f893bf3ca90630b/dpdk/x86_64-native-bsdapp-gcc/include/rte_config.h  -Werror -D_KERNEL -DKLD_MODULE -nostdinc  -I/root/FreeBSD1201-64_K12.1_GCC7.3.0/x86_64-native-bsdapp-gcc+debug/c3f231f2a66b4fc68f893bf3ca90630b/dpdk/kernel/freebsd/nic_uio -I/root/FreeBSD1201-64_K12.1_GCC7.3.0/x86_64-native-bsdapp-gcc+debug/c3f231f2a66b4fc68f893bf3ca90630b/dpdk/x86_64-native-bsdapp-gcc/include -I. -I/usr/src/sys -I/usr/src/sys/contrib/ck/include -fno-common  -fno-omit-frame-pointer -mno-omit-leaf-frame-pointer -fdebug-prefix-map=./machine=/usr/src/sys/amd64/include -fdebug-prefix-map=./x86=/usr/src/sys/x86/include   -MD  -MF.depend.nic_uio.o -MTnic_uio.o -mcmodel=kernel -mno-red-zone -mno-mmx -mno-sse -msoft-float  -fno-asynchronous-unwind-tables -ffreestanding -fwrapv -fstack-protector -Wall -Wredundant-decls -Wnested-externs -Wstrict-prototypes -Wmissing-prototypes -Wpointer-arith -Wcast-qual -Wundef -Wno-pointer-sign -D__printf__=__freebsd_kprintf__ -Wmissing-include-dirs -fdiagnostics-show-option -Wno-unknown-pragmas -Wno-error-tautological-compare -Wno-error-empty-body -Wno-error-parentheses-equality -Wno-error-unused-function -Wno-error-pointer-sign -Wno-error-shift-negative-value -Wno-address-of-packed-member  -mno-aes -mno-avx  -std=iso9899:1999 -c nic_uio.c -o nic_uio.o
== Build drivers/common
ld -m elf_x86_64_fbsd -L/root/FreeBSD1201-64_K12.1_GCC7.3.0/x86_64-native-bsdapp-gcc+debug/c3f231f2a66b4fc68f893bf3ca90630b/dpdk/x86_64-native-bsdapp-gcc/lib -d -warn-common --build-id=sha1 -r -d -o contigmem.ko contigmem.o
:> export_syms
--
  CC otx2_rx.o
  PMDINFO ice_ethdev.o.pmd.c
  CC ice_ethdev.o.pmd.o
gmake[6]: *** [/root/FreeBSD1201-64_K12.1_GCC7.3.0/x86_64-native-bsdapp-gcc+debug/c3f231f2a66b4fc68f893bf3ca90630b/dpdk/mk/internal/rte.compile-pre.mk:114: rte_pmd_i40e.o] Error 1
gmake[6]: *** Waiting for unfinished jobs....
  LD ice_ethdev.o
  CC ice_rxtx_vec_sse.o
  CC octeontx_rxtx.o
  CC ixgbe_dcb_82599.o
gmake[5]: *** [/root/FreeBSD1201-64_K12.1_GCC7.3.0/x86_64-native-bsdapp-gcc+debug/c3f231f2a66b4fc68f893bf3ca90630b/dpdk/mk/rte.subdir.mk:37: i40e] Error 2
gmake[5]: *** Waiting for unfinished jobs....
  CC bnxt_rxq.o
  CC ice_switch_filter.o
--
  CC otx2_mcast.o
  CC bcm_osal.o
  CC ecore_sriov.o
gmake[6]: *** [/root/FreeBSD1201-64_K12.1_GCC7.3.0/x86_64-native-bsdapp-gcc+debug/c3f231f2a66b4fc68f893bf3ca90630b/dpdk/mk/internal/rte.compile-pre.mk:114: rte_pmd_ixgbe.o] Error 1
gmake[6]: *** Waiting for unfinished jobs....
  CC ecore_vf.o
gmake[5]: *** [/root/FreeBSD1201-64_K12.1_GCC7.3.0/x86_64-native-bsdapp-gcc+debug/c3f231f2a66b4fc68f893bf3ca90630b/dpdk/mk/rte.subdir.mk:35: ixgbe] Error 2
  CC tf_core/tf_rm.o
  CC tf_core/tf_tbl.o
  CC otx2_lookup.o
--
  INSTALL-LIB librte_pmd_bnxt.a
  AR librte_pmd_octeontx2.a
  INSTALL-LIB librte_pmd_octeontx2.a
gmake[4]: *** [/root/FreeBSD1201-64_K12.1_GCC7.3.0/x86_64-native-bsdapp-gcc+debug/c3f231f2a66b4fc68f893bf3ca90630b/dpdk/mk/rte.subdir.mk:35: net] Error 2
gmake[3]: *** [/root/FreeBSD1201-64_K12.1_GCC7.3.0/x86_64-native-bsdapp-gcc+debug/c3f231f2a66b4fc68f893bf3ca90630b/dpdk/mk/rte.sdkbuild.mk:51: drivers] Error 2
gmake[2]: *** [/root/FreeBSD1201-64_K12.1_GCC7.3.0/x86_64-native-bsdapp-gcc+debug/c3f231f2a66b4fc68f893bf3ca90630b/dpdk/mk/rte.sdkroot.mk:99: all] Error 2
gmake[1]: *** [/root/FreeBSD1201-64_K12.1_GCC7.3.0/x86_64-native-bsdapp-gcc+debug/c3f231f2a66b4fc68f893bf3ca90630b/dpdk/mk/rte.sdkinstall.mk:61: pre_install] Error 2
gmake: *** [/root/FreeBSD1201-64_K12.1_GCC7.3.0/x86_64-native-bsdapp-gcc+debug/c3f231f2a66b4fc68f893bf3ca90630b/dpdk/mk/rte.sdkroot.mk:77: install] Error 2


*Make Build Failed #11:
OS: FreeBSD1201-64
Target: x86_64-native-bsdapp-gcc+shared
awk -f /usr/src/sys/tools/makeobjops.awk /usr/src/sys/kern/bus_if.m -h
Warning: Object directory not changed from original /root/FreeBSD1201-64_K12.1_GCC7.3.0/x86_64-native-bsdapp-gcc+shared/c3f231f2a66b4fc68f893bf3ca90630b/dpdk/x86_64-native-bsdapp-gcc/build/kernel/freebsd/contigmem
awk -f /usr/src/sys/tools/makeobjops.awk /usr/src/sys/dev/pci/pci_if.m -h
cc  -Winline -Wall -Werror -include /root/FreeBSD1201-64_K12.1_GCC7.3.0/x86_64-native-bsdapp-gcc+shared/c3f231f2a66b4fc68f893bf3ca90630b/dpdk/x86_64-native-bsdapp-gcc/include/rte_config.h  -Werror -D_KERNEL -DKLD_MODULE -nostdinc  -I/root/FreeBSD1201-64_K12.1_GCC7.3.0/x86_64-native-bsdapp-gcc+shared/c3f231f2a66b4fc68f893bf3ca90630b/dpdk/kernel/freebsd/contigmem -I/root/FreeBSD1201-64_K12.1_GCC7.3.0/x86_64-native-bsdapp-gcc+shared/c3f231f2a66b4fc68f893bf3ca90630b/dpdk/x86_64-native-bsdapp-gcc/include -I. -I/usr/src/sys -I/usr/src/sys/contrib/ck/include -fno-common  -fno-omit-frame-pointer -mno-omit-leaf-frame-pointer -fdebug-prefix-map=./machine=/usr/src/sys/amd64/include -fdebug-prefix-map=./x86=/usr/src/sys/x86/include   -MD  -MF.depend.contigmem.o -MTcontigmem.o -mcmodel=kernel -mno-red-zone -mno-mmx -mno-sse -msoft-float  -fno-asynchronous-unwind-tables -ffreestanding -fwrapv -fstack-protector -Wall -Wredundant-decls -Wnested-externs -Wstrict-prototypes -Wmissing-prototypes -Wpointer-arith -Wcast-qual -Wundef -Wno-pointer-sign -D__printf__=__freebsd_kprintf__ -Wmissing-include-dirs -fdiagnostics-show-option -Wno-unknown-pragmas -Wno-error-tautological-compare -Wno-error-empty-body -Wno-error-parentheses-equality -Wno-error-unused-function -Wno-error-pointer-sign -Wno-error-shift-negative-value -Wno-address-of-packed-member  -mno-aes -mno-avx  -std=iso9899:1999 -c contigmem.c -o contigmem.o
== Build drivers/common
Warning: Object directory not changed from original /root/FreeBSD1201-64_K12.1_GCC7.3.0/x86_64-native-bsdapp-gcc+shared/c3f231f2a66b4fc68f893bf3ca90630b/dpdk/x86_64-native-bsdapp-gcc/build/kernel/freebsd/nic_uio
cc  -Winline -Wall -Werror -include /root/FreeBSD1201-64_K12.1_GCC7.3.0/x86_64-native-bsdapp-gcc+shared/c3f231f2a66b4fc68f893bf3ca90630b/dpdk/x86_64-native-bsdapp-gcc/include/rte_config.h  -Werror -D_KERNEL -DKLD_MODULE -nostdinc  -I/root/FreeBSD1201-64_K12.1_GCC7.3.0/x86_64-native-bsdapp-gcc+shared/c3f231f2a66b4fc68f893bf3ca90630b/dpdk/kernel/freebsd/nic_uio -I/root/FreeBSD1201-64_K12.1_GCC7.3.0/x86_64-native-bsdapp-gcc+shared/c3f231f2a66b4fc68f893bf3ca90630b/dpdk/x86_64-native-bsdapp-gcc/include -I. -I/usr/src/sys -I/usr/src/sys/contrib/ck/include -fno-common  -fno-omit-frame-pointer -mno-omit-leaf-frame-pointer -fdebug-prefix-map=./machine=/usr/src/sys/amd64/include -fdebug-prefix-map=./x86=/usr/src/sys/x86/include   -MD  -MF.depend.nic_uio.o -MTnic_uio.o -mcmodel=kernel -mno-red-zone -mno-mmx -mno-sse -msoft-float  -fno-asynchronous-unwind-tables -ffreestanding -fwrapv -fstack-protector -Wall -Wredundant-decls -Wnested-externs -Wstrict-prototypes -Wmissing-prototypes -Wpointer-arith -Wcast-qual -Wundef -Wno-pointer-sign -D__printf__=__freebsd_kprintf__ -Wmissing-include-dirs -fdiagnostics-show-option -Wno-unknown-pragmas -Wno-error-tautological-compare -Wno-error-empty-body -Wno-error-parentheses-equality -Wno-error-unused-function -Wno-error-pointer-sign -Wno-error-shift-negative-value -Wno-address-of-packed-member  -mno-aes -mno-avx  -std=iso9899:1999 -c nic_uio.c -o nic_uio.o
ld -m elf_x86_64_fbsd -L/root/FreeBSD1201-64_K12.1_GCC7.3.0/x86_64-native-bsdapp-gcc+shared/c3f231f2a66b4fc68f893bf3ca90630b/dpdk/x86_64-native-bsdapp-gcc/lib -d -warn-common --build-id=sha1 -r -d -o contigmem.ko contigmem.o
:> export_syms
awk -f /usr/src/sys/conf/kmod_syms.awk contigmem.ko  export_syms | xargs -J% objcopy % contigmem.ko
--
Please add __rte_experimental to the definition of rte_pmd_i40e_set_gre_key_len
  CC otx2_mac.o
  CC ice_rxtx_vec_avx2.o
gmake[6]: *** [/root/FreeBSD1201-64_K12.1_GCC7.3.0/x86_64-native-bsdapp-gcc+shared/c3f231f2a66b4fc68f893bf3ca90630b/dpdk/mk/internal/rte.compile-pre.mk:116: rte_pmd_i40e.o] Error 1
gmake[6]: *** Waiting for unfinished jobs....
  CC tf_core/bitalloc.o
== Build drivers/net/virtio
--
  CC nicvf_rxtx.o
  CC otx2_ptp.o
  CC tf_core/tf_msg.o
gmake[5]: *** [/root/FreeBSD1201-64_K12.1_GCC7.3.0/x86_64-native-bsdapp-gcc+shared/c3f231f2a66b4fc68f893bf3ca90630b/dpdk/mk/rte.subdir.mk:37: i40e] Error 2
gmake[5]: *** Waiting for unfinished jobs....
  CC ice_generic_flow.o
  CC ecore_init_fw_funcs.o
--
  CC virtio_rxtx.o
  LD librte_pmd_thunderx_nicvf.so.20.0.3
  CC tf_core/tf_tbl.o
gmake[6]: *** [/root/FreeBSD1201-64_K12.1_GCC7.3.0/x86_64-native-bsdapp-gcc+shared/c3f231f2a66b4fc68f893bf3ca90630b/dpdk/mk/internal/rte.compile-pre.mk:114: rte_pmd_ixgbe.o] Error 1
gmake[5]: *** [/root/FreeBSD1201-64_K12.1_GCC7.3.0/x86_64-native-bsdapp-gcc+shared/c3f231f2a66b4fc68f893bf3ca90630b/dpdk/mk/rte.subdir.mk:37: ixgbe] Error 2
  INSTALL-LIB librte_pmd_thunderx_nicvf.so.20.0.3
  CC vmxnet3_ethdev.o
  CC ecore_dcbx.o
--
  CC medford2_nic.o
  LD librte_pmd_sfc_efx.so.20.0.3
  INSTALL-LIB librte_pmd_sfc_efx.so.20.0.3
gmake[4]: *** [/root/FreeBSD1201-64_K12.1_GCC7.3.0/x86_64-native-bsdapp-gcc+shared/c3f231f2a66b4fc68f893bf3ca90630b/dpdk/mk/rte.subdir.mk:35: net] Error 2
gmake[3]: *** [/root/FreeBSD1201-64_K12.1_GCC7.3.0/x86_64-native-bsdapp-gcc+shared/c3f231f2a66b4fc68f893bf3ca90630b/dpdk/mk/rte.sdkbuild.mk:51: drivers] Error 2
gmake[2]: *** [/root/FreeBSD1201-64_K12.1_GCC7.3.0/x86_64-native-bsdapp-gcc+shared/c3f231f2a66b4fc68f893bf3ca90630b/dpdk/mk/rte.sdkroot.mk:99: all] Error 2
gmake[1]: *** [/root/FreeBSD1201-64_K12.1_GCC7.3.0/x86_64-native-bsdapp-gcc+shared/c3f231f2a66b4fc68f893bf3ca90630b/dpdk/mk/rte.sdkinstall.mk:61: pre_install] Error 2
gmake: *** [/root/FreeBSD1201-64_K12.1_GCC7.3.0/x86_64-native-bsdapp-gcc+shared/c3f231f2a66b4fc68f893bf3ca90630b/dpdk/mk/rte.sdkroot.mk:77: install] Error 2


*Make Build Failed #12:
OS: FreeBSD1201-64
Target: x86_64-native-bsdapp-gcc
awk -f /usr/src/sys/tools/makeobjops.awk /usr/src/sys/kern/bus_if.m -h
awk -f /usr/src/sys/tools/makeobjops.awk /usr/src/sys/kern/bus_if.m -h
Warning: Object directory not changed from original /root/FreeBSD1201-64_K12.1_GCC9.2.0/x86_64-native-bsdapp-gcc/c3f231f2a66b4fc68f893bf3ca90630b/dpdk/x86_64-native-bsdapp-gcc/build/kernel/freebsd/contigmem
cc  -Winline -Wall -Werror -include /root/FreeBSD1201-64_K12.1_GCC9.2.0/x86_64-native-bsdapp-gcc/c3f231f2a66b4fc68f893bf3ca90630b/dpdk/x86_64-native-bsdapp-gcc/include/rte_config.h  -Werror -D_KERNEL -DKLD_MODULE -nostdinc  -I/root/FreeBSD1201-64_K12.1_GCC9.2.0/x86_64-native-bsdapp-gcc/c3f231f2a66b4fc68f893bf3ca90630b/dpdk/kernel/freebsd/contigmem -I/root/FreeBSD1201-64_K12.1_GCC9.2.0/x86_64-native-bsdapp-gcc/c3f231f2a66b4fc68f893bf3ca90630b/dpdk/x86_64-native-bsdapp-gcc/include -I. -I/usr/src/sys -I/usr/src/sys/contrib/ck/include -fno-common  -fno-omit-frame-pointer -mno-omit-leaf-frame-pointer -fdebug-prefix-map=./machine=/usr/src/sys/amd64/include -fdebug-prefix-map=./x86=/usr/src/sys/x86/include   -MD  -MF.depend.contigmem.o -MTcontigmem.o -mcmodel=kernel -mno-red-zone -mno-mmx -mno-sse -msoft-float  -fno-asynchronous-unwind-tables -ffreestanding -fwrapv -fstack-protector -Wall -Wredundant-decls -Wnested-externs -Wstrict-prototypes -Wmissing-prototypes -Wpointer-arith -Wcast-qual -Wundef -Wno-pointer-sign -D__printf__=__freebsd_kprintf__ -Wmissing-include-dirs -fdiagnostics-show-option -Wno-unknown-pragmas -Wno-error-tautological-compare -Wno-error-empty-body -Wno-error-parentheses-equality -Wno-error-unused-function -Wno-error-pointer-sign -Wno-error-shift-negative-value -Wno-address-of-packed-member  -mno-aes -mno-avx  -std=iso9899:1999 -c contigmem.c -o contigmem.o
awk -f /usr/src/sys/tools/makeobjops.awk /usr/src/sys/dev/pci/pci_if.m -h
Warning: Object directory not changed from original /root/FreeBSD1201-64_K12.1_GCC9.2.0/x86_64-native-bsdapp-gcc/c3f231f2a66b4fc68f893bf3ca90630b/dpdk/x86_64-native-bsdapp-gcc/build/kernel/freebsd/nic_uio
cc  -Winline -Wall -Werror -include /root/FreeBSD1201-64_K12.1_GCC9.2.0/x86_64-native-bsdapp-gcc/c3f231f2a66b4fc68f893bf3ca90630b/dpdk/x86_64-native-bsdapp-gcc/include/rte_config.h  -Werror -D_KERNEL -DKLD_MODULE -nostdinc  -I/root/FreeBSD1201-64_K12.1_GCC9.2.0/x86_64-native-bsdapp-gcc/c3f231f2a66b4fc68f893bf3ca90630b/dpdk/kernel/freebsd/nic_uio -I/root/FreeBSD1201-64_K12.1_GCC9.2.0/x86_64-native-bsdapp-gcc/c3f231f2a66b4fc68f893bf3ca90630b/dpdk/x86_64-native-bsdapp-gcc/include -I. -I/usr/src/sys -I/usr/src/sys/contrib/ck/include -fno-common  -fno-omit-frame-pointer -mno-omit-leaf-frame-pointer -fdebug-prefix-map=./machine=/usr/src/sys/amd64/include -fdebug-prefix-map=./x86=/usr/src/sys/x86/include   -MD  -MF.depend.nic_uio.o -MTnic_uio.o -mcmodel=kernel -mno-red-zone -mno-mmx -mno-sse -msoft-float  -fno-asynchronous-unwind-tables -ffreestanding -fwrapv -fstack-protector -Wall -Wredundant-decls -Wnested-externs -Wstrict-prototypes -Wmissing-prototypes -Wpointer-arith -Wcast-qual -Wundef -Wno-pointer-sign -D__printf__=__freebsd_kprintf__ -Wmissing-include-dirs -fdiagnostics-show-option -Wno-unknown-pragmas -Wno-error-tautological-compare -Wno-error-empty-body -Wno-error-parentheses-equality -Wno-error-unused-function -Wno-error-pointer-sign -Wno-error-shift-negative-value -Wno-address-of-packed-member  -mno-aes -mno-avx  -std=iso9899:1999 -c nic_uio.c -o nic_uio.o
== Build drivers/common
ld -m elf_x86_64_fbsd -L/root/FreeBSD1201-64_K12.1_GCC9.2.0/x86_64-native-bsdapp-gcc/c3f231f2a66b4fc68f893bf3ca90630b/dpdk/x86_64-native-bsdapp-gcc/lib -d -warn-common --build-id=sha1 -r -d -o contigmem.ko contigmem.o
:> export_syms
--
Please add __rte_experimental to the definition of rte_pmd_i40e_set_gre_key_len
  CC octeontx_pkivf.o
  CC ice_fdir_filter.o
gmake[6]: *** [/root/FreeBSD1201-64_K12.1_GCC9.2.0/x86_64-native-bsdapp-gcc/c3f231f2a66b4fc68f893bf3ca90630b/dpdk/mk/internal/rte.compile-pre.mk:114: rte_pmd_i40e.o] Error 1
gmake[5]: *** [/root/FreeBSD1201-64_K12.1_GCC9.2.0/x86_64-native-bsdapp-gcc/c3f231f2a66b4fc68f893bf3ca90630b/dpdk/mk/rte.subdir.mk:35: i40e] Error 2
gmake[5]: *** Waiting for unfinished jobs....
  PMDINFO rte_eth_pcap.o.pmd.c
  CC rte_eth_pcap.o.pmd.o
--
  CC bcm_osal.o
  CC otx2_ethdev_ops.o
  CC tf_core/tf_rm.o
gmake[6]: *** [/root/FreeBSD1201-64_K12.1_GCC9.2.0/x86_64-native-bsdapp-gcc/c3f231f2a66b4fc68f893bf3ca90630b/dpdk/mk/internal/rte.compile-pre.mk:114: rte_pmd_ixgbe.o] Error 1
gmake[5]: *** [/root/FreeBSD1201-64_K12.1_GCC9.2.0/x86_64-native-bsdapp-gcc/c3f231f2a66b4fc68f893bf3ca90630b/dpdk/mk/rte.subdir.mk:35: ixgbe] Error 2
  CC ecore_sriov.o
  CC ecore_vf.o
  CC otx2_ethdev_sec.o
--
  INSTALL-LIB librte_pmd_qede.a
  AR librte_pmd_bnxt.a
  INSTALL-LIB librte_pmd_bnxt.a
gmake[4]: *** [/root/FreeBSD1201-64_K12.1_GCC9.2.0/x86_64-native-bsdapp-gcc/c3f231f2a66b4fc68f893bf3ca90630b/dpdk/mk/rte.subdir.mk:35: net] Error 2
gmake[3]: *** [/root/FreeBSD1201-64_K12.1_GCC9.2.0/x86_64-native-bsdapp-gcc/c3f231f2a66b4fc68f893bf3ca90630b/dpdk/mk/rte.sdkbuild.mk:51: drivers] Error 2
gmake[2]: *** [/root/FreeBSD1201-64_K12.1_GCC9.2.0/x86_64-native-bsdapp-gcc/c3f231f2a66b4fc68f893bf3ca90630b/dpdk/mk/rte.sdkroot.mk:99: all] Error 2
gmake[1]: *** [/root/FreeBSD1201-64_K12.1_GCC9.2.0/x86_64-native-bsdapp-gcc/c3f231f2a66b4fc68f893bf3ca90630b/dpdk/mk/rte.sdkinstall.mk:61: pre_install] Error 2
gmake: *** [/root/FreeBSD1201-64_K12.1_GCC9.2.0/x86_64-native-bsdapp-gcc/c3f231f2a66b4fc68f893bf3ca90630b/dpdk/mk/rte.sdkroot.mk:77: install] Error 2


*Make Build Failed #13:
OS: RHEL77-64
Target: x86_64-native-linuxapp-gcc
but is listed in version map
Please add __rte_experimental to the definition of rte_pmd_i40e_set_gre_key_len
  CC ixgbe_ethdev.o
make[6]: *** [rte_pmd_i40e.o] Error 1
make[6]: *** Waiting for unfinished jobs....
  CC ixgbe_fdir.o
  PMDINFO hn_ethdev.o.pmd.c
--
  CC ice_switch_filter.o
  CC ixgbe_rxtx_vec_sse.o
  CC ixgbe_ipsec.o
make[5]: *** [i40e] Error 2
make[5]: *** Waiting for unfinished jobs....
  CC rte_pmd_ixgbe.o
  CC nfp_mutex.o
--
Please add __rte_experimental to the definition of rte_pmd_ixgbe_get_fdir_stats
  CC nfp_nffw.o
  CC hn_nvs.o
make[6]: *** [rte_pmd_ixgbe.o] Error 1
make[6]: *** Waiting for unfinished jobs....
  CC ixgbe_vf_representor.o
  CC nfp_hwinfo.o
--
  LD nfp_net.o
  AR librte_pmd_ice.a
  INSTALL-LIB librte_pmd_ice.a
make[5]: *** [ixgbe] Error 2
  AR librte_pmd_nfp.a
  INSTALL-LIB librte_pmd_nfp.a
make[4]: *** [net] Error 2
make[3]: *** [drivers] Error 2
make[2]: *** [all] Error 2
make[1]: *** [pre_install] Error 2
make: *** [install] Error 2


*Make Build Failed #14:
OS: RHEL80-64
Target: x86_64-native-linuxapp-gcc
but is listed in version map
Please add __rte_experimental to the definition of rte_pmd_i40e_set_gre_key_len
  CC ixgbe_dcb_82599.o
make[6]: *** [/root/RHEL80-64_K3.10.0_GCC8.2.1/x86_64-native-linuxapp-gcc/c3f231f2a66b4fc68f893bf3ca90630b/dpdk/mk/internal/rte.compile-pre.mk:114: rte_pmd_i40e.o] Error 1
make[6]: *** Waiting for unfinished jobs....
  CC ixgbe_dcb_82598.o
make[5]: *** [/root/RHEL80-64_K3.10.0_GCC8.2.1/x86_64-native-linuxapp-gcc/c3f231f2a66b4fc68f893bf3ca90630b/dpdk/mk/rte.subdir.mk:37: i40e] Error 2
make[5]: *** Waiting for unfinished jobs....
  CC ixgbe_mbx.o
  CC nfp_cppcore.o
--
  CC ice_acl_ctrl.o
  CC nfp_mip.o
  CC null_crypto_pmd_ops.o
make[6]: *** [/root/RHEL80-64_K3.10.0_GCC8.2.1/x86_64-native-linuxapp-gcc/c3f231f2a66b4fc68f893bf3ca90630b/dpdk/mk/internal/rte.compile-pre.mk:116: rte_pmd_ixgbe.o] Error 1
make[6]: *** Waiting for unfinished jobs....
  CC nfp_nffw.o
  LD ixgbe_ethdev.o
  CC nfp_hwinfo.o
  CC ice_ethdev.o
  CC ice_rxtx.o
make[5]: *** [/root/RHEL80-64_K3.10.0_GCC8.2.1/x86_64-native-linuxapp-gcc/c3f231f2a66b4fc68f893bf3ca90630b/dpdk/mk/rte.subdir.mk:35: ixgbe] Error 2
  CC ice_rxtx_vec_sse.o
  CC nfp_rtsym.o
  CC nfp_nsp.o
--
  LD dpaa_sec.o
  AR librte_pmd_bnxt.a
  INSTALL-LIB librte_pmd_bnxt.a
make[4]: *** [/root/RHEL80-64_K3.10.0_GCC8.2.1/x86_64-native-linuxapp-gcc/c3f231f2a66b4fc68f893bf3ca90630b/dpdk/mk/rte.subdir.mk:35: net] Error 2
make[4]: *** Waiting for unfinished jobs....
  AR librte_pmd_dpaa_sec.a
  AR librte_pmd_caam_jr.a
  INSTALL-LIB librte_pmd_dpaa_sec.a
  INSTALL-LIB librte_pmd_caam_jr.a
make[3]: *** [/root/RHEL80-64_K3.10.0_GCC8.2.1/x86_64-native-linuxapp-gcc/c3f231f2a66b4fc68f893bf3ca90630b/dpdk/mk/rte.sdkbuild.mk:51: drivers] Error 2
make[2]: *** [/root/RHEL80-64_K3.10.0_GCC8.2.1/x86_64-native-linuxapp-gcc/c3f231f2a66b4fc68f893bf3ca90630b/dpdk/mk/rte.sdkroot.mk:99: all] Error 2
make[1]: *** [/root/RHEL80-64_K3.10.0_GCC8.2.1/x86_64-native-linuxapp-gcc/c3f231f2a66b4fc68f893bf3ca90630b/dpdk/mk/rte.sdkinstall.mk:61: pre_install] Error 2
make: *** [/root/RHEL80-64_K3.10.0_GCC8.2.1/x86_64-native-linuxapp-gcc/c3f231f2a66b4fc68f893bf3ca90630b/dpdk/mk/rte.sdkroot.mk:77: install] Error 2


*Make Build Failed #15:
OS: SUSE15-64
Target: x86_64-native-linuxapp-clang
  CC ice_acl_ctrl.o
  CC ice_ethdev.o
  CC bnxt_txq.o
make[6]: *** [/root/SUSE15-64_K4.12.14_Clang5.0.1/x86_64-native-linuxapp-clang/c3f231f2a66b4fc68f893bf3ca90630b/dpdk/mk/internal/rte.compile-pre.mk:114: rte_pmd_i40e.o] Error 1
make[5]: *** [/root/SUSE15-64_K4.12.14_Clang5.0.1/x86_64-native-linuxapp-clang/c3f231f2a66b4fc68f893bf3ca90630b/dpdk/mk/rte.subdir.mk:35: i40e] Error 2
make[5]: *** Waiting for unfinished jobs....
  CC bnxt_txr.o
  CC ice_rxtx.o
--
rte_pmd_ixgbe_get_fdir_stats is not flagged as experimental
but is listed in version map
Please add __rte_experimental to the definition of rte_pmd_ixgbe_get_fdir_stats
make[6]: *** [/root/SUSE15-64_K4.12.14_Clang5.0.1/x86_64-native-linuxapp-clang/c3f231f2a66b4fc68f893bf3ca90630b/dpdk/mk/internal/rte.compile-pre.mk:114: rte_pmd_ixgbe.o] Error 1
make[6]: *** Waiting for unfinished jobs....
  CC ice_rxtx_vec_sse.o
make[5]: *** [/root/SUSE15-64_K4.12.14_Clang5.0.1/x86_64-native-linuxapp-clang/c3f231f2a66b4fc68f893bf3ca90630b/dpdk/mk/rte.subdir.mk:35: ixgbe] Error 2
  CC otx2_ptp.o
  CC ice_switch_filter.o
  CC bnxt_vnic.o
--
  INSTALL-LIB librte_pmd_bnxt.a
  AR librte_pmd_octeontx2.a
  INSTALL-LIB librte_pmd_octeontx2.a
make[4]: *** [/root/SUSE15-64_K4.12.14_Clang5.0.1/x86_64-native-linuxapp-clang/c3f231f2a66b4fc68f893bf3ca90630b/dpdk/mk/rte.subdir.mk:35: net] Error 2
make[3]: *** [/root/SUSE15-64_K4.12.14_Clang5.0.1/x86_64-native-linuxapp-clang/c3f231f2a66b4fc68f893bf3ca90630b/dpdk/mk/rte.sdkbuild.mk:51: drivers] Error 2
make[2]: *** [/root/SUSE15-64_K4.12.14_Clang5.0.1/x86_64-native-linuxapp-clang/c3f231f2a66b4fc68f893bf3ca90630b/dpdk/mk/rte.sdkroot.mk:99: all] Error 2
make[1]: *** [/root/SUSE15-64_K4.12.14_Clang5.0.1/x86_64-native-linuxapp-clang/c3f231f2a66b4fc68f893bf3ca90630b/dpdk/mk/rte.sdkinstall.mk:61: pre_install] Error 2
make: *** [/root/SUSE15-64_K4.12.14_Clang5.0.1/x86_64-native-linuxapp-clang/c3f231f2a66b4fc68f893bf3ca90630b/dpdk/mk/rte.sdkroot.mk:77: install] Error 2


*Make Build Failed #16:
OS: SUSE15-64
Target: x86_64-native-linuxapp-gcc
  CC ice_dcf.o
== Build drivers/net/octeontx
  AR librte_pmd_ionic.a
make[6]: *** [/root/SUSE15-64_K4.12.14_GCC7.3.1/x86_64-native-linuxapp-gcc/c3f231f2a66b4fc68f893bf3ca90630b/dpdk/mk/internal/rte.compile-pre.mk:114: rte_pmd_i40e.o] Error 1
make[5]: *** [/root/SUSE15-64_K4.12.14_GCC7.3.1/x86_64-native-linuxapp-gcc/c3f231f2a66b4fc68f893bf3ca90630b/dpdk/mk/rte.subdir.mk:37: i40e] Error 2
make[5]: *** Waiting for unfinished jobs....
  INSTALL-LIB librte_pmd_ionic.a
  CC ixgbe_vf.o
--
  CC tf_ulp/bnxt_ulp.o
  INSTALL-LIB librte_pmd_nfp.a
  CC ixgbe_vf_representor.o
make[6]: *** [/root/SUSE15-64_K4.12.14_GCC7.3.1/x86_64-native-linuxapp-gcc/c3f231f2a66b4fc68f893bf3ca90630b/dpdk/mk/internal/rte.compile-pre.mk:116: rte_pmd_ixgbe.o] Error 1
make[6]: *** Waiting for unfinished jobs....
  CC tf_ulp/ulp_mark_mgr.o
  CC tf_ulp/ulp_flow_db.o
--
  CC tf_ulp/ulp_matcher.o
  CC tf_ulp/ulp_rte_parser.o
  CC tf_ulp/bnxt_ulp_flow.o
make[5]: *** [/root/SUSE15-64_K4.12.14_GCC7.3.1/x86_64-native-linuxapp-gcc/c3f231f2a66b4fc68f893bf3ca90630b/dpdk/mk/rte.subdir.mk:35: ixgbe] Error 2
  CC tf_ulp/ulp_port_db.o
  AR librte_pmd_bnxt.a
  INSTALL-LIB librte_pmd_bnxt.a
make[4]: *** [/root/SUSE15-64_K4.12.14_GCC7.3.1/x86_64-native-linuxapp-gcc/c3f231f2a66b4fc68f893bf3ca90630b/dpdk/mk/rte.subdir.mk:35: net] Error 2
make[3]: *** [/root/SUSE15-64_K4.12.14_GCC7.3.1/x86_64-native-linuxapp-gcc/c3f231f2a66b4fc68f893bf3ca90630b/dpdk/mk/rte.sdkbuild.mk:51: drivers] Error 2
make[2]: *** [/root/SUSE15-64_K4.12.14_GCC7.3.1/x86_64-native-linuxapp-gcc/c3f231f2a66b4fc68f893bf3ca90630b/dpdk/mk/rte.sdkroot.mk:99: all] Error 2
make[1]: *** [/root/SUSE15-64_K4.12.14_GCC7.3.1/x86_64-native-linuxapp-gcc/c3f231f2a66b4fc68f893bf3ca90630b/dpdk/mk/rte.sdkinstall.mk:61: pre_install] Error 2
make: *** [/root/SUSE15-64_K4.12.14_GCC7.3.1/x86_64-native-linuxapp-gcc/c3f231f2a66b4fc68f893bf3ca90630b/dpdk/mk/rte.sdkroot.mk:77: install] Error 2


*Make Build Failed #17:
OS: UB1804-32
Target: i686-native-linuxapp-gcc
but is listed in version map
Please add __rte_experimental to the definition of rte_pmd_i40e_set_gre_key_len
  CC ionic_main.o
/root/UB1804-32_K4.15.0_GCC7.3.0/i686-native-linuxapp-gcc/c3f231f2a66b4fc68f893bf3ca90630b/dpdk/mk/internal/rte.compile-pre.mk:114: recipe for target 'rte_pmd_i40e.o' failed
make[6]: *** [rte_pmd_i40e.o] Error 1
make[6]: *** Waiting for unfinished jobs....
== Build drivers/net/bnxt
/root/UB1804-32_K4.15.0_GCC7.3.0/i686-native-linuxapp-gcc/c3f231f2a66b4fc68f893bf3ca90630b/dpdk/mk/rte.subdir.mk:35: recipe for target 'i40e' failed
make[5]: *** [i40e] Error 2
make[5]: *** Waiting for unfinished jobs....
  CC lio_rxtx.o
  CC lio_23xx_vf.o
--
  CC bnxt_rxq.o
  LD ice_dcf_ethdev.o
  CC bnxt_rxr.o
/root/UB1804-32_K4.15.0_GCC7.3.0/i686-native-linuxapp-gcc/c3f231f2a66b4fc68f893bf3ca90630b/dpdk/mk/internal/rte.compile-pre.mk:114: recipe for target 'rte_pmd_ixgbe.o' failed
make[6]: *** [rte_pmd_ixgbe.o] Error 1
/root/UB1804-32_K4.15.0_GCC7.3.0/i686-native-linuxapp-gcc/c3f231f2a66b4fc68f893bf3ca90630b/dpdk/mk/rte.subdir.mk:35: recipe for target 'ixgbe' failed
make[5]: *** [ixgbe] Error 2
  CC bnxt_stats.o
  CC bnxt_txq.o
  CC bnxt_txr.o
--
  CC tf_ulp/ulp_port_db.o
  AR librte_pmd_bnxt.a
  INSTALL-LIB librte_pmd_bnxt.a
/root/UB1804-32_K4.15.0_GCC7.3.0/i686-native-linuxapp-gcc/c3f231f2a66b4fc68f893bf3ca90630b/dpdk/mk/rte.subdir.mk:35: recipe for target 'net' failed
make[4]: *** [net] Error 2
/root/UB1804-32_K4.15.0_GCC7.3.0/i686-native-linuxapp-gcc/c3f231f2a66b4fc68f893bf3ca90630b/dpdk/mk/rte.sdkbuild.mk:51: recipe for target 'drivers' failed
make[3]: *** [drivers] Error 2
/root/UB1804-32_K4.15.0_GCC7.3.0/i686-native-linuxapp-gcc/c3f231f2a66b4fc68f893bf3ca90630b/dpdk/mk/rte.sdkroot.mk:98: recipe for target 'all' failed
make[2]: *** [all] Error 2
/root/UB1804-32_K4.15.0_GCC7.3.0/i686-native-linuxapp-gcc/c3f231f2a66b4fc68f893bf3ca90630b/dpdk/mk/rte.sdkinstall.mk:60: recipe for target 'pre_install' failed
make[1]: *** [pre_install] Error 2
/root/UB1804-32_K4.15.0_GCC7.3.0/i686-native-linuxapp-gcc/c3f231f2a66b4fc68f893bf3ca90630b/dpdk/mk/rte.sdkroot.mk:77: recipe for target 'install' failed
make: *** [install] Error 2


*Make Build Failed #18:
OS: UB1804-64
Target: x86_64-native-linuxapp-clang
Please add __rte_experimental to the definition of rte_pmd_i40e_set_gre_key_len
  CC ice_acl.o
  CC igc_filter.o
/root/UB1804-64_K4.15.0_Clang6.0.0/x86_64-native-linuxapp-clang/c3f231f2a66b4fc68f893bf3ca90630b/dpdk/mk/internal/rte.compile-pre.mk:114: recipe for target 'rte_pmd_i40e.o' failed
make[6]: *** [rte_pmd_i40e.o] Error 1
make[6]: *** Waiting for unfinished jobs....
  CC igc_flow.o
  CC ice_acl_ctrl.o
--
  CC ice_fdir_filter.o
  CC ice_hash.o
  AR librte_pmd_igc.a
/root/UB1804-64_K4.15.0_Clang6.0.0/x86_64-native-linuxapp-clang/c3f231f2a66b4fc68f893bf3ca90630b/dpdk/mk/rte.subdir.mk:35: recipe for target 'i40e' failed
make[5]: *** [i40e] Error 2
make[5]: *** Waiting for unfinished jobs....
  INSTALL-LIB librte_pmd_igc.a
  CC ixgbe_82598.o
--
rte_pmd_ixgbe_get_fdir_stats is not flagged as experimental
but is listed in version map
Please add __rte_experimental to the definition of rte_pmd_ixgbe_get_fdir_stats
/root/UB1804-64_K4.15.0_Clang6.0.0/x86_64-native-linuxapp-clang/c3f231f2a66b4fc68f893bf3ca90630b/dpdk/mk/internal/rte.compile-pre.mk:114: recipe for target 'rte_pmd_ixgbe.o' failed
make[6]: *** [rte_pmd_ixgbe.o] Error 1
make[6]: *** Waiting for unfinished jobs....
  PMDINFO ixgbe_ethdev.o.pmd.c
  CC ixgbe_ethdev.o.pmd.o
  LD ixgbe_ethdev.o
/root/UB1804-64_K4.15.0_Clang6.0.0/x86_64-native-linuxapp-clang/c3f231f2a66b4fc68f893bf3ca90630b/dpdk/mk/rte.subdir.mk:35: recipe for target 'ixgbe' failed
make[5]: *** [ixgbe] Error 2
/root/UB1804-64_K4.15.0_Clang6.0.0/x86_64-native-linuxapp-clang/c3f231f2a66b4fc68f893bf3ca90630b/dpdk/mk/rte.subdir.mk:35: recipe for target 'net' failed
make[4]: *** [net] Error 2
/root/UB1804-64_K4.15.0_Clang6.0.0/x86_64-native-linuxapp-clang/c3f231f2a66b4fc68f893bf3ca90630b/dpdk/mk/rte.sdkbuild.mk:51: recipe for target 'drivers' failed
make[3]: *** [drivers] Error 2
/root/UB1804-64_K4.15.0_Clang6.0.0/x86_64-native-linuxapp-clang/c3f231f2a66b4fc68f893bf3ca90630b/dpdk/mk/rte.sdkroot.mk:98: recipe for target 'all' failed
make[2]: *** [all] Error 2
/root/UB1804-64_K4.15.0_Clang6.0.0/x86_64-native-linuxapp-clang/c3f231f2a66b4fc68f893bf3ca90630b/dpdk/mk/rte.sdkinstall.mk:60: recipe for target 'pre_install' failed
make[1]: *** [pre_install] Error 2
/root/UB1804-64_K4.15.0_Clang6.0.0/x86_64-native-linuxapp-clang/c3f231f2a66b4fc68f893bf3ca90630b/dpdk/mk/rte.sdkroot.mk:77: recipe for target 'install' failed
make: *** [install] Error 2


*Make Build Failed #19:
OS: UB1804-64
Target: x86_64-native-linuxapp-gcc
rte_pmd_ixgbe_get_fdir_stats is not flagged as experimental
but is listed in version map
Please add __rte_experimental to the definition of rte_pmd_ixgbe_get_fdir_stats
/root/UB1804-64_K4.15.0_GCC7.3.0/x86_64-native-linuxapp-gcc/c3f231f2a66b4fc68f893bf3ca90630b/dpdk/mk/internal/rte.compile-pre.mk:114: recipe for target 'rte_pmd_ixgbe.o' failed
make[6]: *** [rte_pmd_ixgbe.o] Error 1
make[6]: *** Waiting for unfinished jobs....
  CC i40e_vf_representor.o
  PMDINFO ixgbe_ethdev.o.pmd.c
--
  CC i40e_rxtx_vec_avx2.o
  CC ice_rxtx.o
  CC bnxt_rxr.o
/root/UB1804-64_K4.15.0_GCC7.3.0/x86_64-native-linuxapp-gcc/c3f231f2a66b4fc68f893bf3ca90630b/dpdk/mk/rte.subdir.mk:35: recipe for target 'ixgbe' failed
make[5]: *** [ixgbe] Error 2
make[5]: *** Waiting for unfinished jobs....
  CC bnxt_stats.o
  CC bnxt_txq.o
--
rte_pmd_i40e_set_gre_key_len is not flagged as experimental
but is listed in version map
Please add __rte_experimental to the definition of rte_pmd_i40e_set_gre_key_len
/root/UB1804-64_K4.15.0_GCC7.3.0/x86_64-native-linuxapp-gcc/c3f231f2a66b4fc68f893bf3ca90630b/dpdk/mk/internal/rte.compile-pre.mk:114: recipe for target 'rte_pmd_i40e.o' failed
make[6]: *** [rte_pmd_i40e.o] Error 1
make[6]: *** Waiting for unfinished jobs....
  CC bnxt_rxtx_vec_sse.o
/root/UB1804-64_K4.15.0_GCC7.3.0/x86_64-native-linuxapp-gcc/c3f231f2a66b4fc68f893bf3ca90630b/dpdk/mk/rte.subdir.mk:35: recipe for target 'i40e' failed
make[5]: *** [i40e] Error 2
  CC tf_core/tf_core.o
  CC tf_core/bitalloc.o
  CC ice_dcf.o
--
  CC tf_ulp/ulp_port_db.o
  AR librte_pmd_bnxt.a
  INSTALL-LIB librte_pmd_bnxt.a
/root/UB1804-64_K4.15.0_GCC7.3.0/x86_64-native-linuxapp-gcc/c3f231f2a66b4fc68f893bf3ca90630b/dpdk/mk/rte.subdir.mk:35: recipe for target 'net' failed
make[4]: *** [net] Error 2
/root/UB1804-64_K4.15.0_GCC7.3.0/x86_64-native-linuxapp-gcc/c3f231f2a66b4fc68f893bf3ca90630b/dpdk/mk/rte.sdkbuild.mk:51: recipe for target 'drivers' failed
make[3]: *** [drivers] Error 2
/root/UB1804-64_K4.15.0_GCC7.3.0/x86_64-native-linuxapp-gcc/c3f231f2a66b4fc68f893bf3ca90630b/dpdk/mk/rte.sdkroot.mk:98: recipe for target 'all' failed
make[2]: *** [all] Error 2
/root/UB1804-64_K4.15.0_GCC7.3.0/x86_64-native-linuxapp-gcc/c3f231f2a66b4fc68f893bf3ca90630b/dpdk/mk/rte.sdkinstall.mk:60: recipe for target 'pre_install' failed
make[1]: *** [pre_install] Error 2
/root/UB1804-64_K4.15.0_GCC7.3.0/x86_64-native-linuxapp-gcc/c3f231f2a66b4fc68f893bf3ca90630b/dpdk/mk/rte.sdkroot.mk:77: recipe for target 'install' failed
make: *** [install] Error 2


*Make Build Failed #20:
OS: UB1804-64
Target: x86_64-native-linuxapp-icc
rte_pmd_i40e_set_gre_key_len is not flagged as experimental
but is listed in version map
Please add __rte_experimental to the definition of rte_pmd_i40e_set_gre_key_len
/root/UB1804-64_K4.15.0_ICC19.0.0/x86_64-native-linuxapp-icc/c3f231f2a66b4fc68f893bf3ca90630b/dpdk/mk/internal/rte.compile-pre.mk:114: recipe for target 'rte_pmd_i40e.o' failed
make[6]: *** [rte_pmd_i40e.o] Error 1
make[6]: *** Waiting for unfinished jobs....
  CC ixgbe_hv_vf.o
/root/UB1804-64_K4.15.0_ICC19.0.0/x86_64-native-linuxapp-icc/c3f231f2a66b4fc68f893bf3ca90630b/dpdk/mk/rte.subdir.mk:35: recipe for target 'i40e' failed
make[5]: *** [i40e] Error 2
make[5]: *** Waiting for unfinished jobs....
  CC ixgbe_dcb.o
  AR librte_pmd_memif.a
--
but is listed in version map
Please add __rte_experimental to the definition of rte_pmd_ixgbe_get_fdir_stats
  CC bnxt_stats.o
/root/UB1804-64_K4.15.0_ICC19.0.0/x86_64-native-linuxapp-icc/c3f231f2a66b4fc68f893bf3ca90630b/dpdk/mk/internal/rte.compile-pre.mk:114: recipe for target 'rte_pmd_ixgbe.o' failed
make[6]: *** [rte_pmd_ixgbe.o] Error 1
make[6]: *** Waiting for unfinished jobs....
  CC bnxt_txq.o
  CC ice_dcf_ethdev.o
  CC bnxt_txr.o
  CC ice_dcf_parent.o
  CC bnxt_vnic.o
/root/UB1804-64_K4.15.0_ICC19.0.0/x86_64-native-linuxapp-icc/c3f231f2a66b4fc68f893bf3ca90630b/dpdk/mk/rte.subdir.mk:35: recipe for target 'ixgbe' failed
make[5]: *** [ixgbe] Error 2
  CC bnxt_irq.o
  CC bnxt_util.o
  CC rte_pmd_bnxt.o
--
  CC tf_ulp/ulp_port_db.o
  AR librte_pmd_bnxt.a
  INSTALL-LIB librte_pmd_bnxt.a
/root/UB1804-64_K4.15.0_ICC19.0.0/x86_64-native-linuxapp-icc/c3f231f2a66b4fc68f893bf3ca90630b/dpdk/mk/rte.subdir.mk:35: recipe for target 'net' failed
make[4]: *** [net] Error 2
/root/UB1804-64_K4.15.0_ICC19.0.0/x86_64-native-linuxapp-icc/c3f231f2a66b4fc68f893bf3ca90630b/dpdk/mk/rte.sdkbuild.mk:51: recipe for target 'drivers' failed
make[3]: *** [drivers] Error 2
/root/UB1804-64_K4.15.0_ICC19.0.0/x86_64-native-linuxapp-icc/c3f231f2a66b4fc68f893bf3ca90630b/dpdk/mk/rte.sdkroot.mk:98: recipe for target 'all' failed
make[2]: *** [all] Error 2
/root/UB1804-64_K4.15.0_ICC19.0.0/x86_64-native-linuxapp-icc/c3f231f2a66b4fc68f893bf3ca90630b/dpdk/mk/rte.sdkinstall.mk:60: recipe for target 'pre_install' failed
make[1]: *** [pre_install] Error 2
/root/UB1804-64_K4.15.0_ICC19.0.0/x86_64-native-linuxapp-icc/c3f231f2a66b4fc68f893bf3ca90630b/dpdk/mk/rte.sdkroot.mk:77: recipe for target 'install' failed
make: *** [install] Error 2


*Make Build Failed #21:
OS: UB2004-64
Target: x86_64-native-linuxapp-clang
rte_pmd_i40e_set_gre_key_len is not flagged as experimental
but is listed in version map
Please add __rte_experimental to the definition of rte_pmd_i40e_set_gre_key_len
make[6]: *** [/root/UB2004-64_K5.4.0_Clang10.0.0/x86_64-native-linuxapp-clang/c3f231f2a66b4fc68f893bf3ca90630b/dpdk/mk/internal/rte.compile-pre.mk:116: rte_pmd_i40e.o] Error 1
make[6]: *** Waiting for unfinished jobs....
  CC hn_rxtx.o
  CC hn_rndis.o
--
== Build drivers/net/nfp
  CC lio_23xx_vf.o
  CC lio_mbox.o
make[5]: *** [/root/UB2004-64_K5.4.0_Clang10.0.0/x86_64-native-linuxapp-clang/c3f231f2a66b4fc68f893bf3ca90630b/dpdk/mk/rte.subdir.mk:37: i40e] Error 2
make[5]: *** Waiting for unfinished jobs....
  CC ice_acl.o
  CC nfp_cppcore.o
--
rte_pmd_ixgbe_get_fdir_stats is not flagged as experimental
but is listed in version map
Please add __rte_experimental to the definition of rte_pmd_ixgbe_get_fdir_stats
make[6]: *** [/root/UB2004-64_K5.4.0_Clang10.0.0/x86_64-native-linuxapp-clang/c3f231f2a66b4fc68f893bf3ca90630b/dpdk/mk/internal/rte.compile-pre.mk:114: rte_pmd_ixgbe.o] Error 1
make[6]: *** Waiting for unfinished jobs....
make[5]: *** [/root/UB2004-64_K5.4.0_Clang10.0.0/x86_64-native-linuxapp-clang/c3f231f2a66b4fc68f893bf3ca90630b/dpdk/mk/rte.subdir.mk:35: ixgbe] Error 2
  PMDINFO ice_dcf_ethdev.o.pmd.c
  CC ice_dcf_ethdev.o.pmd.o
  LD ice_dcf_ethdev.o
  AR librte_pmd_ice.a
  INSTALL-LIB librte_pmd_ice.a
make[4]: *** [/root/UB2004-64_K5.4.0_Clang10.0.0/x86_64-native-linuxapp-clang/c3f231f2a66b4fc68f893bf3ca90630b/dpdk/mk/rte.subdir.mk:35: net] Error 2
make[3]: *** [/root/UB2004-64_K5.4.0_Clang10.0.0/x86_64-native-linuxapp-clang/c3f231f2a66b4fc68f893bf3ca90630b/dpdk/mk/rte.sdkbuild.mk:51: drivers] Error 2
make[2]: *** [/root/UB2004-64_K5.4.0_Clang10.0.0/x86_64-native-linuxapp-clang/c3f231f2a66b4fc68f893bf3ca90630b/dpdk/mk/rte.sdkroot.mk:99: all] Error 2
make[1]: *** [/root/UB2004-64_K5.4.0_Clang10.0.0/x86_64-native-linuxapp-clang/c3f231f2a66b4fc68f893bf3ca90630b/dpdk/mk/rte.sdkinstall.mk:61: pre_install] Error 2
make: *** [/root/UB2004-64_K5.4.0_Clang10.0.0/x86_64-native-linuxapp-clang/c3f231f2a66b4fc68f893bf3ca90630b/dpdk/mk/rte.sdkroot.mk:77: install] Error 2


*Make Build Failed #22:
OS: UB2004-64
Target: x86_64-native-linuxapp-gcc
  CC nfp_hwinfo.o
  CC ice_ethdev.o.pmd.o
  LD ice_ethdev.o
make[6]: *** [/root/UB2004-64_K5.4.0_GCC9.3.0/x86_64-native-linuxapp-gcc/c3f231f2a66b4fc68f893bf3ca90630b/dpdk/mk/internal/rte.compile-pre.mk:116: rte_pmd_i40e.o] Error 1
make[6]: *** Waiting for unfinished jobs....
  INSTALL-LIB librte_pmd_dpaa_sec.a
== Build drivers/crypto/virtio
--
  LD ixgbe_ethdev.o
  CC ice_rxtx_vec_sse.o
  CC nfp_nsp_eth.o
make[5]: *** [/root/UB2004-64_K5.4.0_GCC9.3.0/x86_64-native-linuxapp-gcc/c3f231f2a66b4fc68f893bf3ca90630b/dpdk/mk/rte.subdir.mk:35: i40e] Error 2
make[5]: *** Waiting for unfinished jobs....
  CC ixgbe_pf.o
  CC nfp_net.o
--
  CC ice_dcf_parent.o
  CC ixgbe_vf_representor.o
  CC bnxt_rxr.o
make[6]: *** [/root/UB2004-64_K5.4.0_GCC9.3.0/x86_64-native-linuxapp-gcc/c3f231f2a66b4fc68f893bf3ca90630b/dpdk/mk/internal/rte.compile-pre.mk:116: rte_pmd_ixgbe.o] Error 1
make[6]: *** Waiting for unfinished jobs....
  CC bnxt_stats.o
  CC bnxt_txq.o
--
  CC bnxt_vnic.o
  CC bnxt_irq.o
  CC bnxt_util.o
make[5]: *** [/root/UB2004-64_K5.4.0_GCC9.3.0/x86_64-native-linuxapp-gcc/c3f231f2a66b4fc68f893bf3ca90630b/dpdk/mk/rte.subdir.mk:35: ixgbe] Error 2
  AR librte_pmd_ice.a
  CC rte_pmd_bnxt.o
  INSTALL-LIB librte_pmd_ice.a
--
  CC tf_ulp/ulp_port_db.o
  AR librte_pmd_bnxt.a
  INSTALL-LIB librte_pmd_bnxt.a
make[4]: *** [/root/UB2004-64_K5.4.0_GCC9.3.0/x86_64-native-linuxapp-gcc/c3f231f2a66b4fc68f893bf3ca90630b/dpdk/mk/rte.subdir.mk:35: net] Error 2
make[3]: *** [/root/UB2004-64_K5.4.0_GCC9.3.0/x86_64-native-linuxapp-gcc/c3f231f2a66b4fc68f893bf3ca90630b/dpdk/mk/rte.sdkbuild.mk:51: drivers] Error 2
make[2]: *** [/root/UB2004-64_K5.4.0_GCC9.3.0/x86_64-native-linuxapp-gcc/c3f231f2a66b4fc68f893bf3ca90630b/dpdk/mk/rte.sdkroot.mk:99: all] Error 2
make[1]: *** [/root/UB2004-64_K5.4.0_GCC9.3.0/x86_64-native-linuxapp-gcc/c3f231f2a66b4fc68f893bf3ca90630b/dpdk/mk/rte.sdkinstall.mk:61: pre_install] Error 2
make: *** [/root/UB2004-64_K5.4.0_GCC9.3.0/x86_64-native-linuxapp-gcc/c3f231f2a66b4fc68f893bf3ca90630b/dpdk/mk/rte.sdkroot.mk:77: install] Error 2


*Make Build Failed #23:
OS: UB2004-64
Target: x86_64-native-linuxapp-icc
rte_pmd_i40e_set_gre_key_len is not flagged as experimental
but is listed in version map
Please add __rte_experimental to the definition of rte_pmd_i40e_set_gre_key_len
make[6]: *** [/root/UB2004-64_K5.4.0_ICC19.0.0/x86_64-native-linuxapp-icc/c3f231f2a66b4fc68f893bf3ca90630b/dpdk/mk/internal/rte.compile-pre.mk:114: rte_pmd_i40e.o] Error 1
make[5]: *** [/root/UB2004-64_K5.4.0_ICC19.0.0/x86_64-native-linuxapp-icc/c3f231f2a66b4fc68f893bf3ca90630b/dpdk/mk/rte.subdir.mk:37: i40e] Error 2
make[5]: *** Waiting for unfinished jobs....
  CC bnxt_ring.o
  CC nfp_rtsym.o
--
rte_pmd_ixgbe_get_fdir_stats is not flagged as experimental
but is listed in version map
Please add __rte_experimental to the definition of rte_pmd_ixgbe_get_fdir_stats
make[6]: *** [/root/UB2004-64_K5.4.0_ICC19.0.0/x86_64-native-linuxapp-icc/c3f231f2a66b4fc68f893bf3ca90630b/dpdk/mk/internal/rte.compile-pre.mk:116: rte_pmd_ixgbe.o] Error 1
make[6]: *** Waiting for unfinished jobs....
  CC nfp_nsp.o
  CC octeontx_rxtx.o
  CC ice_ethdev.o
  CC bnxt_rxq.o
  CC nfp_nsp_cmds.o
make[5]: *** [/root/UB2004-64_K5.4.0_ICC19.0.0/x86_64-native-linuxapp-icc/c3f231f2a66b4fc68f893bf3ca90630b/dpdk/mk/rte.subdir.mk:37: ixgbe] Error 2
  CC nfp_nsp_eth.o
  CC nfp_net.o
  CC bnxt_rxr.o
--
  INSTALL-LIB librte_pmd_bnxt.a
  AR librte_pmd_octeontx2.a
  INSTALL-LIB librte_pmd_octeontx2.a
make[4]: *** [/root/UB2004-64_K5.4.0_ICC19.0.0/x86_64-native-linuxapp-icc/c3f231f2a66b4fc68f893bf3ca90630b/dpdk/mk/rte.subdir.mk:35: net] Error 2
make[3]: *** [/root/UB2004-64_K5.4.0_ICC19.0.0/x86_64-native-linuxapp-icc/c3f231f2a66b4fc68f893bf3ca90630b/dpdk/mk/rte.sdkbuild.mk:51: drivers] Error 2
make[2]: *** [/root/UB2004-64_K5.4.0_ICC19.0.0/x86_64-native-linuxapp-icc/c3f231f2a66b4fc68f893bf3ca90630b/dpdk/mk/rte.sdkroot.mk:99: all] Error 2
make[1]: *** [/root/UB2004-64_K5.4.0_ICC19.0.0/x86_64-native-linuxapp-icc/c3f231f2a66b4fc68f893bf3ca90630b/dpdk/mk/rte.sdkinstall.mk:61: pre_install] Error 2
make: *** [/root/UB2004-64_K5.4.0_ICC19.0.0/x86_64-native-linuxapp-icc/c3f231f2a66b4fc68f893bf3ca90630b/dpdk/mk/rte.sdkroot.mk:77: install] Error 2

*Meson Build Failed #1:
OS: CENTOS80-64
Target:./build-gcc-static
FAILED: drivers/rte_pmd_i40e.sym_chk 
/usr/local/bin/meson --internal exe --capture drivers/rte_pmd_i40e.sym_chk -- /root/CENTOS80-64_K4.18.0_GCC8.2.1/x86_64-native-linuxapp-gcc/c3f231f2a66b4fc68f893bf3ca90630b/dpdk/buildtools/check-symbols.sh /root/CENTOS80-64_K4.18.0_GCC8.2.1/x86_64-native-linuxapp-gcc/c3f231f2a66b4fc68f893bf3ca90630b/dpdk/drivers/net/i40e/rte_pmd_i40e_version.map drivers/librte_pmd_i40e.a
rte_pmd_i40e_get_fdir_info is not flagged as experimental
but is listed in version map
Please add __rte_experimental to the definition of rte_pmd_i40e_get_fdir_info
rte_pmd_i40e_get_fdir_stats is not flagged as experimental
but is listed in version map
Please add __rte_experimental to the definition of rte_pmd_i40e_get_fdir_stats
rte_pmd_i40e_set_gre_key_len is not flagged as experimental
but is listed in version map
Please add __rte_experimental to the definition of rte_pmd_i40e_set_gre_key_len
[1084/2193] Compiling C object 'drivers/a715181@@rte_pmd_hns3@sta/meson-generated_.._rte_pmd_hns3.pmd.c.o'.
[1085/2193] Compiling C object 'drivers/a715181@@tmp_rte_pmd_iavf@sta/net_iavf_iavf_rxtx_vec_sse.c.o'.
[1086/2193] Compiling C object 'drivers/net/ice/base/39545a2@@ice_base@sta/ice_dcb.c.o'.
[1087/2193] Compiling C object 'drivers/net/ice/base/39545a2@@ice_base@sta/ice_controlq.c.o'.
[1088/2193] Compiling C object 'drivers/a715181@@tmp_rte_pmd_iavf@sta/net_iavf_iavf_rxtx_vec_avx2.c.o'.
[1089/2193] Compiling C object 'drivers/a715181@@tmp_rte_pmd_iavf@sta/net_iavf_iavf_rxtx.c.o'.
[1090/2193] Compiling C object 'drivers/net/ice/base/39545a2@@ice_base@sta/ice_common.c.o'.
[1091/2193] Compiling C object 'drivers/net/ice/base/39545a2@@ice_base@sta/ice_sched.c.o'.
[1092/2193] Compiling C object 'drivers/net/ice/base/39545a2@@ice_base@sta/ice_flex_pipe.c.o'.
[1093/2193] Compiling C object 'drivers/net/ice/base/39545a2@@ice_base@sta/ice_flow.c.o'.
[1094/2193] Compiling C object 'drivers/net/ice/base/39545a2@@ice_base@sta/ice_switch.c.o'.
ninja: build stopped: subcommand failed




*Meson Build Failed #2:
OS: FC31-64
Target:./build-gcc-static
FAILED: drivers/rte_pmd_i40e.sym_chk 
/usr/local/bin/meson --internal exe --capture drivers/rte_pmd_i40e.sym_chk -- /root/FC31-64_K5.3.14_GCC9.2.1/x86_64-native-linuxapp-gcc/c3f231f2a66b4fc68f893bf3ca90630b/dpdk/buildtools/check-symbols.sh /root/FC31-64_K5.3.14_GCC9.2.1/x86_64-native-linuxapp-gcc/c3f231f2a66b4fc68f893bf3ca90630b/dpdk/drivers/net/i40e/rte_pmd_i40e_version.map drivers/librte_pmd_i40e.a
rte_pmd_i40e_get_fdir_info is not flagged as experimental
but is listed in version map
Please add __rte_experimental to the definition of rte_pmd_i40e_get_fdir_info
rte_pmd_i40e_get_fdir_stats is not flagged as experimental
but is listed in version map
Please add __rte_experimental to the definition of rte_pmd_i40e_get_fdir_stats
rte_pmd_i40e_set_gre_key_len is not flagged as experimental
but is listed in version map
Please add __rte_experimental to the definition of rte_pmd_i40e_set_gre_key_len
[1066/2194] Compiling C object 'drivers/a715181@@tmp_rte_pmd_hns3@sta/net_hns3_hns3_rss.c.o'.
[1067/2194] Compiling C object 'drivers/a715181@@tmp_rte_pmd_hns3@sta/net_hns3_hns3_stats.c.o'.
[1068/2194] Compiling C object 'drivers/a715181@@tmp_rte_pmd_iavf@sta/net_iavf_iavf_generic_flow.c.o'.
[1069/2194] Compiling C object 'drivers/a715181@@tmp_rte_pmd_hns3@sta/net_hns3_hns3_ethdev.c.o'.
[1070/2194] Compiling C object 'drivers/a715181@@tmp_rte_pmd_iavf@sta/net_iavf_iavf_fdir.c.o'.
[1071/2194] Generating rte_pmd_hinic.sym_chk with a meson_exe.py custom command.
[1072/2194] Compiling C object 'drivers/a715181@@tmp_rte_pmd_iavf@sta/net_iavf_iavf_vchnl.c.o'.
[1073/2194] Compiling C object 'drivers/a715181@@tmp_rte_pmd_hns3@sta/net_hns3_hns3_rxtx.c.o'.
[1074/2194] Compiling C object 'drivers/a715181@@tmp_rte_pmd_iavf@sta/net_iavf_iavf_rxtx.c.o'.
ninja: build stopped: subcommand failed




*Meson Build Failed #3:
OS: FreeBSD1201-64
Target:./build-gcc-static
FAILED: drivers/rte_pmd_i40e.sym_chk 
/usr/local/bin/meson --internal exe --capture drivers/rte_pmd_i40e.sym_chk -- /root/FreeBSD1201-64_K12.1_GCC9.2.0/x86_64-native-bsdapp-gcc/c3f231f2a66b4fc68f893bf3ca90630b/dpdk/buildtools/check-symbols.sh /root/FreeBSD1201-64_K12.1_GCC9.2.0/x86_64-native-bsdapp-gcc/c3f231f2a66b4fc68f893bf3ca90630b/dpdk/drivers/net/i40e/rte_pmd_i40e_version.map drivers/librte_pmd_i40e.a
rte_pmd_i40e_get_fdir_info is not flagged as experimental
but is listed in version map
Please add __rte_experimental to the definition of rte_pmd_i40e_get_fdir_info
rte_pmd_i40e_get_fdir_stats is not flagged as experimental
but is listed in version map
Please add __rte_experimental to the definition of rte_pmd_i40e_get_fdir_stats
rte_pmd_i40e_set_gre_key_len is not flagged as experimental
but is listed in version map
Please add __rte_experimental to the definition of rte_pmd_i40e_set_gre_key_len
[867/1628] Compiling C object 'drivers/net/ice/base/39545a2@@ice_base@sta/ice_switch.c.o'
[868/1628] Compiling C object 'drivers/net/ice/base/39545a2@@ice_base@sta/ice_flex_pipe.c.o'
[869/1628] Generating rte_pmd_iavf.sym_chk with a meson_exe.py custom command
[870/1628] Compiling C object 'drivers/a715181@@tmp_rte_pmd_ice@sta/net_ice_ice_generic_flow.c.o'
[871/1628] Compiling C object 'drivers/a715181@@tmp_rte_pmd_ice@sta/net_ice_ice_hash.c.o'
[872/1628] Compiling C object 'drivers/a715181@@tmp_rte_pmd_ice@sta/net_ice_ice_switch_filter.c.o'
[873/1628] Compiling C object 'drivers/a715181@@tmp_rte_pmd_ice@sta/net_ice_ice_fdir_filter.c.o'
[874/1628] Compiling C object 'drivers/a715181@@tmp_rte_pmd_ice@sta/net_ice_ice_ethdev.c.o'
[875/1628] Compiling C object 'drivers/a715181@@tmp_rte_pmd_ice@sta/net_ice_ice_rxtx.c.o'
ninja: build stopped: subcommand failed




*Meson Build Failed #4:
OS: SUSE15-64
Target:./build-gcc-static
FAILED: drivers/rte_pmd_i40e.sym_chk 
/usr/bin/meson --internal exe /root/SUSE15-64_K4.12.14_GCC7.3.1/x86_64-native-linuxapp-gcc/c3f231f2a66b4fc68f893bf3ca90630b/dpdk/build-gcc-static/meson-private/meson_exe_check-symbols.sh_550005d9547d0331307ae84719c45088520f1373.dat
rte_pmd_i40e_get_fdir_info is not flagged as experimental
but is listed in version map
Please add __rte_experimental to the definition of rte_pmd_i40e_get_fdir_info
rte_pmd_i40e_get_fdir_stats is not flagged as experimental
but is listed in version map
Please add __rte_experimental to the definition of rte_pmd_i40e_get_fdir_stats
rte_pmd_i40e_set_gre_key_len is not flagged as experimental
but is listed in version map
Please add __rte_experimental to the definition of rte_pmd_i40e_set_gre_key_len
[1075/2097] Compiling C object 'drivers/a715181@@tmp_rte_pmd_hns3@sta/net_hns3_hns3_rxtx.c.o'.
[1076/2097] Compiling C object 'drivers/a715181@@tmp_rte_pmd_iavf@sta/net_iavf_iavf_ethdev.c.o'.
[1077/2097] Compiling C object 'drivers/net/ice/base/39545a2@@ice_base@sta/ice_nvm.c.o'.
[1078/2097] Compiling C object 'drivers/a715181@@tmp_rte_pmd_iavf@sta/net_iavf_iavf_rxtx.c.o'.
[1079/2097] Compiling C object 'drivers/a715181@@tmp_rte_pmd_iavf@sta/net_iavf_iavf_rxtx_vec_sse.c.o'.
[1080/2097] Compiling C object 'drivers/a715181@@tmp_rte_pmd_iavf@sta/net_iavf_iavf_rxtx_vec_avx2.c.o'.
[1081/2097] Compiling C object 'drivers/net/ice/base/39545a2@@ice_base@sta/ice_sched.c.o'.
[1082/2097] Compiling C object 'drivers/net/ice/base/39545a2@@ice_base@sta/ice_flex_pipe.c.o'.
[1083/2097] Compiling C object 'drivers/net/ice/base/39545a2@@ice_base@sta/ice_switch.c.o'.
ninja: build stopped: subcommand failed




*Meson Build Failed #5:
OS: UB1804-32
Target:./build-gcc-static
FAILED: drivers/rte_pmd_i40e.sym_chk 
/usr/local/bin/meson --internal exe /root/UB1804-32_K4.15.0_GCC7.3.0/i686-native-linuxapp-gcc/c3f231f2a66b4fc68f893bf3ca90630b/dpdk/build-gcc-static/meson-private/meson_exe_check-symbols.sh_25c809eea8e28e0a9de2d9c45b558bf09b36b210.dat
rte_pmd_i40e_get_fdir_info is not flagged as experimental
but is listed in version map
Please add __rte_experimental to the definition of rte_pmd_i40e_get_fdir_info
rte_pmd_i40e_get_fdir_stats is not flagged as experimental
but is listed in version map
Please add __rte_experimental to the definition of rte_pmd_i40e_get_fdir_stats
rte_pmd_i40e_set_gre_key_len is not flagged as experimental
but is listed in version map
Please add __rte_experimental to the definition of rte_pmd_i40e_set_gre_key_len
[1031/1949] Compiling C object 'drivers/net/ice/base/39545a2@@ice_base@sta/ice_controlq.c.o'.
[1032/1949] Generating rte_pmd_hinic.sym_chk with a meson_exe.py custom command.
[1033/1949] Compiling C object 'drivers/a715181@@tmp_rte_pmd_iavf@sta/net_iavf_iavf_rxtx_vec_sse.c.o'.
[1034/1949] Compiling C object 'drivers/a715181@@tmp_rte_pmd_iavf@sta/net_iavf_iavf_rxtx_vec_avx2.c.o'.
[1035/1949] Compiling C object 'drivers/a715181@@tmp_rte_pmd_iavf@sta/net_iavf_iavf_rxtx.c.o'.
[1036/1949] Compiling C object 'drivers/net/ice/base/39545a2@@ice_base@sta/ice_dcb.c.o'.
[1037/1949] Compiling C object 'drivers/net/ice/base/39545a2@@ice_base@sta/ice_common.c.o'.
[1038/1949] Compiling C object 'drivers/net/ice/base/39545a2@@ice_base@sta/ice_flex_pipe.c.o'.
[1039/1949] Compiling C object 'drivers/net/ice/base/39545a2@@ice_base@sta/ice_sched.c.o'.
[1040/1949] Compiling C object 'drivers/net/ice/base/39545a2@@ice_base@sta/ice_flow.c.o'.
[1041/1949] Compiling C object 'drivers/net/ice/base/39545a2@@ice_base@sta/ice_switch.c.o'.
ninja: build stopped: subcommand failed




*Meson Build Failed #6:
OS: UB1804-64
Target:./build-gcc-static
FAILED: drivers/rte_pmd_i40e.sym_chk 
/usr/local/bin/meson --internal exe --capture drivers/rte_pmd_i40e.sym_chk -- /root/UB1804-64_K4.15.0_GCC7.3.0/x86_64-native-linuxapp-gcc/c3f231f2a66b4fc68f893bf3ca90630b/dpdk/buildtools/check-symbols.sh /root/UB1804-64_K4.15.0_GCC7.3.0/x86_64-native-linuxapp-gcc/c3f231f2a66b4fc68f893bf3ca90630b/dpdk/drivers/net/i40e/rte_pmd_i40e_version.map drivers/librte_pmd_i40e.a
rte_pmd_i40e_get_fdir_info is not flagged as experimental
but is listed in version map
Please add __rte_experimental to the definition of rte_pmd_i40e_get_fdir_info
rte_pmd_i40e_get_fdir_stats is not flagged as experimental
but is listed in version map
Please add __rte_experimental to the definition of rte_pmd_i40e_get_fdir_stats
rte_pmd_i40e_set_gre_key_len is not flagged as experimental
but is listed in version map
Please add __rte_experimental to the definition of rte_pmd_i40e_set_gre_key_len
[1058/2069] Generating rte_pmd_hns3.pmd.c with a custom command.
[1059/2069] Compiling C object 'drivers/net/ice/base/39545a2@@ice_base@sta/ice_nvm.c.o'.
[1060/2069] Compiling C object 'drivers/a715181@@tmp_rte_pmd_iavf@sta/net_iavf_iavf_ethdev.c.o'.
[1061/2069] Compiling C object 'drivers/a715181@@tmp_rte_pmd_iavf@sta/net_iavf_iavf_rxtx_vec_avx2.c.o'.
[1062/2069] Compiling C object 'drivers/a715181@@tmp_rte_pmd_iavf@sta/net_iavf_iavf_rxtx.c.o'.
[1063/2069] Compiling C object 'drivers/a715181@@tmp_rte_pmd_iavf@sta/net_iavf_iavf_rxtx_vec_sse.c.o'.
[1064/2069] Compiling C object 'drivers/net/ice/base/39545a2@@ice_base@sta/ice_flex_pipe.c.o'.
[1065/2069] Compiling C object 'drivers/net/ice/base/39545a2@@ice_base@sta/ice_sched.c.o'.
[1066/2069] Compiling C object 'drivers/net/ice/base/39545a2@@ice_base@sta/ice_switch.c.o'.
ninja: build stopped: subcommand failed




*Meson Build Failed #7:
OS: UB2004-64
Target:./build-gcc-static
FAILED: drivers/rte_pmd_i40e.sym_chk 
/usr/local/bin/meson --internal exe --capture drivers/rte_pmd_i40e.sym_chk -- /root/UB2004-64_K5.4.0_GCC9.3.0/x86_64-native-linuxapp-gcc/c3f231f2a66b4fc68f893bf3ca90630b/dpdk/buildtools/check-symbols.sh /root/UB2004-64_K5.4.0_GCC9.3.0/x86_64-native-linuxapp-gcc/c3f231f2a66b4fc68f893bf3ca90630b/dpdk/drivers/net/i40e/rte_pmd_i40e_version.map drivers/librte_pmd_i40e.a
rte_pmd_i40e_get_fdir_info is not flagged as experimental
but is listed in version map
Please add __rte_experimental to the definition of rte_pmd_i40e_get_fdir_info
rte_pmd_i40e_get_fdir_stats is not flagged as experimental
but is listed in version map
Please add __rte_experimental to the definition of rte_pmd_i40e_get_fdir_stats
rte_pmd_i40e_set_gre_key_len is not flagged as experimental
but is listed in version map
Please add __rte_experimental to the definition of rte_pmd_i40e_set_gre_key_len
[1091/2185] Compiling C object 'drivers/net/ice/base/39545a2@@ice_base@sta/ice_acl.c.o'.
[1092/2185] Compiling C object 'drivers/net/ice/base/39545a2@@ice_base@sta/ice_fdir.c.o'.
[1093/2185] Compiling C object 'drivers/net/ice/base/39545a2@@ice_base@sta/ice_acl_ctrl.c.o'.
[1094/2185] Compiling C object 'drivers/net/ice/base/39545a2@@ice_base@sta/ice_common.c.o'.
[1095/2185] Compiling C object 'drivers/a715181@@tmp_rte_pmd_iavf@sta/net_iavf_iavf_rxtx.c.o'.
[1096/2185] Compiling C object 'drivers/net/ice/base/39545a2@@ice_base@sta/ice_switch.c.o'.
[1097/2185] Compiling C object 'drivers/net/ice/base/39545a2@@ice_base@sta/ice_sched.c.o'.
[1098/2185] Compiling C object 'drivers/net/ice/base/39545a2@@ice_base@sta/ice_flow.c.o'.
[1099/2185] Compiling C object 'drivers/net/ice/base/39545a2@@ice_base@sta/ice_flex_pipe.c.o'.
[1100/2185] Compiling C object 'drivers/a715181@@tmp_rte_pmd_ice@sta/net_ice_ice_ethdev.c.o'.
[1101/2185] Compiling C object 'drivers/a715181@@tmp_rte_pmd_ice@sta/net_ice_ice_rxtx.c.o'.
ninja: build stopped: subcommand failed



DPDK STV team

^ permalink raw reply	[flat|nested] only message in thread

only message in thread, other threads:[~2020-06-12  6:54 UTC | newest]

Thread overview: (only message) (download: mbox.gz / follow: Atom feed)
-- links below jump to the message on this page --
2020-06-12  6:54 [dpdk-test-report] |FAILURE| pw71231[1/5] net/i40e: add private APIs sys_stv

automatic DPDK test reports

This inbox may be cloned and mirrored by anyone:

	git clone --mirror https://inbox.dpdk.org/test-report/0 test-report/git/0.git

	# If you have public-inbox 1.1+ installed, you may
	# initialize and index your mirror using the following commands:
	public-inbox-init -V2 test-report test-report/ https://inbox.dpdk.org/test-report \
		test-report@dpdk.org
	public-inbox-index test-report

Example config snippet for mirrors.
Newsgroup available over NNTP:
	nntp://inbox.dpdk.org/inbox.dpdk.test-report


AGPL code for this site: git clone https://public-inbox.org/public-inbox.git