automatic DPDK test reports
 help / color / mirror / Atom feed
* [dpdk-test-report] |FAILURE| pw(72006) net/mlx5: fix host physical function representor naming
@ 2020-06-23 10:23 sys_stv
  0 siblings, 0 replies; only message in thread
From: sys_stv @ 2020-06-23 10:23 UTC (permalink / raw)
  To: test-report

[-- Attachment #1: Type: text/plain, Size: 11086 bytes --]


Test-Label: Intel-compilation
Test-Status: FAILURE
http://dpdk.org/patch/72006

_Compilation issues_

Submitter: Viacheslav Ovsiienko <viacheslavo@mellanox.com>
Date: 2020-06-23 07:48:34
Reply_mail: 1592898514-15422-1-git-send-email-viacheslavo@mellanox.com

DPDK git baseline: Repo:dpdk, CommitID: 2e40fdc2d305e6864c8840a0985018edc94562d5


Meson build Summary: 9 Builds Done, 8 Successful, 1 Failures, 0 Blocked

Makefile build Summary: 23 Builds Done, 23 Successful, 0 Failures, 0 Blocked

                +==============================================+===========+==========+
                |                   Makefile                   |   Meson   | Document |
+----------------+------+-------+------+------------+-----------+-----------+----------+
| os             | gcc  | clang | icc  | gcc+shared | gcc+debug | gcc/clang | pdf/html |
+----------------+------+-------+------+------------+-----------+-----------+----------+
| UB2004-64      | pass | pass  | pass |            |           | pass      |          |
| UB1804-64      | pass | pass  | pass |            |           | pass      | pass     |
| FC32-64        | pass | pass  |      |            |           |           |          |
| CENTOS77-64    | pass |       |      |            |           |           |          |
| FC31-64        |      |       |      |            |           | pass      |          |
| WIN10-64       |      |       |      |            |           | pass      |          |
| CENTOS80-64    | pass | pass  | pass | pass       | pass      | FAIL      |          |
| UB1804-32      | pass |       |      |            |           | pass      |          |
| RHEL80-64      | pass |       |      |            |           |           |          |
| FreeBSD1201-64 | pass | pass  |      | pass       | pass      | pass      |          |
| RHEL77-64      | pass |       |      |            |           |           |          |
| SUSE15-64      | pass | pass  |      |            |           | pass      |          |
+----------------+------+-------+------+------------+-----------+-----------+----------+
Test environment and configuration as below:

** Makefile build **


OS: UB2004-64
	Kernel Version: 5.4.0-26-generic
	CPU info: Intel(R) Xeon(R) Platinum 8180 CPU @ 2.50GHz
	GCC Version: gcc (Ubuntu 9.3.0-10ubuntu2) 9.3.0
	Clang Version: 10.0.0-4ubuntu1
	x86_64-native-linuxapp-clang
	x86_64-native-linuxapp-gcc
	x86_64-native-linuxapp-icc


OS: UB1804-64
	Kernel Version: 4.15.0-20-generic
	CPU info: Intel(R) Xeon(R) CPU E5-2699 v3 @ 2.30GHz
	GCC Version: gcc (Ubuntu 7.3.0-16ubuntu3) 7.3.0
	Clang Version: 6.0.0-1ubuntu2 (tags/RELEASE_600/final)
	x86_64-native-linuxapp-clang
	x86_64-native-linuxapp-gcc
	x86_64-native-linuxapp-icc


OS: FC32-64
	Kernel Version: 5.6.0-0.rc7.git0.2.fc32.x86_64
	CPU info: Intel(R) Xeon(R) Platinum 8280M CPU @ 2.70GHz
	GCC Version: gcc (GCC) 10.0.1 20200311 (Red Hat 10.0.1-0.9)
	Clang Version: 10.0.0 (Fedora 10.0.0-0.3.rc4.fc32)
	x86_64-native-linuxapp-gcc
	x86_64-native-linuxapp-clang


OS: CENTOS77-64
	Kernel Version: 3.10.0-1062.9.1.el7.x86_64
	CPU info: Intel(R) Xeon(R) Platinum 8280M CPU @ 2.70GHz
	GCC Version: gcc (GCC) 4.8.5 20150623 (Red Hat 4.8.5-39)
	Clang Version: 3.4.2 (tags/RELEASE_34/dot2-final)
	x86_64-native-linuxapp-gcc


OS: CENTOS80-64
	Kernel Version: 4.18.0-80.11.2.el8_0.x86_64
	CPU info: Intel(R) Xeon(R) Platinum 8280M CPU @ 2.70GHz
	GCC Version: gcc (GCC) 8.2.1 20180905 (Red Hat 8.2.1-3)
	Clang Version: 7.0.1 (tags/RELEASE_701/final)
	x86_64-native-linuxapp-gcc
	x86_64-native-linuxapp-clang
	x86_64-native-linuxapp-icc
	x86_64-native-linuxapp-gcc+shared
	x86_64-native-linuxapp-gcc+debug


OS: UB1804-32
	Kernel Version: 4.15.0-20-generic
	CPU info: Intel(R) Xeon(R) Platinum 8180 CPU @ 2.50GHz
	GCC Version: gcc (Ubuntu 7.5.0-3ubuntu1~18.04) 7.5.0
	Clang Version: 6.0.0-1ubuntu2 (tags/RELEASE_600/final)
	i686-native-linuxapp-gcc


OS: RHEL80-64
	Kernel Version: 4.18.0-80.el8.x86_64
	CPU info: Intel(R) Xeon(R) Platinum 8280M CPU @ 2.70GHz
	GCC Version: gcc (GCC) 8.2.1 20180905 (Red Hat 8.2.1-3)
	Clang Version: 6.0.1 (tags/RELEASE_601/final)
	x86_64-native-linuxapp-gcc


OS: FreeBSD1201-64
	Kernel Version: 12.1-RELEASE
	CPU info: Intel(R) Xeon(R) CPU E5-2699 v3 @ 2.30GHz (2294.74-MHz K8-class CPU)
	GCC Version: gcc (FreeBSD Ports Collection) 9.2.0
	Clang Version: 8.0.1 (tags/RELEASE_801/final 366581) (based on LLVM 8.0.1)
	x86_64-native-bsdapp-gcc
	x86_64-native-bsdapp-clang
	x86_64-native-bsdapp-gcc+shared
	x86_64-native-bsdapp-gcc+debug


OS: RHEL77-64
	Kernel Version: 3.10.0-1062.9.1.el7.x86_64
	CPU info: Intel(R) Xeon(R) CPU E5-2699 v3 @ 2.30GHz
	GCC Version: gcc (GCC) 4.8.5 20150623 (Red Hat 4.8.5-39)
	Clang Version: 3.4.2 (tags/RELEASE_34/dot2-final)
	x86_64-native-linuxapp-gcc


OS: SUSE15-64
	Kernel Version: 4.12.14-lp150.11-default
	CPU info: Intel(R) Xeon(R) CPU E5-2699 v4 @ 2.20GHz
	GCC Version: gcc (SUSE Linux) 7.3.1 20180323 [gcc-7-branch revision 258812]
	Clang Version: 5.0.1 (tags/RELEASE_501/final 312548)
	x86_64-native-linuxapp-clang
	x86_64-native-linuxapp-gcc

** Meson build **


OS: UB2004-64
	Kernel Version: 5.4.0-26-generic
	CPU info: Intel(R) Xeon(R) CPU E5-2699 v4 @ 2.20GHz
	GCC Version: gcc (Ubuntu 9.3.0-10ubuntu2) 9.3.0
	Clang Version: 10.0.0-4ubuntu1
	./build-gcc-static
	./build-gcc-shared
	./build-clang-static
	./build-clang-shared
	./build-x86-default


OS: UB1804-64
	Kernel Version: 4.15.0-20-generic
	CPU info: Intel(R) Xeon(R) Platinum 8180 CPU @ 2.50GHz
	GCC Version: gcc (Ubuntu 7.3.0-16ubuntu3) 7.3.0
	Clang Version: 6.0.0-1ubuntu2 (tags/RELEASE_600/final)
	x86_64-native-linuxapp-doc
	./build-gcc-static
	./build-gcc-shared
	./build-clang-static
	./build-clang-shared
	./build-x86-default


OS: WIN10-64
	Kernel Version: N/A
	CPU info: N/A
	GCC Version: N/A
	Clang Version: Clang 8.0.0
	x86_64-windows-clang


OS: CENTOS80-64
	Kernel Version: 4.18.0-147.8.1.el8_1.x86_64
	CPU info: Intel(R) Xeon(R) CPU E5-2699 v4 @ 2.20GHz
	GCC Version: gcc (GCC) 8.3.1 20190507 (Red Hat 8.3.1-4)
	Clang Version: 8.0.1 (Red Hat 8.0.1-1.module_el8.1.0+215+a01033fb)
	./build-gcc-static
	./build-gcc-shared
	./build-clang-static
	./build-clang-shared
	./build-x86-default


OS: FC31-64
	Kernel Version: 5.4.18-200.fc31.x86_64
	CPU info: Intel(R) Xeon(R) Platinum 8180 CPU @ 2.50GHz
	GCC Version: gcc (GCC) 9.2.1 20190827 (Red Hat 9.2.1-1)
	Clang Version: 9.0.0 (Fedora 9.0.0-1.fc31)
	./build-gcc-static
	./build-gcc-shared
	./build-clang-static
	./build-clang-shared
	./build-x86-default


OS: UB1804-32
	Kernel Version: 4.15.0-20-generic
	CPU info: Intel(R) Xeon(R) CPU E5-2699 v4 @ 2.20GHz
	GCC Version: gcc (Ubuntu 7.5.0-3ubuntu1~18.04) 7.5.0
	Clang Version: 6.0.0-1ubuntu2 (tags/RELEASE_600/final)
	./build-gcc-static
	./build-gcc-shared
	./build-clang-static
	./build-clang-shared
	./build-x86-default


OS: FreeBSD1201-64
	Kernel Version: 12.1-RELEASE
	CPU info: Intel(R) Xeon(R) CPU E5-2699 v4 @ 2.20GHz (2194.97-MHz K8-class CPU)
	GCC Version: gcc (FreeBSD Ports Collection) 9.2.0
	Clang Version: 8.0.1 (tags/RELEASE_801/final 366581) (based on LLVM 8.0.1)
	./build-gcc-static
	./build-gcc-shared
	./build-clang-static
	./build-clang-shared
	./build-x86-default


OS: SUSE15-64
	Kernel Version: 4.12.14-lp150.12.82-default
	CPU info: Intel(R) Xeon(R) CPU E5-2699 v4 @ 2.20GHz
	GCC Version: gcc (SUSE Linux) 7.4.1 20190905 [gcc-7-branch revision 275407]
	Clang Version: 5.0.1 (tags/RELEASE_501/final 312548)
	./build-gcc-static
	./build-gcc-shared
	./build-clang-static
	./build-clang-shared
	./build-x86-default



*Meson Build Failed #1:
OS: CENTOS80-64
Target:./build-gcc-static
FAILED: lib/76b5a35@@rte_pipeline@sta/librte_pipeline_rte_table_action.c.o 
cc -Ilib/76b5a35@@rte_pipeline@sta -Ilib -I../lib -Ilib/librte_pipeline -I../lib/librte_pipeline -I. -I../ -Iconfig -I../config -Ilib/librte_eal/include -I../lib/librte_eal/include -Ilib/librte_eal/linux/include -I../lib/librte_eal/linux/include -Ilib/librte_eal/x86/include -I../lib/librte_eal/x86/include -Ilib/librte_eal/common -I../lib/librte_eal/common -Ilib/librte_eal -I../lib/librte_eal -Ilib/librte_kvargs -I../lib/librte_kvargs -Ilib/librte_telemetry/../librte_metrics -I../lib/librte_telemetry/../librte_metrics -Ilib/librte_telemetry -I../lib/librte_telemetry -Ilib/librte_port -I../lib/librte_port -Ilib/librte_ethdev -I../lib/librte_ethdev -Ilib/librte_net -I../lib/librte_net -Ilib/librte_mbuf -I../lib/librte_mbuf -Ilib/librte_mempool -I../lib/librte_mempool -Ilib/librte_ring -I../lib/librte_ring -Ilib/librte_meter -I../lib/librte_meter -Ilib/librte_sched -I../lib/librte_sched -Ilib/librte_ip_frag -I../lib/librte_ip_frag -Ilib/librte_hash -I../lib/librte_hash -Ilib/librte_cryptodev -I../lib/librte_cryptodev -Ilib/librte_eventdev -I../lib/librte_eventdev -Ilib/librte_timer -I../lib/librte_timer -Ilib/librte_kni -I../lib/librte_kni -Ilib/librte_pci -I../lib/librte_pci -Ilib/librte_table -I../lib/librte_table -Ilib/librte_lpm -I../lib/librte_lpm -Ilib/librte_acl -I../lib/librte_acl -fdiagnostics-color=always -pipe -D_FILE_OFFSET_BITS=64 -Wall -Winvalid-pch -Werror -O2 -g -include rte_config.h -Wextra -Wcast-qual -Wdeprecated -Wformat-nonliteral -Wformat-security -Wmissing-declarations -Wmissing-prototypes -Wnested-externs -Wold-style-definition -Wpointer-arith -Wsign-compare -Wstrict-prototypes -Wundef -Wwrite-strings -Wno-packed-not-aligned -Wno-missing-field-initializers -D_GNU_SOURCE -fPIC -march=nehalem -mno-avx512f -DALLOW_EXPERIMENTAL_API -DALLOW_INTERNAL_API -Wno-format-truncation -MD -MQ 'lib/76b5a35@@rte_pipeline@sta/librte_pipeline_rte_table_action.c.o' -MF 'lib/76b5a35@@rte_pipeline@sta/librte_pipeline_rte_table_action.c.o.d' -o 'lib/76b5a35@@rte_pipeline@sta/librte_pipeline_rte_table_action.c.o' -c ../lib/librte_pipeline/rte_table_action.c
{standard input}: Assembler messages:
{standard input}:2241: Warning: end of file not at end of a line; newline inserted
{standard input}: Error: open CFI at the end of file; missing .cfi_endproc directive
cc: fatal error: Killed signal terminated program cc1
compilation terminated.
[2380/2414] Linking target examples/dpdk-vdpa.
[2381/2414] Linking target examples/dpdk-tep_termination.
[2382/2414] Compiling C object 'examples/c590b3c@@dpdk-vhost_blk@exe/vhost_blk_vhost_blk_compat.c.o'.
[2383/2414] Compiling C object 'examples/c590b3c@@dpdk-vhost_blk@exe/vhost_blk_blk.c.o'.
[2384/2414] Compiling C object 'examples/c590b3c@@dpdk-vhost_blk@exe/vhost_blk_vhost_blk.c.o'.
[2385/2414] Compiling C object 'examples/c590b3c@@dpdk-vhost_crypto@exe/vhost_crypto_main.c.o'.
[2386/2414] Compiling C object 'examples/c590b3c@@dpdk-vhost@exe/vhost_virtio_net.c.o'.
[2387/2414] Compiling C object 'app/test/3062f5d@@dpdk-test@exe/test_memcpy_perf.c.o'.
[2388/2414] Compiling C object 'drivers/a715181@@tmp_rte_pmd_octeontx2_event@sta/event_octeontx2_otx2_worker.c.o'.
[2389/2414] Compiling C object 'app/test/3062f5d@@dpdk-test@exe/test_ring.c.o'.
[2390/2414] Compiling C object 'drivers/a715181@@tmp_rte_pmd_octeontx2_event@sta/event_octeontx2_otx2_worker_dual.c.o'.
ninja: build stopped: subcommand failed


DPDK STV team

^ permalink raw reply	[flat|nested] only message in thread

only message in thread, other threads:[~2020-06-23 10:24 UTC | newest]

Thread overview: (only message) (download: mbox.gz / follow: Atom feed)
-- links below jump to the message on this page --
2020-06-23 10:23 [dpdk-test-report] |FAILURE| pw(72006) net/mlx5: fix host physical function representor naming sys_stv

automatic DPDK test reports

This inbox may be cloned and mirrored by anyone:

	git clone --mirror https://inbox.dpdk.org/test-report/0 test-report/git/0.git

	# If you have public-inbox 1.1+ installed, you may
	# initialize and index your mirror using the following commands:
	public-inbox-init -V2 test-report test-report/ https://inbox.dpdk.org/test-report \
		test-report@dpdk.org
	public-inbox-index test-report

Example config snippet for mirrors.
Newsgroup available over NNTP:
	nntp://inbox.dpdk.org/inbox.dpdk.test-report


AGPL code for this site: git clone https://public-inbox.org/public-inbox.git