automatic DPDK test reports
 help / color / mirror / Atom feed
* [dpdk-test-report]  |FAILURE| pw(72037) [v5, 3/4] drivers/net: fix in i40e HW rings memory overlap
@ 2020-06-23 16:56 sys_stv
  0 siblings, 0 replies; only message in thread
From: sys_stv @ 2020-06-23 16:56 UTC (permalink / raw)
  To: test-report

[-- Attachment #1: Type: text/plain, Size: 62258 bytes --]


Test-Label: Intel-compilation
Test-Status: FAILURE
http://dpdk.org/patch/72037

_Compilation issues_

Submitter: Renata Saiakhova <renata.saiakhova@ekinops.com>
Date: 2020-06-23 13:42:14
Reply_mail: 20200623134215.31092-4-Renata.Saiakhova@ekinops.com

DPDK git baseline: Repo:dpdk-next-net, CommitID: a739f449ae887b7b663225424f2acccd70906b07


Meson build Summary: 9 Builds Done, 2 Successful, 7 Failures, 0 Blocked

Makefile build Summary: 23 Builds Done, 23 Successful, 0 Failures, 0 Blocked

                +==============================================+===========+==========+
                |                   Makefile                   |   Meson   | Document |
+----------------+------+-------+------+------------+-----------+-----------+----------+
| os             | gcc  | clang | icc  | gcc+shared | gcc+debug | gcc/clang | pdf/html |
+----------------+------+-------+------+------------+-----------+-----------+----------+
| UB2004-64      | pass | pass  | pass |            |           | FAIL      |          |
| UB1804-64      | pass | pass  | pass |            |           | FAIL      | pass     |
| FC32-64        | pass | pass  |      |            |           |           |          |
| CENTOS77-64    | pass |       |      |            |           |           |          |
| FC31-64        |      |       |      |            |           | FAIL      |          |
| WIN10-64       |      |       |      |            |           | pass      |          |
| CENTOS80-64    | pass | pass  | pass | pass       | pass      | FAIL      |          |
| UB1804-32      | pass |       |      |            |           | FAIL      |          |
| RHEL80-64      | pass |       |      |            |           |           |          |
| FreeBSD1201-64 | pass | pass  |      | pass       | pass      | FAIL      |          |
| RHEL77-64      | pass |       |      |            |           |           |          |
| SUSE15-64      | pass | pass  |      |            |           | FAIL      |          |
+----------------+------+-------+------+------------+-----------+-----------+----------+
Test environment and configuration as below:

** Makefile build **


OS: UB2004-64
	Kernel Version: 5.4.0-26-generic
	CPU info: Intel(R) Xeon(R) Platinum 8180 CPU @ 2.50GHz
	GCC Version: gcc (Ubuntu 9.3.0-10ubuntu2) 9.3.0
	Clang Version: 10.0.0-4ubuntu1
	x86_64-native-linuxapp-clang
	x86_64-native-linuxapp-gcc
	x86_64-native-linuxapp-icc


OS: UB1804-64
	Kernel Version: 4.15.0-20-generic
	CPU info: Intel(R) Xeon(R) CPU E5-2699 v3 @ 2.30GHz
	GCC Version: gcc (Ubuntu 7.3.0-16ubuntu3) 7.3.0
	Clang Version: 6.0.0-1ubuntu2 (tags/RELEASE_600/final)
	x86_64-native-linuxapp-clang
	x86_64-native-linuxapp-gcc
	x86_64-native-linuxapp-icc


OS: FC32-64
	Kernel Version: 5.6.0-0.rc7.git0.2.fc32.x86_64
	CPU info: Intel(R) Xeon(R) Platinum 8280M CPU @ 2.70GHz
	GCC Version: gcc (GCC) 10.0.1 20200311 (Red Hat 10.0.1-0.9)
	Clang Version: 10.0.0 (Fedora 10.0.0-0.3.rc4.fc32)
	x86_64-native-linuxapp-gcc
	x86_64-native-linuxapp-clang


OS: CENTOS77-64
	Kernel Version: 3.10.0-1062.9.1.el7.x86_64
	CPU info: Intel(R) Xeon(R) Platinum 8280M CPU @ 2.70GHz
	GCC Version: gcc (GCC) 4.8.5 20150623 (Red Hat 4.8.5-39)
	Clang Version: 3.4.2 (tags/RELEASE_34/dot2-final)
	x86_64-native-linuxapp-gcc


OS: CENTOS80-64
	Kernel Version: 4.18.0-80.11.2.el8_0.x86_64
	CPU info: Intel(R) Xeon(R) Platinum 8280M CPU @ 2.70GHz
	GCC Version: gcc (GCC) 8.2.1 20180905 (Red Hat 8.2.1-3)
	Clang Version: 7.0.1 (tags/RELEASE_701/final)
	x86_64-native-linuxapp-gcc
	x86_64-native-linuxapp-clang
	x86_64-native-linuxapp-icc
	x86_64-native-linuxapp-gcc+shared
	x86_64-native-linuxapp-gcc+debug


OS: UB1804-32
	Kernel Version: 4.15.0-20-generic
	CPU info: Intel(R) Xeon(R) Platinum 8180 CPU @ 2.50GHz
	GCC Version: gcc (Ubuntu 7.5.0-3ubuntu1~18.04) 7.5.0
	Clang Version: 6.0.0-1ubuntu2 (tags/RELEASE_600/final)
	i686-native-linuxapp-gcc


OS: RHEL80-64
	Kernel Version: 4.18.0-80.el8.x86_64
	CPU info: Intel(R) Xeon(R) Platinum 8280M CPU @ 2.70GHz
	GCC Version: gcc (GCC) 8.2.1 20180905 (Red Hat 8.2.1-3)
	Clang Version: 6.0.1 (tags/RELEASE_601/final)
	x86_64-native-linuxapp-gcc


OS: FreeBSD1201-64
	Kernel Version: 12.1-RELEASE
	CPU info: Intel(R) Xeon(R) CPU E5-2699 v3 @ 2.30GHz (2294.74-MHz K8-class CPU)
	GCC Version: gcc (FreeBSD Ports Collection) 9.2.0
	Clang Version: 8.0.1 (tags/RELEASE_801/final 366581) (based on LLVM 8.0.1)
	x86_64-native-bsdapp-gcc
	x86_64-native-bsdapp-clang
	x86_64-native-bsdapp-gcc+shared
	x86_64-native-bsdapp-gcc+debug


OS: RHEL77-64
	Kernel Version: 3.10.0-1062.9.1.el7.x86_64
	CPU info: Intel(R) Xeon(R) CPU E5-2699 v3 @ 2.30GHz
	GCC Version: gcc (GCC) 4.8.5 20150623 (Red Hat 4.8.5-39)
	Clang Version: 3.4.2 (tags/RELEASE_34/dot2-final)
	x86_64-native-linuxapp-gcc


OS: SUSE15-64
	Kernel Version: 4.12.14-lp150.11-default
	CPU info: Intel(R) Xeon(R) CPU E5-2699 v4 @ 2.20GHz
	GCC Version: gcc (SUSE Linux) 7.3.1 20180323 [gcc-7-branch revision 258812]
	Clang Version: 5.0.1 (tags/RELEASE_501/final 312548)
	x86_64-native-linuxapp-clang
	x86_64-native-linuxapp-gcc

** Meson build **


OS: UB2004-64
	Kernel Version: 5.4.0-26-generic
	CPU info: Intel(R) Xeon(R) CPU E5-2699 v4 @ 2.20GHz
	GCC Version: gcc (Ubuntu 9.3.0-10ubuntu2) 9.3.0
	Clang Version: 10.0.0-4ubuntu1
	./build-gcc-static
	./build-gcc-shared
	./build-clang-static
	./build-clang-shared
	./build-x86-default


OS: UB1804-64
	Kernel Version: 4.15.0-20-generic
	CPU info: Intel(R) Xeon(R) Platinum 8180 CPU @ 2.50GHz
	GCC Version: gcc (Ubuntu 7.3.0-16ubuntu3) 7.3.0
	Clang Version: 6.0.0-1ubuntu2 (tags/RELEASE_600/final)
	x86_64-native-linuxapp-doc
	./build-gcc-static
	./build-gcc-shared
	./build-clang-static
	./build-clang-shared
	./build-x86-default


OS: WIN10-64
	Kernel Version: N/A
	CPU info: N/A
	GCC Version: N/A
	Clang Version: Clang 8.0.0
	x86_64-windows-clang


OS: CENTOS80-64
	Kernel Version: 4.18.0-147.8.1.el8_1.x86_64
	CPU info: Intel(R) Xeon(R) CPU E5-2699 v4 @ 2.20GHz
	GCC Version: gcc (GCC) 8.3.1 20190507 (Red Hat 8.3.1-4)
	Clang Version: 8.0.1 (Red Hat 8.0.1-1.module_el8.1.0+215+a01033fb)
	./build-gcc-static
	./build-gcc-shared
	./build-clang-static
	./build-clang-shared
	./build-x86-default


OS: FC31-64
	Kernel Version: 5.4.18-200.fc31.x86_64
	CPU info: Intel(R) Xeon(R) Platinum 8180 CPU @ 2.50GHz
	GCC Version: gcc (GCC) 9.2.1 20190827 (Red Hat 9.2.1-1)
	Clang Version: 9.0.0 (Fedora 9.0.0-1.fc31)
	./build-gcc-static
	./build-gcc-shared
	./build-clang-static
	./build-clang-shared
	./build-x86-default


OS: UB1804-32
	Kernel Version: 4.15.0-20-generic
	CPU info: Intel(R) Xeon(R) CPU E5-2699 v4 @ 2.20GHz
	GCC Version: gcc (Ubuntu 7.5.0-3ubuntu1~18.04) 7.5.0
	Clang Version: 6.0.0-1ubuntu2 (tags/RELEASE_600/final)
	./build-gcc-static
	./build-gcc-shared
	./build-clang-static
	./build-clang-shared
	./build-x86-default


OS: FreeBSD1201-64
	Kernel Version: 12.1-RELEASE
	CPU info: Intel(R) Xeon(R) CPU E5-2699 v4 @ 2.20GHz (2194.97-MHz K8-class CPU)
	GCC Version: gcc (FreeBSD Ports Collection) 9.2.0
	Clang Version: 8.0.1 (tags/RELEASE_801/final 366581) (based on LLVM 8.0.1)
	./build-gcc-static
	./build-gcc-shared
	./build-clang-static
	./build-clang-shared
	./build-x86-default


OS: SUSE15-64
	Kernel Version: 4.12.14-lp150.12.82-default
	CPU info: Intel(R) Xeon(R) CPU E5-2699 v4 @ 2.20GHz
	GCC Version: gcc (SUSE Linux) 7.4.1 20190905 [gcc-7-branch revision 275407]
	Clang Version: 5.0.1 (tags/RELEASE_501/final 312548)
	./build-gcc-static
	./build-gcc-shared
	./build-clang-static
	./build-clang-shared
	./build-x86-default



*Meson Build Failed #1:
OS: CENTOS80-64
Target:./build-gcc-static
FAILED: app/a172ced@@dpdk-testpmd@exe/test-pmd_config.c.o 
clang -Iapp/a172ced@@dpdk-testpmd@exe -Iapp -I../app -Ilib/librte_ethdev -I../lib/librte_ethdev -I. -I../ -Iconfig -I../config -Ilib/librte_eal/include -I../lib/librte_eal/include -Ilib/librte_eal/linux/include -I../lib/librte_eal/linux/include -Ilib/librte_eal/x86/include -I../lib/librte_eal/x86/include -Ilib/librte_eal/common -I../lib/librte_eal/common -Ilib/librte_eal -I../lib/librte_eal -Ilib/librte_kvargs -I../lib/librte_kvargs -Ilib/librte_telemetry/../librte_metrics -I../lib/librte_telemetry/../librte_metrics -Ilib/librte_telemetry -I../lib/librte_telemetry -Ilib/librte_net -I../lib/librte_net -Ilib/librte_mbuf -I../lib/librte_mbuf -Ilib/librte_mempool -I../lib/librte_mempool -Ilib/librte_ring -I../lib/librte_ring -Ilib/librte_meter -I../lib/librte_meter -Ilib/librte_gro -I../lib/librte_gro -Ilib/librte_gso -I../lib/librte_gso -Ilib/librte_cmdline -I../lib/librte_cmdline -Ilib/librte_metrics -I../lib/librte_metrics -Idrivers/bus/pci -I../drivers/bus/pci -I../drivers/bus/pci/linux -Ilib/librte_pci -I../lib/librte_pci -Ilib/librte_pdump -I../lib/librte_pdump -Idrivers/net/bnxt -I../drivers/net/bnxt -I../drivers/net/bnxt/tf_ulp -I../drivers/net/bnxt/tf_core -Idrivers/bus/vdev -I../drivers/bus/vdev -Idrivers/net/i40e -I../drivers/net/i40e -Idrivers/net/i40e/base -I../drivers/net/i40e/base -Ilib/librte_hash -I../lib/librte_hash -Idrivers/net/ixgbe -I../drivers/net/ixgbe -Idrivers/net/ixgbe/base -I../drivers/net/ixgbe/base -Ilib/librte_security -I../lib/librte_security -Ilib/librte_cryptodev -I../lib/librte_cryptodev -Idrivers/net/softnic -I../drivers/net/softnic -Ilib/librte_pipeline -I../lib/librte_pipeline -Ilib/librte_port -I../lib/librte_port -Ilib/librte_sched -I../lib/librte_sched -Ilib/librte_ip_frag -I../lib/librte_ip_frag -Ilib/librte_eventdev -I../lib/librte_eventdev -Ilib/librte_timer -I../lib/librte_timer -Ilib/librte_kni -I../lib/librte_kni -Ilib/librte_table -I../lib/librte_table -Ilib/librte_lpm -I../lib/librte_lpm -Ilib/librte_acl -I../lib/librte_acl -Idrivers/bus/dpaa -I../drivers/bus/dpaa -I../drivers/bus/dpaa/include -I../drivers/bus/dpaa/base/qbman -Idrivers/common/dpaax -I../drivers/common/dpaax -I../drivers/common/dpaax/caamflib -Idrivers/mempool/dpaa -I../drivers/mempool/dpaa -Idrivers/net/dpaa -I../drivers/net/dpaa -Ilib/librte_bpf -I../lib/librte_bpf -Xclang -fcolor-diagnostics -pipe -D_FILE_OFFSET_BITS=64 -Wall -Winvalid-pch -Werror -O2 -g -include rte_config.h -Wextra -Wcast-qual -Wdeprecated -Wformat-nonliteral -Wformat-security -Wmissing-declarations -Wmissing-prototypes -Wnested-externs -Wold-style-definition -Wpointer-arith -Wsign-compare -Wstrict-prototypes -Wundef -Wwrite-strings -Wno-address-of-packed-member -Wno-missing-field-initializers -D_GNU_SOURCE -march=native -mno-avx512f -DALLOW_EXPERIMENTAL_API -Wno-deprecated-declarations -MD -MQ 'app/a172ced@@dpdk-testpmd@exe/test-pmd_config.c.o' -MF 'app/a172ced@@dpdk-testpmd@exe/test-pmd_config.c.o.d' -o 'app/a172ced@@dpdk-testpmd@exe/test-pmd_config.c.o' -c ../app/test-pmd/config.c
In file included from ../app/test-pmd/config.c:43:
In file included from ../drivers/net/ixgbe/rte_pmd_ixgbe.h:14:
../lib/librte_ethdev/rte_ethdev_driver.h:195:1: error: unknown attribute 'error' ignored [-Werror,-Wunknown-attributes]
__rte_internal
^
../lib/librte_eal/include/rte_compat.h:25:16: note: expanded from macro '__rte_internal'
__attribute__((error("Symbol is not public ABI"), \
               ^
1 error generated.
[2007/2197] Compiling C object 'app/a172ced@@dpdk-testpmd@exe/test-pmd_cmdline.c.o'.
FAILED: app/a172ced@@dpdk-testpmd@exe/test-pmd_cmdline.c.o 
clang -Iapp/a172ced@@dpdk-testpmd@exe -Iapp -I../app -Ilib/librte_ethdev -I../lib/librte_ethdev -I. -I../ -Iconfig -I../config -Ilib/librte_eal/include -I../lib/librte_eal/include -Ilib/librte_eal/linux/include -I../lib/librte_eal/linux/include -Ilib/librte_eal/x86/include -I../lib/librte_eal/x86/include -Ilib/librte_eal/common -I../lib/librte_eal/common -Ilib/librte_eal -I../lib/librte_eal -Ilib/librte_kvargs -I../lib/librte_kvargs -Ilib/librte_telemetry/../librte_metrics -I../lib/librte_telemetry/../librte_metrics -Ilib/librte_telemetry -I../lib/librte_telemetry -Ilib/librte_net -I../lib/librte_net -Ilib/librte_mbuf -I../lib/librte_mbuf -Ilib/librte_mempool -I../lib/librte_mempool -Ilib/librte_ring -I../lib/librte_ring -Ilib/librte_meter -I../lib/librte_meter -Ilib/librte_gro -I../lib/librte_gro -Ilib/librte_gso -I../lib/librte_gso -Ilib/librte_cmdline -I../lib/librte_cmdline -Ilib/librte_metrics -I../lib/librte_metrics -Idrivers/bus/pci -I../drivers/bus/pci -I../drivers/bus/pci/linux -Ilib/librte_pci -I../lib/librte_pci -Ilib/librte_pdump -I../lib/librte_pdump -Idrivers/net/bnxt -I../drivers/net/bnxt -I../drivers/net/bnxt/tf_ulp -I../drivers/net/bnxt/tf_core -Idrivers/bus/vdev -I../drivers/bus/vdev -Idrivers/net/i40e -I../drivers/net/i40e -Idrivers/net/i40e/base -I../drivers/net/i40e/base -Ilib/librte_hash -I../lib/librte_hash -Idrivers/net/ixgbe -I../drivers/net/ixgbe -Idrivers/net/ixgbe/base -I../drivers/net/ixgbe/base -Ilib/librte_security -I../lib/librte_security -Ilib/librte_cryptodev -I../lib/librte_cryptodev -Idrivers/net/softnic -I../drivers/net/softnic -Ilib/librte_pipeline -I../lib/librte_pipeline -Ilib/librte_port -I../lib/librte_port -Ilib/librte_sched -I../lib/librte_sched -Ilib/librte_ip_frag -I../lib/librte_ip_frag -Ilib/librte_eventdev -I../lib/librte_eventdev -Ilib/librte_timer -I../lib/librte_timer -Ilib/librte_kni -I../lib/librte_kni -Ilib/librte_table -I../lib/librte_table -Ilib/librte_lpm -I../lib/librte_lpm -Ilib/librte_acl -I../lib/librte_acl -Idrivers/bus/dpaa -I../drivers/bus/dpaa -I../drivers/bus/dpaa/include -I../drivers/bus/dpaa/base/qbman -Idrivers/common/dpaax -I../drivers/common/dpaax -I../drivers/common/dpaax/caamflib -Idrivers/mempool/dpaa -I../drivers/mempool/dpaa -Idrivers/net/dpaa -I../drivers/net/dpaa -Ilib/librte_bpf -I../lib/librte_bpf -Xclang -fcolor-diagnostics -pipe -D_FILE_OFFSET_BITS=64 -Wall -Winvalid-pch -Werror -O2 -g -include rte_config.h -Wextra -Wcast-qual -Wdeprecated -Wformat-nonliteral -Wformat-security -Wmissing-declarations -Wmissing-prototypes -Wnested-externs -Wold-style-definition -Wpointer-arith -Wsign-compare -Wstrict-prototypes -Wundef -Wwrite-strings -Wno-address-of-packed-member -Wno-missing-field-initializers -D_GNU_SOURCE -march=native -mno-avx512f -DALLOW_EXPERIMENTAL_API -Wno-deprecated-declarations -MD -MQ 'app/a172ced@@dpdk-testpmd@exe/test-pmd_cmdline.c.o' -MF 'app/a172ced@@dpdk-testpmd@exe/test-pmd_cmdline.c.o.d' -o 'app/a172ced@@dpdk-testpmd@exe/test-pmd_cmdline.c.o' -c ../app/test-pmd/cmdline.c
In file included from ../app/test-pmd/cmdline.c:58:
In file included from ../drivers/net/dpaa/rte_pmd_dpaa.h:18:
../lib/librte_ethdev/rte_ethdev_driver.h:195:1: error: unknown attribute 'error' ignored [-Werror,-Wunknown-attributes]
__rte_internal
^
../lib/librte_eal/include/rte_compat.h:25:16: note: expanded from macro '__rte_internal'
__attribute__((error("Symbol is not public ABI"), \
               ^
1 error generated.
[2008/2197] Compiling C object 'app/a172ced@@dpdk-testpmd@exe/test-pmd_macfwd.c.o'.
[2009/2197] Compiling C object 'app/a172ced@@dpdk-testpmd@exe/test-pmd_macswap.c.o'.
[2010/2197] Compiling C object 'app/a172ced@@dpdk-test-pipeline@exe/test-pipeline_pipeline_acl.c.o'.
[2011/2197] Compiling C object 'app/a172ced@@dpdk-test-pipeline@exe/test-pipeline_pipeline_lpm_ipv6.c.o'.
[2012/2197] Compiling C object 'app/a172ced@@dpdk-testpmd@exe/test-pmd_ieee1588fwd.c.o'.
[2013/2197] Compiling C object 'app/a172ced@@dpdk-testpmd@exe/test-pmd_cmdline_flow.c.o'.
[2014/2197] Compiling C object 'app/a172ced@@dpdk-testpmd@exe/test-pmd_csumonly.c.o'.
[2015/2197] Compiling C object 'app/a172ced@@dpdk-testpmd@exe/test-pmd_icmpecho.c.o'.
[2016/2197] Compiling C object 'drivers/a715181@@tmp_rte_pmd_octeontx2_event@sta/event_octeontx2_otx2_worker.c.o'.
[2017/2197] Compiling C object 'drivers/a715181@@tmp_rte_pmd_octeontx2_event@sta/event_octeontx2_otx2_worker_dual.c.o'.
ninja: build stopped: subcommand failed




*Meson Build Failed #2:
OS: FC31-64
Target:./build-gcc-static
FAILED: app/a172ced@@dpdk-testpmd@exe/test-pmd_cmdline.c.o 
clang -Iapp/a172ced@@dpdk-testpmd@exe -Iapp -I../app -Ilib/librte_ethdev -I../lib/librte_ethdev -I. -I../ -Iconfig -I../config -Ilib/librte_eal/include -I../lib/librte_eal/include -Ilib/librte_eal/linux/include -I../lib/librte_eal/linux/include -Ilib/librte_eal/x86/include -I../lib/librte_eal/x86/include -Ilib/librte_eal/common -I../lib/librte_eal/common -Ilib/librte_eal -I../lib/librte_eal -Ilib/librte_kvargs -I../lib/librte_kvargs -Ilib/librte_telemetry/../librte_metrics -I../lib/librte_telemetry/../librte_metrics -Ilib/librte_telemetry -I../lib/librte_telemetry -Ilib/librte_net -I../lib/librte_net -Ilib/librte_mbuf -I../lib/librte_mbuf -Ilib/librte_mempool -I../lib/librte_mempool -Ilib/librte_ring -I../lib/librte_ring -Ilib/librte_meter -I../lib/librte_meter -Ilib/librte_gro -I../lib/librte_gro -Ilib/librte_gso -I../lib/librte_gso -Ilib/librte_cmdline -I../lib/librte_cmdline -Ilib/librte_metrics -I../lib/librte_metrics -Idrivers/bus/pci -I../drivers/bus/pci -I../drivers/bus/pci/linux -Ilib/librte_pci -I../lib/librte_pci -Ilib/librte_pdump -I../lib/librte_pdump -Idrivers/net/bnxt -I../drivers/net/bnxt -I../drivers/net/bnxt/tf_ulp -I../drivers/net/bnxt/tf_core -Idrivers/bus/vdev -I../drivers/bus/vdev -Idrivers/net/i40e -I../drivers/net/i40e -Idrivers/net/i40e/base -I../drivers/net/i40e/base -Ilib/librte_hash -I../lib/librte_hash -Idrivers/net/ixgbe -I../drivers/net/ixgbe -Idrivers/net/ixgbe/base -I../drivers/net/ixgbe/base -Ilib/librte_security -I../lib/librte_security -Ilib/librte_cryptodev -I../lib/librte_cryptodev -Idrivers/net/softnic -I../drivers/net/softnic -Ilib/librte_pipeline -I../lib/librte_pipeline -Ilib/librte_port -I../lib/librte_port -Ilib/librte_sched -I../lib/librte_sched -Ilib/librte_ip_frag -I../lib/librte_ip_frag -Ilib/librte_eventdev -I../lib/librte_eventdev -Ilib/librte_timer -I../lib/librte_timer -Ilib/librte_kni -I../lib/librte_kni -Ilib/librte_table -I../lib/librte_table -Ilib/librte_lpm -I../lib/librte_lpm -Ilib/librte_acl -I../lib/librte_acl -Idrivers/bus/dpaa -I../drivers/bus/dpaa -I../drivers/bus/dpaa/include -I../drivers/bus/dpaa/base/qbman -Idrivers/common/dpaax -I../drivers/common/dpaax -I../drivers/common/dpaax/caamflib -Idrivers/mempool/dpaa -I../drivers/mempool/dpaa -Idrivers/net/dpaa -I../drivers/net/dpaa -Ilib/librte_bpf -I../lib/librte_bpf -Xclang -fcolor-diagnostics -pipe -D_FILE_OFFSET_BITS=64 -Wall -Winvalid-pch -Werror -O2 -g -include rte_config.h -Wextra -Wcast-qual -Wdeprecated -Wformat-nonliteral -Wformat-security -Wmissing-declarations -Wmissing-prototypes -Wnested-externs -Wold-style-definition -Wpointer-arith -Wsign-compare -Wstrict-prototypes -Wundef -Wwrite-strings -Wno-address-of-packed-member -Wno-missing-field-initializers -D_GNU_SOURCE -march=native -DALLOW_EXPERIMENTAL_API -Wno-deprecated-declarations -MD -MQ 'app/a172ced@@dpdk-testpmd@exe/test-pmd_cmdline.c.o' -MF 'app/a172ced@@dpdk-testpmd@exe/test-pmd_cmdline.c.o.d' -o 'app/a172ced@@dpdk-testpmd@exe/test-pmd_cmdline.c.o' -c ../app/test-pmd/cmdline.c
In file included from ../app/test-pmd/cmdline.c:58:
In file included from ../drivers/net/dpaa/rte_pmd_dpaa.h:18:
../lib/librte_ethdev/rte_ethdev_driver.h:195:1: error: unknown attribute 'error' ignored [-Werror,-Wunknown-attributes]
__rte_internal
^
../lib/librte_eal/include/rte_compat.h:25:16: note: expanded from macro '__rte_internal'
__attribute__((error("Symbol is not public ABI"), \
               ^
1 error generated.
[1976/2198] Compiling C object 'app/a172ced@@dpdk-test-crypto-perf@exe/test-crypto-perf_cperf_test_pmd_cyclecount.c.o'.
[1977/2198] Generating rte_pmd_bbdev_turbo_sw.sym_chk with a meson_exe.py custom command.
[1978/2198] Compiling C object 'app/a172ced@@dpdk-test-crypto-perf@exe/test-crypto-perf_cperf_test_common.c.o'.
[1979/2198] Compiling C object 'app/a172ced@@dpdk-testpmd@exe/test-pmd_config.c.o'.
FAILED: app/a172ced@@dpdk-testpmd@exe/test-pmd_config.c.o 
clang -Iapp/a172ced@@dpdk-testpmd@exe -Iapp -I../app -Ilib/librte_ethdev -I../lib/librte_ethdev -I. -I../ -Iconfig -I../config -Ilib/librte_eal/include -I../lib/librte_eal/include -Ilib/librte_eal/linux/include -I../lib/librte_eal/linux/include -Ilib/librte_eal/x86/include -I../lib/librte_eal/x86/include -Ilib/librte_eal/common -I../lib/librte_eal/common -Ilib/librte_eal -I../lib/librte_eal -Ilib/librte_kvargs -I../lib/librte_kvargs -Ilib/librte_telemetry/../librte_metrics -I../lib/librte_telemetry/../librte_metrics -Ilib/librte_telemetry -I../lib/librte_telemetry -Ilib/librte_net -I../lib/librte_net -Ilib/librte_mbuf -I../lib/librte_mbuf -Ilib/librte_mempool -I../lib/librte_mempool -Ilib/librte_ring -I../lib/librte_ring -Ilib/librte_meter -I../lib/librte_meter -Ilib/librte_gro -I../lib/librte_gro -Ilib/librte_gso -I../lib/librte_gso -Ilib/librte_cmdline -I../lib/librte_cmdline -Ilib/librte_metrics -I../lib/librte_metrics -Idrivers/bus/pci -I../drivers/bus/pci -I../drivers/bus/pci/linux -Ilib/librte_pci -I../lib/librte_pci -Ilib/librte_pdump -I../lib/librte_pdump -Idrivers/net/bnxt -I../drivers/net/bnxt -I../drivers/net/bnxt/tf_ulp -I../drivers/net/bnxt/tf_core -Idrivers/bus/vdev -I../drivers/bus/vdev -Idrivers/net/i40e -I../drivers/net/i40e -Idrivers/net/i40e/base -I../drivers/net/i40e/base -Ilib/librte_hash -I../lib/librte_hash -Idrivers/net/ixgbe -I../drivers/net/ixgbe -Idrivers/net/ixgbe/base -I../drivers/net/ixgbe/base -Ilib/librte_security -I../lib/librte_security -Ilib/librte_cryptodev -I../lib/librte_cryptodev -Idrivers/net/softnic -I../drivers/net/softnic -Ilib/librte_pipeline -I../lib/librte_pipeline -Ilib/librte_port -I../lib/librte_port -Ilib/librte_sched -I../lib/librte_sched -Ilib/librte_ip_frag -I../lib/librte_ip_frag -Ilib/librte_eventdev -I../lib/librte_eventdev -Ilib/librte_timer -I../lib/librte_timer -Ilib/librte_kni -I../lib/librte_kni -Ilib/librte_table -I../lib/librte_table -Ilib/librte_lpm -I../lib/librte_lpm -Ilib/librte_acl -I../lib/librte_acl -Idrivers/bus/dpaa -I../drivers/bus/dpaa -I../drivers/bus/dpaa/include -I../drivers/bus/dpaa/base/qbman -Idrivers/common/dpaax -I../drivers/common/dpaax -I../drivers/common/dpaax/caamflib -Idrivers/mempool/dpaa -I../drivers/mempool/dpaa -Idrivers/net/dpaa -I../drivers/net/dpaa -Ilib/librte_bpf -I../lib/librte_bpf -Xclang -fcolor-diagnostics -pipe -D_FILE_OFFSET_BITS=64 -Wall -Winvalid-pch -Werror -O2 -g -include rte_config.h -Wextra -Wcast-qual -Wdeprecated -Wformat-nonliteral -Wformat-security -Wmissing-declarations -Wmissing-prototypes -Wnested-externs -Wold-style-definition -Wpointer-arith -Wsign-compare -Wstrict-prototypes -Wundef -Wwrite-strings -Wno-address-of-packed-member -Wno-missing-field-initializers -D_GNU_SOURCE -march=native -DALLOW_EXPERIMENTAL_API -Wno-deprecated-declarations -MD -MQ 'app/a172ced@@dpdk-testpmd@exe/test-pmd_config.c.o' -MF 'app/a172ced@@dpdk-testpmd@exe/test-pmd_config.c.o.d' -o 'app/a172ced@@dpdk-testpmd@exe/test-pmd_config.c.o' -c ../app/test-pmd/config.c
In file included from ../app/test-pmd/config.c:43:
In file included from ../drivers/net/ixgbe/rte_pmd_ixgbe.h:14:
../lib/librte_ethdev/rte_ethdev_driver.h:195:1: error: unknown attribute 'error' ignored [-Werror,-Wunknown-attributes]
__rte_internal
^
../lib/librte_eal/include/rte_compat.h:25:16: note: expanded from macro '__rte_internal'
__attribute__((error("Symbol is not public ABI"), \
               ^
1 error generated.
[1980/2198] Compiling C object 'app/a172ced@@dpdk-testpmd@exe/test-pmd_flowgen.c.o'.
[1981/2198] Compiling C object 'app/a172ced@@dpdk-test-crypto-perf@exe/test-crypto-perf_cperf_test_vectors.c.o'.
[1982/2198] Compiling C object 'app/a172ced@@dpdk-test-crypto-perf@exe/test-crypto-perf_cperf_test_latency.c.o'.
[1983/2198] Compiling C object 'drivers/a715181@@tmp_rte_pmd_octeontx2_event@sta/event_octeontx2_otx2_worker.c.o'.
[1984/2198] Compiling C object 'drivers/a715181@@tmp_rte_pmd_octeontx2_event@sta/event_octeontx2_otx2_worker_dual.c.o'.
ninja: build stopped: subcommand failed




*Meson Build Failed #3:
OS: FreeBSD1201-64
Target:./build-gcc-static
FAILED: app/a172ced@@dpdk-testpmd@exe/test-pmd_cmdline.c.o 
clang -Iapp/a172ced@@dpdk-testpmd@exe -Iapp -I../app -Ilib/librte_ethdev -I../lib/librte_ethdev -I. -I.. -Iconfig -I../config -Ilib/librte_eal/include -I../lib/librte_eal/include -Ilib/librte_eal/freebsd/include -I../lib/librte_eal/freebsd/include -Ilib/librte_eal/x86/include -I../lib/librte_eal/x86/include -Ilib/librte_eal/common -I../lib/librte_eal/common -Ilib/librte_eal -I../lib/librte_eal -Ilib/librte_kvargs -I../lib/librte_kvargs -Ilib/librte_metrics -I../lib/librte_metrics -Ilib/librte_telemetry -I../lib/librte_telemetry -Ilib/librte_net -I../lib/librte_net -Ilib/librte_mbuf -I../lib/librte_mbuf -Ilib/librte_mempool -I../lib/librte_mempool -Ilib/librte_ring -I../lib/librte_ring -Ilib/librte_meter -I../lib/librte_meter -Ilib/librte_gro -I../lib/librte_gro -Ilib/librte_gso -I../lib/librte_gso -Ilib/librte_cmdline -I../lib/librte_cmdline -Idrivers/bus/pci -I../drivers/bus/pci -I../drivers/bus/pci/bsd -Ilib/librte_pci -I../lib/librte_pci -Ilib/librte_pdump -I../lib/librte_pdump -Idrivers/net/bnxt -I../drivers/net/bnxt -I../drivers/net/bnxt/tf_ulp -I../drivers/net/bnxt/tf_core -Idrivers/bus/vdev -I../drivers/bus/vdev -Idrivers/net/i40e -I../drivers/net/i40e -Idrivers/net/i40e/base -I../drivers/net/i40e/base -Ilib/librte_hash -I../lib/librte_hash -Idrivers/net/ixgbe -I../drivers/net/ixgbe -Idrivers/net/ixgbe/base -I../drivers/net/ixgbe/base -Ilib/librte_security -I../lib/librte_security -Ilib/librte_cryptodev -I../lib/librte_cryptodev -Ilib/librte_bpf -I../lib/librte_bpf -Xclang -fcolor-diagnostics -pipe -D_FILE_OFFSET_BITS=64 -Wall -Winvalid-pch -Werror -O2 -g -include rte_config.h -Wextra -Wcast-qual -Wdeprecated -Wformat-nonliteral -Wformat-security -Wmissing-declarations -Wmissing-prototypes -Wnested-externs -Wold-style-definition -Wpointer-arith -Wsign-compare -Wstrict-prototypes -Wundef -Wwrite-strings -Wno-address-of-packed-member -Wno-missing-field-initializers -D_GNU_SOURCE -D__BSD_VISIBLE -march=native -DALLOW_EXPERIMENTAL_API -Wno-deprecated-declarations -MD -MQ 'app/a172ced@@dpdk-testpmd@exe/test-pmd_cmdline.c.o' -MF 'app/a172ced@@dpdk-testpmd@exe/test-pmd_cmdline.c.o.d' -o 'app/a172ced@@dpdk-testpmd@exe/test-pmd_cmdline.c.o' -c ../app/test-pmd/cmdline.c
In file included from ../app/test-pmd/cmdline.c:61:
In file included from ../drivers/net/ixgbe/rte_pmd_ixgbe.h:14:
../lib/librte_ethdev/rte_ethdev_driver.h:195:1: error: unknown attribute 'error' ignored [-Werror,-Wunknown-attributes]
__rte_internal
^
../lib/librte_eal/include/rte_compat.h:25:16: note: expanded from macro '__rte_internal'
__attribute__((error("Symbol is not public ABI"), \
               ^
1 error generated.
[1441/1631] Compiling C object 'app/a172ced@@dpdk-test-pipeline@exe/test-pipeline_runtime.c.o'
[1442/1631] Compiling C object 'app/a172ced@@dpdk-testpmd@exe/test-pmd_cmdline_mtr.c.o'
[1443/1631] Compiling C object 'app/a172ced@@dpdk-testpmd@exe/test-pmd_cmdline_tm.c.o'
[1444/1631] Compiling C object 'app/a172ced@@dpdk-testpmd@exe/test-pmd_config.c.o'
FAILED: app/a172ced@@dpdk-testpmd@exe/test-pmd_config.c.o 
clang -Iapp/a172ced@@dpdk-testpmd@exe -Iapp -I../app -Ilib/librte_ethdev -I../lib/librte_ethdev -I. -I.. -Iconfig -I../config -Ilib/librte_eal/include -I../lib/librte_eal/include -Ilib/librte_eal/freebsd/include -I../lib/librte_eal/freebsd/include -Ilib/librte_eal/x86/include -I../lib/librte_eal/x86/include -Ilib/librte_eal/common -I../lib/librte_eal/common -Ilib/librte_eal -I../lib/librte_eal -Ilib/librte_kvargs -I../lib/librte_kvargs -Ilib/librte_metrics -I../lib/librte_metrics -Ilib/librte_telemetry -I../lib/librte_telemetry -Ilib/librte_net -I../lib/librte_net -Ilib/librte_mbuf -I../lib/librte_mbuf -Ilib/librte_mempool -I../lib/librte_mempool -Ilib/librte_ring -I../lib/librte_ring -Ilib/librte_meter -I../lib/librte_meter -Ilib/librte_gro -I../lib/librte_gro -Ilib/librte_gso -I../lib/librte_gso -Ilib/librte_cmdline -I../lib/librte_cmdline -Idrivers/bus/pci -I../drivers/bus/pci -I../drivers/bus/pci/bsd -Ilib/librte_pci -I../lib/librte_pci -Ilib/librte_pdump -I../lib/librte_pdump -Idrivers/net/bnxt -I../drivers/net/bnxt -I../drivers/net/bnxt/tf_ulp -I../drivers/net/bnxt/tf_core -Idrivers/bus/vdev -I../drivers/bus/vdev -Idrivers/net/i40e -I../drivers/net/i40e -Idrivers/net/i40e/base -I../drivers/net/i40e/base -Ilib/librte_hash -I../lib/librte_hash -Idrivers/net/ixgbe -I../drivers/net/ixgbe -Idrivers/net/ixgbe/base -I../drivers/net/ixgbe/base -Ilib/librte_security -I../lib/librte_security -Ilib/librte_cryptodev -I../lib/librte_cryptodev -Ilib/librte_bpf -I../lib/librte_bpf -Xclang -fcolor-diagnostics -pipe -D_FILE_OFFSET_BITS=64 -Wall -Winvalid-pch -Werror -O2 -g -include rte_config.h -Wextra -Wcast-qual -Wdeprecated -Wformat-nonliteral -Wformat-security -Wmissing-declarations -Wmissing-prototypes -Wnested-externs -Wold-style-definition -Wpointer-arith -Wsign-compare -Wstrict-prototypes -Wundef -Wwrite-strings -Wno-address-of-packed-member -Wno-missing-field-initializers -D_GNU_SOURCE -D__BSD_VISIBLE -march=native -DALLOW_EXPERIMENTAL_API -Wno-deprecated-declarations -MD -MQ 'app/a172ced@@dpdk-testpmd@exe/test-pmd_config.c.o' -MF 'app/a172ced@@dpdk-testpmd@exe/test-pmd_config.c.o.d' -o 'app/a172ced@@dpdk-testpmd@exe/test-pmd_config.c.o' -c ../app/test-pmd/config.c
In file included from ../app/test-pmd/config.c:43:
In file included from ../drivers/net/ixgbe/rte_pmd_ixgbe.h:14:
../lib/librte_ethdev/rte_ethdev_driver.h:195:1: error: unknown attribute 'error' ignored [-Werror,-Wunknown-attributes]
__rte_internal
^
../lib/librte_eal/include/rte_compat.h:25:16: note: expanded from macro '__rte_internal'
__attribute__((error("Symbol is not public ABI"), \
               ^
1 error generated.
[1445/1631] Compiling C object 'app/a172ced@@dpdk-testpmd@exe/test-pmd_flowgen.c.o'
[1446/1631] Compiling C object 'app/a172ced@@dpdk-testpmd@exe/test-pmd_cmdline_flow.c.o'
[1447/1631] Compiling C object 'app/a172ced@@dpdk-testpmd@exe/test-pmd_csumonly.c.o'
[1448/1631] Compiling C object 'drivers/a715181@@tmp_rte_pmd_octeontx2_event@sta/event_octeontx2_otx2_worker.c.o'
[1449/1631] Compiling C object 'drivers/a715181@@tmp_rte_pmd_octeontx2_event@sta/event_octeontx2_otx2_worker_dual.c.o'
ninja: build stopped: subcommand failed




*Meson Build Failed #4:
OS: SUSE15-64
Target:./build-gcc-static
FAILED: app/a172ced@@dpdk-testpmd@exe/test-pmd_testpmd.c.o 
clang -Iapp/a172ced@@dpdk-testpmd@exe -Iapp -I../app -Ilib/librte_ethdev -I../lib/librte_ethdev -I. -I../ -Iconfig -I../config -Ilib/librte_eal/include -I../lib/librte_eal/include -Ilib/librte_eal/linux/include -I../lib/librte_eal/linux/include -Ilib/librte_eal/x86/include -I../lib/librte_eal/x86/include -Ilib/librte_eal/common -I../lib/librte_eal/common -Ilib/librte_eal -I../lib/librte_eal -Ilib/librte_kvargs -I../lib/librte_kvargs -Ilib/librte_telemetry/../librte_metrics -I../lib/librte_telemetry/../librte_metrics -Ilib/librte_telemetry -I../lib/librte_telemetry -Ilib/librte_net -I../lib/librte_net -Ilib/librte_mbuf -I../lib/librte_mbuf -Ilib/librte_mempool -I../lib/librte_mempool -Ilib/librte_ring -I../lib/librte_ring -Ilib/librte_meter -I../lib/librte_meter -Ilib/librte_gro -I../lib/librte_gro -Ilib/librte_gso -I../lib/librte_gso -Ilib/librte_cmdline -I../lib/librte_cmdline -Ilib/librte_metrics -I../lib/librte_metrics -Idrivers/bus/pci -I../drivers/bus/pci -I../drivers/bus/pci/linux -Ilib/librte_pci -I../lib/librte_pci -Ilib/librte_pdump -I../lib/librte_pdump -Idrivers/net/bnxt -I../drivers/net/bnxt -I../drivers/net/bnxt/tf_ulp -I../drivers/net/bnxt/tf_core -Idrivers/bus/vdev -I../drivers/bus/vdev -Idrivers/net/i40e -I../drivers/net/i40e -Idrivers/net/i40e/base -I../drivers/net/i40e/base -Ilib/librte_hash -I../lib/librte_hash -Idrivers/net/ixgbe -I../drivers/net/ixgbe -Idrivers/net/ixgbe/base -I../drivers/net/ixgbe/base -Ilib/librte_security -I../lib/librte_security -Ilib/librte_cryptodev -I../lib/librte_cryptodev -Idrivers/net/softnic -I../drivers/net/softnic -Ilib/librte_pipeline -I../lib/librte_pipeline -Ilib/librte_port -I../lib/librte_port -Ilib/librte_sched -I../lib/librte_sched -Ilib/librte_ip_frag -I../lib/librte_ip_frag -Ilib/librte_eventdev -I../lib/librte_eventdev -Ilib/librte_timer -I../lib/librte_timer -Ilib/librte_kni -I../lib/librte_kni -Ilib/librte_table -I../lib/librte_table -Ilib/librte_lpm -I../lib/librte_lpm -Ilib/librte_acl -I../lib/librte_acl -Idrivers/bus/dpaa -I../drivers/bus/dpaa -I../drivers/bus/dpaa/include -I../drivers/bus/dpaa/base/qbman -Idrivers/common/dpaax -I../drivers/common/dpaax -I../drivers/common/dpaax/caamflib -Idrivers/mempool/dpaa -I../drivers/mempool/dpaa -Idrivers/net/dpaa -I../drivers/net/dpaa -Ilib/librte_bpf -I../lib/librte_bpf -Xclang -fcolor-diagnostics -pipe -D_FILE_OFFSET_BITS=64 -Wall -Winvalid-pch -Werror -O2 -g -include rte_config.h -Wextra -Wcast-qual -Wdeprecated -Wformat-nonliteral -Wformat-security -Wmissing-declarations -Wmissing-prototypes -Wnested-externs -Wold-style-definition -Wpointer-arith -Wsign-compare -Wstrict-prototypes -Wundef -Wwrite-strings -Wno-address-of-packed-member -Wno-missing-field-initializers -D_GNU_SOURCE -march=native -DALLOW_EXPERIMENTAL_API -Wno-deprecated-declarations -MD -MQ 'app/a172ced@@dpdk-testpmd@exe/test-pmd_testpmd.c.o' -MF 'app/a172ced@@dpdk-testpmd@exe/test-pmd_testpmd.c.o.d' -o 'app/a172ced@@dpdk-testpmd@exe/test-pmd_testpmd.c.o' -c ../app/test-pmd/testpmd.c
In file included from ../app/test-pmd/testpmd.c:50:
In file included from ../drivers/net/ixgbe/rte_pmd_ixgbe.h:14:
../lib/librte_ethdev/rte_ethdev_driver.h:195:1: error: unknown attribute 'error' ignored [-Werror,-Wunknown-attributes]
__rte_internal
^
../lib/librte_eal/include/rte_compat.h:25:16: note: expanded from macro '__rte_internal'
__attribute__((error("Symbol is not public ABI"), \
               ^
1 error generated.
[980/2101] Compiling C object 'app/a172ced@@dpdk-testpmd@exe/test-pmd_rxonly.c.o'.
[981/2101] Compiling C object 'app/a172ced@@dpdk-testpmd@exe/test-pmd_util.c.o'.
[982/2101] Compiling C object 'app/a172ced@@dpdk-testpmd@exe/test-pmd_parameters.c.o'.
[983/2101] Compiling C object 'drivers/a715181@@tmp_rte_pmd_failsafe@sta/net_failsafe_failsafe_ops.c.o'.
[984/2101] Generating rte_pmd_enic.sym_chk with a meson_exe.py custom command.
[985/2101] Compiling C object 'app/a172ced@@dpdk-testpmd@exe/test-pmd_txonly.c.o'.
[986/2101] Compiling C object 'drivers/a715181@@tmp_rte_pmd_fm10k@sta/net_fm10k_fm10k_rxtx.c.o'.
[987/2101] Compiling C object 'app/a172ced@@dpdk-testpmd@exe/test-pmd_noisy_vnf.c.o'.
[988/2101] Compiling C object 'drivers/a715181@@tmp_rte_pmd_fm10k@sta/net_fm10k_fm10k_ethdev.c.o'.
ninja: build stopped: subcommand failed




*Meson Build Failed #5:
OS: UB1804-32
Target:./build-gcc-static
FAILED: app/a172ced@@dpdk-testpmd@exe/test-pmd_config.c.o 
clang -Iapp/a172ced@@dpdk-testpmd@exe -Iapp -I../app -Ilib/librte_ethdev -I../lib/librte_ethdev -I. -I../ -Iconfig -I../config -Ilib/librte_eal/include -I../lib/librte_eal/include -Ilib/librte_eal/linux/include -I../lib/librte_eal/linux/include -Ilib/librte_eal/x86/include -I../lib/librte_eal/x86/include -Ilib/librte_eal/common -I../lib/librte_eal/common -Ilib/librte_eal -I../lib/librte_eal -Ilib/librte_kvargs -I../lib/librte_kvargs -Ilib/librte_telemetry/../librte_metrics -I../lib/librte_telemetry/../librte_metrics -Ilib/librte_telemetry -I../lib/librte_telemetry -Ilib/librte_net -I../lib/librte_net -Ilib/librte_mbuf -I../lib/librte_mbuf -Ilib/librte_mempool -I../lib/librte_mempool -Ilib/librte_ring -I../lib/librte_ring -Ilib/librte_meter -I../lib/librte_meter -Ilib/librte_gro -I../lib/librte_gro -Ilib/librte_gso -I../lib/librte_gso -Ilib/librte_cmdline -I../lib/librte_cmdline -Ilib/librte_metrics -I../lib/librte_metrics -Idrivers/bus/pci -I../drivers/bus/pci -I../drivers/bus/pci/linux -Ilib/librte_pci -I../lib/librte_pci -Ilib/librte_pdump -I../lib/librte_pdump -Idrivers/net/bnxt -I../drivers/net/bnxt -I../drivers/net/bnxt/tf_ulp -I../drivers/net/bnxt/tf_core -Idrivers/bus/vdev -I../drivers/bus/vdev -Idrivers/net/i40e -I../drivers/net/i40e -Idrivers/net/i40e/base -I../drivers/net/i40e/base -Ilib/librte_hash -I../lib/librte_hash -Idrivers/net/ixgbe -I../drivers/net/ixgbe -Idrivers/net/ixgbe/base -I../drivers/net/ixgbe/base -Ilib/librte_security -I../lib/librte_security -Ilib/librte_cryptodev -I../lib/librte_cryptodev -Idrivers/net/softnic -I../drivers/net/softnic -Ilib/librte_pipeline -I../lib/librte_pipeline -Ilib/librte_port -I../lib/librte_port -Ilib/librte_sched -I../lib/librte_sched -Ilib/librte_ip_frag -I../lib/librte_ip_frag -Ilib/librte_eventdev -I../lib/librte_eventdev -Ilib/librte_timer -I../lib/librte_timer -Ilib/librte_table -I../lib/librte_table -Ilib/librte_lpm -I../lib/librte_lpm -Ilib/librte_acl -I../lib/librte_acl -Idrivers/bus/dpaa -I../drivers/bus/dpaa -I../drivers/bus/dpaa/include -I../drivers/bus/dpaa/base/qbman -Idrivers/common/dpaax -I../drivers/common/dpaax -I../drivers/common/dpaax/caamflib -Idrivers/mempool/dpaa -I../drivers/mempool/dpaa -Idrivers/net/dpaa -I../drivers/net/dpaa -Ilib/librte_bpf -I../lib/librte_bpf -Xclang -fcolor-diagnostics -pipe -D_FILE_OFFSET_BITS=64 -Wall -Winvalid-pch -Werror -O2 -g -include rte_config.h -Wextra -Wcast-qual -Wdeprecated -Wformat-nonliteral -Wformat-security -Wmissing-declarations -Wmissing-prototypes -Wnested-externs -Wold-style-definition -Wpointer-arith -Wsign-compare -Wstrict-prototypes -Wundef -Wwrite-strings -Wno-address-of-packed-member -Wno-missing-field-initializers -Wno-pointer-to-int-cast -D_GNU_SOURCE -m32 -march=native -DALLOW_EXPERIMENTAL_API -Wno-deprecated-declarations -MD -MQ 'app/a172ced@@dpdk-testpmd@exe/test-pmd_config.c.o' -MF 'app/a172ced@@dpdk-testpmd@exe/test-pmd_config.c.o.d' -o 'app/a172ced@@dpdk-testpmd@exe/test-pmd_config.c.o' -c ../app/test-pmd/config.c
In file included from ../app/test-pmd/config.c:43:
In file included from ../drivers/net/ixgbe/rte_pmd_ixgbe.h:14:
../lib/librte_ethdev/rte_ethdev_driver.h:195:1: error: unknown attribute 'error' ignored [-Werror,-Wunknown-attributes]
__rte_internal
^
../lib/librte_eal/include/rte_compat.h:25:16: note: expanded from macro '__rte_internal'
__attribute__((error("Symbol is not public ABI"), \
               ^
1 error generated.
[1770/1953] Compiling C object 'app/a172ced@@dpdk-test-fib@exe/test-fib_main.c.o'.
[1771/1953] Compiling C object 'app/a172ced@@dpdk-test-pipeline@exe/test-pipeline_pipeline_stub.c.o'.
[1772/1953] Compiling C object 'app/a172ced@@dpdk-testpmd@exe/test-pmd_cmdline_tm.c.o'.
[1773/1953] Compiling C object 'app/a172ced@@dpdk-testpmd@exe/test-pmd_cmdline.c.o'.
FAILED: app/a172ced@@dpdk-testpmd@exe/test-pmd_cmdline.c.o 
clang -Iapp/a172ced@@dpdk-testpmd@exe -Iapp -I../app -Ilib/librte_ethdev -I../lib/librte_ethdev -I. -I../ -Iconfig -I../config -Ilib/librte_eal/include -I../lib/librte_eal/include -Ilib/librte_eal/linux/include -I../lib/librte_eal/linux/include -Ilib/librte_eal/x86/include -I../lib/librte_eal/x86/include -Ilib/librte_eal/common -I../lib/librte_eal/common -Ilib/librte_eal -I../lib/librte_eal -Ilib/librte_kvargs -I../lib/librte_kvargs -Ilib/librte_telemetry/../librte_metrics -I../lib/librte_telemetry/../librte_metrics -Ilib/librte_telemetry -I../lib/librte_telemetry -Ilib/librte_net -I../lib/librte_net -Ilib/librte_mbuf -I../lib/librte_mbuf -Ilib/librte_mempool -I../lib/librte_mempool -Ilib/librte_ring -I../lib/librte_ring -Ilib/librte_meter -I../lib/librte_meter -Ilib/librte_gro -I../lib/librte_gro -Ilib/librte_gso -I../lib/librte_gso -Ilib/librte_cmdline -I../lib/librte_cmdline -Ilib/librte_metrics -I../lib/librte_metrics -Idrivers/bus/pci -I../drivers/bus/pci -I../drivers/bus/pci/linux -Ilib/librte_pci -I../lib/librte_pci -Ilib/librte_pdump -I../lib/librte_pdump -Idrivers/net/bnxt -I../drivers/net/bnxt -I../drivers/net/bnxt/tf_ulp -I../drivers/net/bnxt/tf_core -Idrivers/bus/vdev -I../drivers/bus/vdev -Idrivers/net/i40e -I../drivers/net/i40e -Idrivers/net/i40e/base -I../drivers/net/i40e/base -Ilib/librte_hash -I../lib/librte_hash -Idrivers/net/ixgbe -I../drivers/net/ixgbe -Idrivers/net/ixgbe/base -I../drivers/net/ixgbe/base -Ilib/librte_security -I../lib/librte_security -Ilib/librte_cryptodev -I../lib/librte_cryptodev -Idrivers/net/softnic -I../drivers/net/softnic -Ilib/librte_pipeline -I../lib/librte_pipeline -Ilib/librte_port -I../lib/librte_port -Ilib/librte_sched -I../lib/librte_sched -Ilib/librte_ip_frag -I../lib/librte_ip_frag -Ilib/librte_eventdev -I../lib/librte_eventdev -Ilib/librte_timer -I../lib/librte_timer -Ilib/librte_table -I../lib/librte_table -Ilib/librte_lpm -I../lib/librte_lpm -Ilib/librte_acl -I../lib/librte_acl -Idrivers/bus/dpaa -I../drivers/bus/dpaa -I../drivers/bus/dpaa/include -I../drivers/bus/dpaa/base/qbman -Idrivers/common/dpaax -I../drivers/common/dpaax -I../drivers/common/dpaax/caamflib -Idrivers/mempool/dpaa -I../drivers/mempool/dpaa -Idrivers/net/dpaa -I../drivers/net/dpaa -Ilib/librte_bpf -I../lib/librte_bpf -Xclang -fcolor-diagnostics -pipe -D_FILE_OFFSET_BITS=64 -Wall -Winvalid-pch -Werror -O2 -g -include rte_config.h -Wextra -Wcast-qual -Wdeprecated -Wformat-nonliteral -Wformat-security -Wmissing-declarations -Wmissing-prototypes -Wnested-externs -Wold-style-definition -Wpointer-arith -Wsign-compare -Wstrict-prototypes -Wundef -Wwrite-strings -Wno-address-of-packed-member -Wno-missing-field-initializers -Wno-pointer-to-int-cast -D_GNU_SOURCE -m32 -march=native -DALLOW_EXPERIMENTAL_API -Wno-deprecated-declarations -MD -MQ 'app/a172ced@@dpdk-testpmd@exe/test-pmd_cmdline.c.o' -MF 'app/a172ced@@dpdk-testpmd@exe/test-pmd_cmdline.c.o.d' -o 'app/a172ced@@dpdk-testpmd@exe/test-pmd_cmdline.c.o' -c ../app/test-pmd/cmdline.c
In file included from ../app/test-pmd/cmdline.c:58:
In file included from ../drivers/net/dpaa/rte_pmd_dpaa.h:18:
../lib/librte_ethdev/rte_ethdev_driver.h:195:1: error: unknown attribute 'error' ignored [-Werror,-Wunknown-attributes]
__rte_internal
^
../lib/librte_eal/include/rte_compat.h:25:16: note: expanded from macro '__rte_internal'
__attribute__((error("Symbol is not public ABI"), \
               ^
1 error generated.
[1774/1953] Compiling C object 'app/a172ced@@dpdk-testpmd@exe/test-pmd_ieee1588fwd.c.o'.
[1775/1953] Compiling C object 'app/a172ced@@dpdk-test-pipeline@exe/test-pipeline_pipeline_lpm_ipv6.c.o'.
[1776/1953] Compiling C object 'app/a172ced@@dpdk-testpmd@exe/test-pmd_flowgen.c.o'.
[1777/1953] Compiling C object 'app/a172ced@@dpdk-testpmd@exe/test-pmd_cmdline_flow.c.o'.
[1778/1953] Compiling C object 'app/a172ced@@dpdk-testpmd@exe/test-pmd_csumonly.c.o'.
[1779/1953] Compiling C object 'drivers/a715181@@tmp_rte_pmd_octeontx2_event@sta/event_octeontx2_otx2_worker.c.o'.
[1780/1953] Compiling C object 'drivers/a715181@@tmp_rte_pmd_octeontx2_event@sta/event_octeontx2_otx2_worker_dual.c.o'.
ninja: build stopped: subcommand failed




*Meson Build Failed #6:
OS: UB1804-64
Target:./build-gcc-static
FAILED: app/a172ced@@dpdk-testpmd@exe/test-pmd_config.c.o 
clang -Iapp/a172ced@@dpdk-testpmd@exe -Iapp -I../app -Ilib/librte_ethdev -I../lib/librte_ethdev -I. -I../ -Iconfig -I../config -Ilib/librte_eal/include -I../lib/librte_eal/include -Ilib/librte_eal/linux/include -I../lib/librte_eal/linux/include -Ilib/librte_eal/x86/include -I../lib/librte_eal/x86/include -Ilib/librte_eal/common -I../lib/librte_eal/common -Ilib/librte_eal -I../lib/librte_eal -Ilib/librte_kvargs -I../lib/librte_kvargs -Ilib/librte_telemetry/../librte_metrics -I../lib/librte_telemetry/../librte_metrics -Ilib/librte_telemetry -I../lib/librte_telemetry -Ilib/librte_net -I../lib/librte_net -Ilib/librte_mbuf -I../lib/librte_mbuf -Ilib/librte_mempool -I../lib/librte_mempool -Ilib/librte_ring -I../lib/librte_ring -Ilib/librte_meter -I../lib/librte_meter -Ilib/librte_gro -I../lib/librte_gro -Ilib/librte_gso -I../lib/librte_gso -Ilib/librte_cmdline -I../lib/librte_cmdline -Ilib/librte_metrics -I../lib/librte_metrics -Idrivers/bus/pci -I../drivers/bus/pci -I../drivers/bus/pci/linux -Ilib/librte_pci -I../lib/librte_pci -Ilib/librte_pdump -I../lib/librte_pdump -Idrivers/net/bnxt -I../drivers/net/bnxt -I../drivers/net/bnxt/tf_ulp -I../drivers/net/bnxt/tf_core -Idrivers/bus/vdev -I../drivers/bus/vdev -Idrivers/net/i40e -I../drivers/net/i40e -Idrivers/net/i40e/base -I../drivers/net/i40e/base -Ilib/librte_hash -I../lib/librte_hash -Idrivers/net/ixgbe -I../drivers/net/ixgbe -Idrivers/net/ixgbe/base -I../drivers/net/ixgbe/base -Ilib/librte_security -I../lib/librte_security -Ilib/librte_cryptodev -I../lib/librte_cryptodev -Idrivers/net/softnic -I../drivers/net/softnic -Ilib/librte_pipeline -I../lib/librte_pipeline -Ilib/librte_port -I../lib/librte_port -Ilib/librte_sched -I../lib/librte_sched -Ilib/librte_ip_frag -I../lib/librte_ip_frag -Ilib/librte_eventdev -I../lib/librte_eventdev -Ilib/librte_timer -I../lib/librte_timer -Ilib/librte_kni -I../lib/librte_kni -Ilib/librte_table -I../lib/librte_table -Ilib/librte_lpm -I../lib/librte_lpm -Ilib/librte_acl -I../lib/librte_acl -Idrivers/bus/dpaa -I../drivers/bus/dpaa -I../drivers/bus/dpaa/include -I../drivers/bus/dpaa/base/qbman -Idrivers/common/dpaax -I../drivers/common/dpaax -I../drivers/common/dpaax/caamflib -Idrivers/mempool/dpaa -I../drivers/mempool/dpaa -Idrivers/net/dpaa -I../drivers/net/dpaa -Ilib/librte_bpf -I../lib/librte_bpf -Xclang -fcolor-diagnostics -pipe -D_FILE_OFFSET_BITS=64 -Wall -Winvalid-pch -Werror -O2 -g -include rte_config.h -Wextra -Wcast-qual -Wdeprecated -Wformat-nonliteral -Wformat-security -Wmissing-declarations -Wmissing-prototypes -Wnested-externs -Wold-style-definition -Wpointer-arith -Wsign-compare -Wstrict-prototypes -Wundef -Wwrite-strings -Wno-address-of-packed-member -Wno-missing-field-initializers -D_GNU_SOURCE -march=native -mno-avx512f -DALLOW_EXPERIMENTAL_API -Wno-deprecated-declarations -MD -MQ 'app/a172ced@@dpdk-testpmd@exe/test-pmd_config.c.o' -MF 'app/a172ced@@dpdk-testpmd@exe/test-pmd_config.c.o.d' -o 'app/a172ced@@dpdk-testpmd@exe/test-pmd_config.c.o' -c ../app/test-pmd/config.c
In file included from ../app/test-pmd/config.c:43:
In file included from ../drivers/net/ixgbe/rte_pmd_ixgbe.h:14:
../lib/librte_ethdev/rte_ethdev_driver.h:195:1: error: unknown attribute 'error' ignored [-Werror,-Wunknown-attributes]
__rte_internal
^
../lib/librte_eal/include/rte_compat.h:25:16: note: expanded from macro '__rte_internal'
__attribute__((error("Symbol is not public ABI"), \
               ^
1 error generated.
[1893/2073] Compiling C object 'app/a172ced@@dpdk-testpmd@exe/test-pmd_cmdline_mtr.c.o'.
[1894/2073] Compiling C object 'app/a172ced@@dpdk-testpmd@exe/test-pmd_cmdline.c.o'.
FAILED: app/a172ced@@dpdk-testpmd@exe/test-pmd_cmdline.c.o 
clang -Iapp/a172ced@@dpdk-testpmd@exe -Iapp -I../app -Ilib/librte_ethdev -I../lib/librte_ethdev -I. -I../ -Iconfig -I../config -Ilib/librte_eal/include -I../lib/librte_eal/include -Ilib/librte_eal/linux/include -I../lib/librte_eal/linux/include -Ilib/librte_eal/x86/include -I../lib/librte_eal/x86/include -Ilib/librte_eal/common -I../lib/librte_eal/common -Ilib/librte_eal -I../lib/librte_eal -Ilib/librte_kvargs -I../lib/librte_kvargs -Ilib/librte_telemetry/../librte_metrics -I../lib/librte_telemetry/../librte_metrics -Ilib/librte_telemetry -I../lib/librte_telemetry -Ilib/librte_net -I../lib/librte_net -Ilib/librte_mbuf -I../lib/librte_mbuf -Ilib/librte_mempool -I../lib/librte_mempool -Ilib/librte_ring -I../lib/librte_ring -Ilib/librte_meter -I../lib/librte_meter -Ilib/librte_gro -I../lib/librte_gro -Ilib/librte_gso -I../lib/librte_gso -Ilib/librte_cmdline -I../lib/librte_cmdline -Ilib/librte_metrics -I../lib/librte_metrics -Idrivers/bus/pci -I../drivers/bus/pci -I../drivers/bus/pci/linux -Ilib/librte_pci -I../lib/librte_pci -Ilib/librte_pdump -I../lib/librte_pdump -Idrivers/net/bnxt -I../drivers/net/bnxt -I../drivers/net/bnxt/tf_ulp -I../drivers/net/bnxt/tf_core -Idrivers/bus/vdev -I../drivers/bus/vdev -Idrivers/net/i40e -I../drivers/net/i40e -Idrivers/net/i40e/base -I../drivers/net/i40e/base -Ilib/librte_hash -I../lib/librte_hash -Idrivers/net/ixgbe -I../drivers/net/ixgbe -Idrivers/net/ixgbe/base -I../drivers/net/ixgbe/base -Ilib/librte_security -I../lib/librte_security -Ilib/librte_cryptodev -I../lib/librte_cryptodev -Idrivers/net/softnic -I../drivers/net/softnic -Ilib/librte_pipeline -I../lib/librte_pipeline -Ilib/librte_port -I../lib/librte_port -Ilib/librte_sched -I../lib/librte_sched -Ilib/librte_ip_frag -I../lib/librte_ip_frag -Ilib/librte_eventdev -I../lib/librte_eventdev -Ilib/librte_timer -I../lib/librte_timer -Ilib/librte_kni -I../lib/librte_kni -Ilib/librte_table -I../lib/librte_table -Ilib/librte_lpm -I../lib/librte_lpm -Ilib/librte_acl -I../lib/librte_acl -Idrivers/bus/dpaa -I../drivers/bus/dpaa -I../drivers/bus/dpaa/include -I../drivers/bus/dpaa/base/qbman -Idrivers/common/dpaax -I../drivers/common/dpaax -I../drivers/common/dpaax/caamflib -Idrivers/mempool/dpaa -I../drivers/mempool/dpaa -Idrivers/net/dpaa -I../drivers/net/dpaa -Ilib/librte_bpf -I../lib/librte_bpf -Xclang -fcolor-diagnostics -pipe -D_FILE_OFFSET_BITS=64 -Wall -Winvalid-pch -Werror -O2 -g -include rte_config.h -Wextra -Wcast-qual -Wdeprecated -Wformat-nonliteral -Wformat-security -Wmissing-declarations -Wmissing-prototypes -Wnested-externs -Wold-style-definition -Wpointer-arith -Wsign-compare -Wstrict-prototypes -Wundef -Wwrite-strings -Wno-address-of-packed-member -Wno-missing-field-initializers -D_GNU_SOURCE -march=native -mno-avx512f -DALLOW_EXPERIMENTAL_API -Wno-deprecated-declarations -MD -MQ 'app/a172ced@@dpdk-testpmd@exe/test-pmd_cmdline.c.o' -MF 'app/a172ced@@dpdk-testpmd@exe/test-pmd_cmdline.c.o.d' -o 'app/a172ced@@dpdk-testpmd@exe/test-pmd_cmdline.c.o' -c ../app/test-pmd/cmdline.c
In file included from ../app/test-pmd/cmdline.c:58:
In file included from ../drivers/net/dpaa/rte_pmd_dpaa.h:18:
../lib/librte_ethdev/rte_ethdev_driver.h:195:1: error: unknown attribute 'error' ignored [-Werror,-Wunknown-attributes]
__rte_internal
^
../lib/librte_eal/include/rte_compat.h:25:16: note: expanded from macro '__rte_internal'
__attribute__((error("Symbol is not public ABI"), \
               ^
1 error generated.
[1895/2073] Compiling C object 'app/a172ced@@dpdk-testpmd@exe/test-pmd_cmdline_tm.c.o'.
[1896/2073] Compiling C object 'app/a172ced@@dpdk-test-pipeline@exe/test-pipeline_pipeline_stub.c.o'.
[1897/2073] Compiling C object 'app/a172ced@@dpdk-testpmd@exe/test-pmd_flowgen.c.o'.
[1898/2073] Compiling C object 'app/a172ced@@dpdk-testpmd@exe/test-pmd_cmdline_flow.c.o'.
[1899/2073] Compiling C object 'app/a172ced@@dpdk-testpmd@exe/test-pmd_csumonly.c.o'.
[1900/2073] Compiling C object 'drivers/a715181@@tmp_rte_pmd_octeontx2_event@sta/event_octeontx2_otx2_worker_dual.c.o'.
[1901/2073] Compiling C object 'drivers/a715181@@tmp_rte_pmd_octeontx2_event@sta/event_octeontx2_otx2_worker.c.o'.
ninja: build stopped: subcommand failed




*Meson Build Failed #7:
OS: UB2004-64
Target:./build-gcc-static
FAILED: app/a172ced@@dpdk-testpmd@exe/test-pmd_config.c.o 
clang -Iapp/a172ced@@dpdk-testpmd@exe -Iapp -I../app -Ilib/librte_ethdev -I../lib/librte_ethdev -I. -I../ -Iconfig -I../config -Ilib/librte_eal/include -I../lib/librte_eal/include -Ilib/librte_eal/linux/include -I../lib/librte_eal/linux/include -Ilib/librte_eal/x86/include -I../lib/librte_eal/x86/include -Ilib/librte_eal/common -I../lib/librte_eal/common -Ilib/librte_eal -I../lib/librte_eal -Ilib/librte_kvargs -I../lib/librte_kvargs -Ilib/librte_telemetry/../librte_metrics -I../lib/librte_telemetry/../librte_metrics -Ilib/librte_telemetry -I../lib/librte_telemetry -Ilib/librte_net -I../lib/librte_net -Ilib/librte_mbuf -I../lib/librte_mbuf -Ilib/librte_mempool -I../lib/librte_mempool -Ilib/librte_ring -I../lib/librte_ring -Ilib/librte_meter -I../lib/librte_meter -Ilib/librte_gro -I../lib/librte_gro -Ilib/librte_gso -I../lib/librte_gso -Ilib/librte_cmdline -I../lib/librte_cmdline -Ilib/librte_metrics -I../lib/librte_metrics -Idrivers/bus/pci -I../drivers/bus/pci -I../drivers/bus/pci/linux -Ilib/librte_pci -I../lib/librte_pci -Ilib/librte_pdump -I../lib/librte_pdump -Idrivers/net/bnxt -I../drivers/net/bnxt -I../drivers/net/bnxt/tf_ulp -I../drivers/net/bnxt/tf_core -Idrivers/bus/vdev -I../drivers/bus/vdev -Idrivers/net/i40e -I../drivers/net/i40e -Idrivers/net/i40e/base -I../drivers/net/i40e/base -Ilib/librte_hash -I../lib/librte_hash -Idrivers/net/ixgbe -I../drivers/net/ixgbe -Idrivers/net/ixgbe/base -I../drivers/net/ixgbe/base -Ilib/librte_security -I../lib/librte_security -Ilib/librte_cryptodev -I../lib/librte_cryptodev -Idrivers/net/softnic -I../drivers/net/softnic -Ilib/librte_pipeline -I../lib/librte_pipeline -Ilib/librte_port -I../lib/librte_port -Ilib/librte_sched -I../lib/librte_sched -Ilib/librte_ip_frag -I../lib/librte_ip_frag -Ilib/librte_eventdev -I../lib/librte_eventdev -Ilib/librte_timer -I../lib/librte_timer -Ilib/librte_kni -I../lib/librte_kni -Ilib/librte_table -I../lib/librte_table -Ilib/librte_lpm -I../lib/librte_lpm -Ilib/librte_acl -I../lib/librte_acl -Idrivers/bus/dpaa -I../drivers/bus/dpaa -I../drivers/bus/dpaa/include -I../drivers/bus/dpaa/base/qbman -Idrivers/common/dpaax -I../drivers/common/dpaax -I../drivers/common/dpaax/caamflib -Idrivers/mempool/dpaa -I../drivers/mempool/dpaa -Idrivers/net/dpaa -I../drivers/net/dpaa -Ilib/librte_bpf -I../lib/librte_bpf -Xclang -fcolor-diagnostics -pipe -D_FILE_OFFSET_BITS=64 -Wall -Winvalid-pch -Werror -O2 -g -include rte_config.h -Wextra -Wcast-qual -Wdeprecated -Wformat-nonliteral -Wformat-security -Wmissing-declarations -Wmissing-prototypes -Wnested-externs -Wold-style-definition -Wpointer-arith -Wsign-compare -Wstrict-prototypes -Wundef -Wwrite-strings -Wno-address-of-packed-member -Wno-missing-field-initializers -D_GNU_SOURCE -march=native -DALLOW_EXPERIMENTAL_API -Wno-deprecated-declarations -MD -MQ 'app/a172ced@@dpdk-testpmd@exe/test-pmd_config.c.o' -MF 'app/a172ced@@dpdk-testpmd@exe/test-pmd_config.c.o.d' -o 'app/a172ced@@dpdk-testpmd@exe/test-pmd_config.c.o' -c ../app/test-pmd/config.c
In file included from ../app/test-pmd/config.c:43:
In file included from ../drivers/net/ixgbe/rte_pmd_ixgbe.h:14:
../lib/librte_ethdev/rte_ethdev_driver.h:195:1: error: unknown attribute 'error' ignored [-Werror,-Wunknown-attributes]
__rte_internal
^
../lib/librte_eal/include/rte_compat.h:25:16: note: expanded from macro '__rte_internal'
__attribute__((error("Symbol is not public ABI"), \
               ^
1 error generated.
[2005/2189] Compiling C object 'app/a172ced@@dpdk-testpmd@exe/test-pmd_cmdline.c.o'.
FAILED: app/a172ced@@dpdk-testpmd@exe/test-pmd_cmdline.c.o 
clang -Iapp/a172ced@@dpdk-testpmd@exe -Iapp -I../app -Ilib/librte_ethdev -I../lib/librte_ethdev -I. -I../ -Iconfig -I../config -Ilib/librte_eal/include -I../lib/librte_eal/include -Ilib/librte_eal/linux/include -I../lib/librte_eal/linux/include -Ilib/librte_eal/x86/include -I../lib/librte_eal/x86/include -Ilib/librte_eal/common -I../lib/librte_eal/common -Ilib/librte_eal -I../lib/librte_eal -Ilib/librte_kvargs -I../lib/librte_kvargs -Ilib/librte_telemetry/../librte_metrics -I../lib/librte_telemetry/../librte_metrics -Ilib/librte_telemetry -I../lib/librte_telemetry -Ilib/librte_net -I../lib/librte_net -Ilib/librte_mbuf -I../lib/librte_mbuf -Ilib/librte_mempool -I../lib/librte_mempool -Ilib/librte_ring -I../lib/librte_ring -Ilib/librte_meter -I../lib/librte_meter -Ilib/librte_gro -I../lib/librte_gro -Ilib/librte_gso -I../lib/librte_gso -Ilib/librte_cmdline -I../lib/librte_cmdline -Ilib/librte_metrics -I../lib/librte_metrics -Idrivers/bus/pci -I../drivers/bus/pci -I../drivers/bus/pci/linux -Ilib/librte_pci -I../lib/librte_pci -Ilib/librte_pdump -I../lib/librte_pdump -Idrivers/net/bnxt -I../drivers/net/bnxt -I../drivers/net/bnxt/tf_ulp -I../drivers/net/bnxt/tf_core -Idrivers/bus/vdev -I../drivers/bus/vdev -Idrivers/net/i40e -I../drivers/net/i40e -Idrivers/net/i40e/base -I../drivers/net/i40e/base -Ilib/librte_hash -I../lib/librte_hash -Idrivers/net/ixgbe -I../drivers/net/ixgbe -Idrivers/net/ixgbe/base -I../drivers/net/ixgbe/base -Ilib/librte_security -I../lib/librte_security -Ilib/librte_cryptodev -I../lib/librte_cryptodev -Idrivers/net/softnic -I../drivers/net/softnic -Ilib/librte_pipeline -I../lib/librte_pipeline -Ilib/librte_port -I../lib/librte_port -Ilib/librte_sched -I../lib/librte_sched -Ilib/librte_ip_frag -I../lib/librte_ip_frag -Ilib/librte_eventdev -I../lib/librte_eventdev -Ilib/librte_timer -I../lib/librte_timer -Ilib/librte_kni -I../lib/librte_kni -Ilib/librte_table -I../lib/librte_table -Ilib/librte_lpm -I../lib/librte_lpm -Ilib/librte_acl -I../lib/librte_acl -Idrivers/bus/dpaa -I../drivers/bus/dpaa -I../drivers/bus/dpaa/include -I../drivers/bus/dpaa/base/qbman -Idrivers/common/dpaax -I../drivers/common/dpaax -I../drivers/common/dpaax/caamflib -Idrivers/mempool/dpaa -I../drivers/mempool/dpaa -Idrivers/net/dpaa -I../drivers/net/dpaa -Ilib/librte_bpf -I../lib/librte_bpf -Xclang -fcolor-diagnostics -pipe -D_FILE_OFFSET_BITS=64 -Wall -Winvalid-pch -Werror -O2 -g -include rte_config.h -Wextra -Wcast-qual -Wdeprecated -Wformat-nonliteral -Wformat-security -Wmissing-declarations -Wmissing-prototypes -Wnested-externs -Wold-style-definition -Wpointer-arith -Wsign-compare -Wstrict-prototypes -Wundef -Wwrite-strings -Wno-address-of-packed-member -Wno-missing-field-initializers -D_GNU_SOURCE -march=native -DALLOW_EXPERIMENTAL_API -Wno-deprecated-declarations -MD -MQ 'app/a172ced@@dpdk-testpmd@exe/test-pmd_cmdline.c.o' -MF 'app/a172ced@@dpdk-testpmd@exe/test-pmd_cmdline.c.o.d' -o 'app/a172ced@@dpdk-testpmd@exe/test-pmd_cmdline.c.o' -c ../app/test-pmd/cmdline.c
In file included from ../app/test-pmd/cmdline.c:58:
In file included from ../drivers/net/dpaa/rte_pmd_dpaa.h:18:
../lib/librte_ethdev/rte_ethdev_driver.h:195:1: error: unknown attribute 'error' ignored [-Werror,-Wunknown-attributes]
__rte_internal
^
../lib/librte_eal/include/rte_compat.h:25:16: note: expanded from macro '__rte_internal'
__attribute__((error("Symbol is not public ABI"), \
               ^
1 error generated.
[2006/2189] Compiling C object 'app/a172ced@@dpdk-testpmd@exe/test-pmd_cmdline_flow.c.o'.
[2007/2189] Compiling C object 'app/a172ced@@dpdk-testpmd@exe/test-pmd_flowgen.c.o'.
[2008/2189] Compiling C object 'app/a172ced@@dpdk-testpmd@exe/test-pmd_macfwd.c.o'.
[2009/2189] Compiling C object 'app/a172ced@@dpdk-testpmd@exe/test-pmd_cmdline_tm.c.o'.
[2010/2189] Compiling C object 'app/a172ced@@dpdk-testpmd@exe/test-pmd_testpmd.c.o'.
FAILED: app/a172ced@@dpdk-testpmd@exe/test-pmd_testpmd.c.o 
clang -Iapp/a172ced@@dpdk-testpmd@exe -Iapp -I../app -Ilib/librte_ethdev -I../lib/librte_ethdev -I. -I../ -Iconfig -I../config -Ilib/librte_eal/include -I../lib/librte_eal/include -Ilib/librte_eal/linux/include -I../lib/librte_eal/linux/include -Ilib/librte_eal/x86/include -I../lib/librte_eal/x86/include -Ilib/librte_eal/common -I../lib/librte_eal/common -Ilib/librte_eal -I../lib/librte_eal -Ilib/librte_kvargs -I../lib/librte_kvargs -Ilib/librte_telemetry/../librte_metrics -I../lib/librte_telemetry/../librte_metrics -Ilib/librte_telemetry -I../lib/librte_telemetry -Ilib/librte_net -I../lib/librte_net -Ilib/librte_mbuf -I../lib/librte_mbuf -Ilib/librte_mempool -I../lib/librte_mempool -Ilib/librte_ring -I../lib/librte_ring -Ilib/librte_meter -I../lib/librte_meter -Ilib/librte_gro -I../lib/librte_gro -Ilib/librte_gso -I../lib/librte_gso -Ilib/librte_cmdline -I../lib/librte_cmdline -Ilib/librte_metrics -I../lib/librte_metrics -Idrivers/bus/pci -I../drivers/bus/pci -I../drivers/bus/pci/linux -Ilib/librte_pci -I../lib/librte_pci -Ilib/librte_pdump -I../lib/librte_pdump -Idrivers/net/bnxt -I../drivers/net/bnxt -I../drivers/net/bnxt/tf_ulp -I../drivers/net/bnxt/tf_core -Idrivers/bus/vdev -I../drivers/bus/vdev -Idrivers/net/i40e -I../drivers/net/i40e -Idrivers/net/i40e/base -I../drivers/net/i40e/base -Ilib/librte_hash -I../lib/librte_hash -Idrivers/net/ixgbe -I../drivers/net/ixgbe -Idrivers/net/ixgbe/base -I../drivers/net/ixgbe/base -Ilib/librte_security -I../lib/librte_security -Ilib/librte_cryptodev -I../lib/librte_cryptodev -Idrivers/net/softnic -I../drivers/net/softnic -Ilib/librte_pipeline -I../lib/librte_pipeline -Ilib/librte_port -I../lib/librte_port -Ilib/librte_sched -I../lib/librte_sched -Ilib/librte_ip_frag -I../lib/librte_ip_frag -Ilib/librte_eventdev -I../lib/librte_eventdev -Ilib/librte_timer -I../lib/librte_timer -Ilib/librte_kni -I../lib/librte_kni -Ilib/librte_table -I../lib/librte_table -Ilib/librte_lpm -I../lib/librte_lpm -Ilib/librte_acl -I../lib/librte_acl -Idrivers/bus/dpaa -I../drivers/bus/dpaa -I../drivers/bus/dpaa/include -I../drivers/bus/dpaa/base/qbman -Idrivers/common/dpaax -I../drivers/common/dpaax -I../drivers/common/dpaax/caamflib -Idrivers/mempool/dpaa -I../drivers/mempool/dpaa -Idrivers/net/dpaa -I../drivers/net/dpaa -Ilib/librte_bpf -I../lib/librte_bpf -Xclang -fcolor-diagnostics -pipe -D_FILE_OFFSET_BITS=64 -Wall -Winvalid-pch -Werror -O2 -g -include rte_config.h -Wextra -Wcast-qual -Wdeprecated -Wformat-nonliteral -Wformat-security -Wmissing-declarations -Wmissing-prototypes -Wnested-externs -Wold-style-definition -Wpointer-arith -Wsign-compare -Wstrict-prototypes -Wundef -Wwrite-strings -Wno-address-of-packed-member -Wno-missing-field-initializers -D_GNU_SOURCE -march=native -DALLOW_EXPERIMENTAL_API -Wno-deprecated-declarations -MD -MQ 'app/a172ced@@dpdk-testpmd@exe/test-pmd_testpmd.c.o' -MF 'app/a172ced@@dpdk-testpmd@exe/test-pmd_testpmd.c.o.d' -o 'app/a172ced@@dpdk-testpmd@exe/test-pmd_testpmd.c.o' -c ../app/test-pmd/testpmd.c
In file included from ../app/test-pmd/testpmd.c:50:
In file included from ../drivers/net/ixgbe/rte_pmd_ixgbe.h:14:
../lib/librte_ethdev/rte_ethdev_driver.h:195:1: error: unknown attribute 'error' ignored [-Werror,-Wunknown-attributes]
__rte_internal
^
../lib/librte_eal/include/rte_compat.h:25:16: note: expanded from macro '__rte_internal'
__attribute__((error("Symbol is not public ABI"), \
               ^
1 error generated.
[2011/2189] Compiling C object 'app/a172ced@@dpdk-testpmd@exe/test-pmd_csumonly.c.o'.
[2012/2189] Compiling C object 'app/a172ced@@dpdk-testpmd@exe/test-pmd_parameters.c.o'.
[2013/2189] Compiling C object 'app/a172ced@@dpdk-testpmd@exe/test-pmd_noisy_vnf.c.o'.
[2014/2189] Compiling C object 'drivers/a715181@@tmp_rte_pmd_octeontx2_event@sta/event_octeontx2_otx2_worker.c.o'.
[2015/2189] Compiling C object 'drivers/a715181@@tmp_rte_pmd_octeontx2_event@sta/event_octeontx2_otx2_worker_dual.c.o'.
ninja: build stopped: subcommand failed


DPDK STV team

^ permalink raw reply	[flat|nested] only message in thread

only message in thread, other threads:[~2020-06-23 16:56 UTC | newest]

Thread overview: (only message) (download: mbox.gz / follow: Atom feed)
-- links below jump to the message on this page --
2020-06-23 16:56 [dpdk-test-report] |FAILURE| pw(72037) [v5, 3/4] drivers/net: fix in i40e HW rings memory overlap sys_stv

automatic DPDK test reports

This inbox may be cloned and mirrored by anyone:

	git clone --mirror https://inbox.dpdk.org/test-report/0 test-report/git/0.git

	# If you have public-inbox 1.1+ installed, you may
	# initialize and index your mirror using the following commands:
	public-inbox-init -V2 test-report test-report/ https://inbox.dpdk.org/test-report \
		test-report@dpdk.org
	public-inbox-index test-report

Example config snippet for mirrors.
Newsgroup available over NNTP:
	nntp://inbox.dpdk.org/inbox.dpdk.test-report


AGPL code for this site: git clone https://public-inbox.org/public-inbox.git