automatic DPDK test reports
 help / color / mirror / Atom feed
* [dpdk-test-report] |FAILURE| pw(72163) [v4] bus/pci: fix VF bus error for memory access
@ 2020-06-28 12:21 sys_stv
  0 siblings, 0 replies; 2+ messages in thread
From: sys_stv @ 2020-06-28 12:21 UTC (permalink / raw)
  To: test-report

[-- Attachment #1: Type: text/plain, Size: 56853 bytes --]


Test-Label: Intel-compilation
Test-Status: FAILURE
http://dpdk.org/patch/72163

_Compilation issues_

Submitter: Wang, Haiyue <haiyue.wang@intel.com>
Date: 2020-06-25 03:50:46
Reply_mail: 20200625035046.19820-1-haiyue.wang@intel.com

DPDK git baseline: Repo:dpdk, CommitID: 6248368a9ae1eadf6b7fb05ab37497afdb714429


Meson build Summary: 8 Builds Done, 3 Successful, 5 Failures, 0 Blocked

Makefile build Summary: 20 Builds Done, 4 Successful, 16 Failures, 0 Blocked

                +==============================================+===========+==========+
                |                   Makefile                   |   Meson   | Document |
+----------------+------+-------+------+------------+-----------+-----------+----------+
| os             | gcc  | clang | icc  | gcc+shared | gcc+debug | gcc/clang | pdf/html |
+----------------+------+-------+------+------------+-----------+-----------+----------+
| CENTOS82-64    | FAIL | FAIL  | FAIL | FAIL       | FAIL      | FAIL      |          |
| RHEL82-64      | FAIL |       |      |            |           |           |          |
| UB1804-64      | FAIL |       |      |            |           |           |          |
| FC32-64        | FAIL | FAIL  |      |            |           | FAIL      |          |
| CENTOS77-64    | FAIL |       |      |            |           |           |          |
| UB2004-64      | FAIL | FAIL  | FAIL |            |           | FAIL      | pass     |
| WIN10-64       |      |       |      |            |           | pass      |          |
| UB2004-32      | FAIL |       |      |            |           |           |          |
| UB1804-32      |      |       |      |            |           | FAIL      |          |
| FreeBSD1201-64 | pass | pass  |      | pass       | pass      | pass      |          |
| SUSE15-64      | FAIL | FAIL  |      |            |           | FAIL      |          |
+----------------+------+-------+------+------------+-----------+-----------+----------+
Test environment and configuration as below:

** Makefile build **


OS: CENTOS82-64
	Kernel Version: 4.18.0-193.el8.x86_64
	CPU info: Intel(R) Xeon(R) Platinum 8280M CPU @ 2.70GHz
	GCC Version: gcc (GCC) 8.3.1 20191121 (Red Hat 8.3.1-5)
	Clang Version: 9.0.1 (Red Hat 9.0.1-2.module_el8.2.0+309+0c7b6b03)
	x86_64-native-linuxapp-gcc
	x86_64-native-linuxapp-clang
	x86_64-native-linuxapp-icc
	x86_64-native-linuxapp-gcc+shared
	x86_64-native-linuxapp-gcc+debug


OS: RHEL82-64
	Kernel Version: 4.18.0-193.el8.x86_64
	CPU info: Intel(R) Xeon(R) Platinum 8280M CPU @ 2.70GHz
	GCC Version: gcc (GCC) 8.3.1 20191121 (Red Hat 8.3.1-5)
	Clang Version: 8.0.1 (Red Hat 8.0.1-1.module_el8.1.0+215+a01033fb)
	x86_64-native-linuxapp-gcc


OS: UB1804-64
	Kernel Version: 4.15.0-29-generic
	CPU info: Intel(R) Xeon(R) Platinum 8180 CPU @ 2.50GHz
	GCC Version: gcc (Ubuntu 7.5.0-3ubuntu1~18.04) 7.5.0
	Clang Version: 6.0.0-1ubuntu2 (tags/RELEASE_600/final)
	x86_64-native-linuxapp-gcc


OS: FC32-64
	Kernel Version: 5.6.0-0.rc7.git0.2.fc32.x86_64
	CPU info: Intel(R) Xeon(R) Platinum 8280M CPU @ 2.70GHz
	GCC Version: gcc (GCC) 10.0.1 20200311 (Red Hat 10.0.1-0.9)
	Clang Version: 10.0.0 (Fedora 10.0.0-0.3.rc4.fc32)
	x86_64-native-linuxapp-gcc
	x86_64-native-linuxapp-clang


OS: CENTOS77-64
	Kernel Version: 3.10.0-1062.9.1.el7.x86_64
	CPU info: Intel(R) Xeon(R) Platinum 8280M CPU @ 2.70GHz
	GCC Version: gcc (GCC) 4.8.5 20150623 (Red Hat 4.8.5-39)
	Clang Version: 3.4.2 (tags/RELEASE_34/dot2-final)
	x86_64-native-linuxapp-gcc


OS: UB2004-64
	Kernel Version: 5.4.0-26-generic
	CPU info: Intel(R) Xeon(R) Platinum 8180 CPU @ 2.50GHz
	GCC Version: gcc (Ubuntu 10-20200416-0ubuntu1) 10.0.1 20200416 (experimental) [master revision 3c3f12e2a76:dcee354ce56:44b326839d864fc10c459916abcc97f35a9ac3de]
	Clang Version: 10.0.0-4ubuntu1
	x86_64-native-linuxapp-clang
	x86_64-native-linuxapp-gcc
	x86_64-native-linuxapp-icc


OS: UB2004-32
	Kernel Version: 5.4.0-26-generic
	CPU info: Intel(R) Xeon(R) Platinum 8180 CPU @ 2.50GHz
	GCC Version: gcc (Ubuntu 9.3.0-10ubuntu2) 9.3.0
	Clang Version: 10.0.0-4ubuntu1
	i686-native-linuxapp-gcc


OS: FreeBSD1201-64
	Kernel Version: 12.1-RELEASE
	CPU info: Intel(R) Xeon(R) CPU E5-2699 v3 @ 2.30GHz (2294.74-MHz K8-class CPU)
	GCC Version: gcc (FreeBSD Ports Collection) 9.2.0
	Clang Version: 8.0.1 (tags/RELEASE_801/final 366581) (based on LLVM 8.0.1)
	x86_64-native-bsdapp-gcc
	x86_64-native-bsdapp-clang
	x86_64-native-bsdapp-gcc+shared
	x86_64-native-bsdapp-gcc+debug


OS: SUSE15-64
	Kernel Version: 4.12.14-lp150.11-default
	CPU info: Intel(R) Xeon(R) CPU E5-2699 v4 @ 2.20GHz
	GCC Version: gcc (SUSE Linux) 7.3.1 20180323 [gcc-7-branch revision 258812]
	Clang Version: 5.0.1 (tags/RELEASE_501/final 312548)
	x86_64-native-linuxapp-clang
	x86_64-native-linuxapp-gcc

** Meson build **


OS: CENTOS82-64
	Kernel Version: 4.18.0-193.el8.x86_64
	CPU info: Intel(R) Xeon(R) CPU E5-2699 v4 @ 2.20GHz
	GCC Version: gcc (GCC) 8.3.1 20191121 (Red Hat 8.3.1-5)
	Clang Version: 9.0.1 (Red Hat 9.0.1-2.module_el8.2.0+309+0c7b6b03)
	./build-gcc-static
	./build-gcc-shared
	./build-clang-static
	./build-clang-shared
	./build-x86-default


OS: UB2004-64
	Kernel Version: 5.4.0-26-generic
	CPU info: Intel(R) Xeon(R) Platinum 8180 CPU @ 2.50GHz
	GCC Version: gcc (Ubuntu 9.3.0-10ubuntu2) 9.3.0
	Clang Version: 10.0.0-4ubuntu1
	x86_64-native-linuxapp-doc
	./build-gcc-static
	./build-gcc-shared
	./build-clang-static
	./build-clang-shared
	./build-x86-default


OS: FC32-64
	Kernel Version: 5.6.0-0.rc7.git0.2.fc32.x86_64
	CPU info: Intel(R) Xeon(R) CPU E5-2699 v4 @ 2.20GHz
	GCC Version: gcc (GCC) 10.0.1 20200311 (Red Hat 10.0.1-0.9)
	Clang Version: 10.0.0 (Fedora 10.0.0-0.3.rc4.fc32)
	./build-gcc-static
	./build-gcc-shared
	./build-clang-static
	./build-clang-shared
	./build-x86-default


OS: WIN10-64
	Kernel Version: N/A
	CPU info: N/A
	GCC Version: N/A
	Clang Version: Clang 8.0.0
	x86_64-windows-clang


OS: UB1804-32
	Kernel Version: 4.15.0-20-generic
	CPU info: Intel(R) Xeon(R) CPU E5-2699 v4 @ 2.20GHz
	GCC Version: gcc (Ubuntu 7.5.0-3ubuntu1~18.04) 7.5.0
	Clang Version: 6.0.0-1ubuntu2 (tags/RELEASE_600/final)
	./build-gcc-static
	./build-gcc-shared
	./build-clang-static
	./build-clang-shared
	./build-x86-default


OS: FreeBSD1201-64
	Kernel Version: 12.1-RELEASE
	CPU info: Intel(R) Xeon(R) CPU E5-2699 v4 @ 2.20GHz (2194.97-MHz K8-class CPU)
	GCC Version: gcc (FreeBSD Ports Collection) 9.2.0
	Clang Version: 8.0.1 (tags/RELEASE_801/final 366581) (based on LLVM 8.0.1)
	./build-gcc-static
	./build-gcc-shared
	./build-clang-static
	./build-clang-shared
	./build-x86-default


OS: SUSE15-64
	Kernel Version: 4.12.14-lp150.12.82-default
	CPU info: Intel(R) Xeon(R) CPU E5-2699 v4 @ 2.20GHz
	GCC Version: gcc (SUSE Linux) 7.4.1 20190905 [gcc-7-branch revision 275407]
	Clang Version: 5.0.1 (tags/RELEASE_501/final 312548)
	./build-gcc-static
	./build-gcc-shared
	./build-clang-static
	./build-clang-shared
	./build-x86-default



*Meson Build Failed #1:
OS: CENTOS82-64
Target:./build-gcc-static
FAILED: drivers/a715181@@tmp_rte_bus_pci@sta/bus_pci_linux_pci_vfio.c.o 
gcc -Idrivers/a715181@@tmp_rte_bus_pci@sta -Idrivers -I../drivers -Idrivers/bus/pci -I../drivers/bus/pci -I../drivers/bus/pci/linux -I. -I../ -Iconfig -I../config -Ilib/librte_eal/include -I../lib/librte_eal/include -Ilib/librte_eal/linux/include -I../lib/librte_eal/linux/include -Ilib/librte_eal/x86/include -I../lib/librte_eal/x86/include -Ilib/librte_eal/common -I../lib/librte_eal/common -Ilib/librte_eal -I../lib/librte_eal -Ilib/librte_kvargs -I../lib/librte_kvargs -Ilib/librte_telemetry/../librte_metrics -I../lib/librte_telemetry/../librte_metrics -Ilib/librte_telemetry -I../lib/librte_telemetry -Ilib/librte_pci -I../lib/librte_pci -fdiagnostics-color=always -pipe -D_FILE_OFFSET_BITS=64 -Wall -Winvalid-pch -Werror -O2 -g -include rte_config.h -Wextra -Wcast-qual -Wdeprecated -Wformat-nonliteral -Wformat-security -Wmissing-declarations -Wmissing-prototypes -Wnested-externs -Wold-style-definition -Wpointer-arith -Wsign-compare -Wstrict-prototypes -Wundef -Wwrite-strings -Wno-packed-not-aligned -Wno-missing-field-initializers -D_GNU_SOURCE -fPIC -march=native -mno-avx512f -DALLOW_EXPERIMENTAL_API -DALLOW_INTERNAL_API -Wno-format-truncation -MD -MQ 'drivers/a715181@@tmp_rte_bus_pci@sta/bus_pci_linux_pci_vfio.c.o' -MF 'drivers/a715181@@tmp_rte_bus_pci@sta/bus_pci_linux_pci_vfio.c.o.d' -o 'drivers/a715181@@tmp_rte_bus_pci@sta/bus_pci_linux_pci_vfio.c.o' -c ../drivers/bus/pci/linux/pci_vfio.c
../drivers/bus/pci/linux/pci_vfio.c:186:1: error: redefinition of ‘pci_vfio_enable_bus_memory’
 pci_vfio_enable_bus_memory(int dev_fd)
 ^~~~~~~~~~~~~~~~~~~~~~~~~~
../drivers/bus/pci/linux/pci_vfio.c:154:1: note: previous definition of ‘pci_vfio_enable_bus_memory’ was here
 pci_vfio_enable_bus_memory(int dev_fd)
 ^~~~~~~~~~~~~~~~~~~~~~~~~~
../drivers/bus/pci/linux/pci_vfio.c:154:1: error: ‘pci_vfio_enable_bus_memory’ defined but not used [-Werror=unused-function]
cc1: all warnings being treated as errors
[570/2199] Compiling C object 'drivers/a715181@@tmp_rte_bus_pci@sta/bus_pci_pci_common.c.o'.
[571/2199] Compiling C object 'drivers/a715181@@tmp_rte_bus_vdev@sta/bus_vdev_vdev_params.c.o'.
[572/2199] Compiling C object 'drivers/a715181@@tmp_rte_bus_fslmc@sta/bus_fslmc_qbman_qbman_portal.c.o'.
[573/2199] Compiling C object 'drivers/a715181@@tmp_rte_bus_pci@sta/bus_pci_linux_pci_uio.c.o'.
[574/2199] Generating rte_common_octeontx2.sym_chk with a meson_exe.py custom command.
[575/2199] Compiling C object 'drivers/a715181@@tmp_rte_bus_vdev@sta/bus_vdev_vdev.c.o'.
[576/2199] Generating symbol file 'lib/76b5a35@@rte_vhost@sha/librte_vhost.so.20.0.3.symbols'.
[577/2199] Compiling C object 'drivers/a715181@@tmp_rte_bus_pci@sta/bus_pci_linux_pci.c.o'.
[578/2199] Generating rte_bus_ifpga.sym_chk with a meson_exe.py custom command.
[579/2199] Compiling C object 'drivers/a715181@@tmp_rte_bus_dpaa@sta/bus_dpaa_base_qbman_qman.c.o'.
[580/2199] Compiling C object 'lib/76b5a35@@rte_pipeline@sta/librte_pipeline_rte_table_action.c.o'.
ninja: build stopped: subcommand failed




*Meson Build Failed #2:
OS: FC32-64
Target:./build-gcc-static
FAILED: drivers/a715181@@tmp_rte_bus_pci@sta/bus_pci_linux_pci_vfio.c.o 
gcc -Idrivers/a715181@@tmp_rte_bus_pci@sta -Idrivers -I../drivers -Idrivers/bus/pci -I../drivers/bus/pci -I../drivers/bus/pci/linux -I. -I../ -Iconfig -I../config -Ilib/librte_eal/include -I../lib/librte_eal/include -Ilib/librte_eal/linux/include -I../lib/librte_eal/linux/include -Ilib/librte_eal/x86/include -I../lib/librte_eal/x86/include -Ilib/librte_eal/common -I../lib/librte_eal/common -Ilib/librte_eal -I../lib/librte_eal -Ilib/librte_kvargs -I../lib/librte_kvargs -Ilib/librte_telemetry/../librte_metrics -I../lib/librte_telemetry/../librte_metrics -Ilib/librte_telemetry -I../lib/librte_telemetry -Ilib/librte_pci -I../lib/librte_pci -fdiagnostics-color=always -pipe -D_FILE_OFFSET_BITS=64 -Wall -Winvalid-pch -Werror -O2 -g -include rte_config.h -Wextra -Wcast-qual -Wdeprecated -Wformat-nonliteral -Wformat-security -Wmissing-declarations -Wmissing-prototypes -Wnested-externs -Wold-style-definition -Wpointer-arith -Wsign-compare -Wstrict-prototypes -Wundef -Wwrite-strings -Wno-address-of-packed-member -Wno-packed-not-aligned -Wno-missing-field-initializers -Wno-zero-length-bounds -D_GNU_SOURCE -fPIC -march=native -DALLOW_EXPERIMENTAL_API -DALLOW_INTERNAL_API -Wno-format-truncation -MD -MQ 'drivers/a715181@@tmp_rte_bus_pci@sta/bus_pci_linux_pci_vfio.c.o' -MF 'drivers/a715181@@tmp_rte_bus_pci@sta/bus_pci_linux_pci_vfio.c.o.d' -o 'drivers/a715181@@tmp_rte_bus_pci@sta/bus_pci_linux_pci_vfio.c.o' -c ../drivers/bus/pci/linux/pci_vfio.c
../drivers/bus/pci/linux/pci_vfio.c:186:1: error: redefinition of ‘pci_vfio_enable_bus_memory’
  186 | pci_vfio_enable_bus_memory(int dev_fd)
      | ^~~~~~~~~~~~~~~~~~~~~~~~~~
../drivers/bus/pci/linux/pci_vfio.c:154:1: note: previous definition of ‘pci_vfio_enable_bus_memory’ was here
  154 | pci_vfio_enable_bus_memory(int dev_fd)
      | ^~~~~~~~~~~~~~~~~~~~~~~~~~
../drivers/bus/pci/linux/pci_vfio.c:154:1: error: ‘pci_vfio_enable_bus_memory’ defined but not used [-Werror=unused-function]
cc1: all warnings being treated as errors
[566/2200] Generating rte_bus_pci_def with a custom command.
[567/2200] Generating rte_bus_ifpga.pmd.c with a custom command.
[568/2200] Compiling C object 'drivers/a715181@@tmp_rte_bus_pci@sta/bus_pci_pci_common.c.o'.
[569/2200] Compiling C object 'drivers/a715181@@tmp_rte_bus_fslmc@sta/bus_fslmc_qbman_qbman_portal.c.o'.
[570/2200] Generating rte_common_octeontx2.sym_chk with a meson_exe.py custom command.
[571/2200] Compiling C object 'drivers/a715181@@tmp_rte_bus_pci@sta/bus_pci_linux_pci_uio.c.o'.
[572/2200] Compiling C object 'drivers/a715181@@tmp_rte_bus_pci@sta/bus_pci_linux_pci.c.o'.
[573/2200] Compiling C object 'drivers/a715181@@tmp_rte_bus_dpaa@sta/bus_dpaa_base_qbman_qman.c.o'.
[574/2200] Compiling C object 'lib/76b5a35@@rte_pipeline@sta/librte_pipeline_rte_table_action.c.o'.
ninja: build stopped: subcommand failed




*Meson Build Failed #3:
OS: SUSE15-64
Target:./build-gcc-static
FAILED: drivers/a715181@@tmp_rte_bus_pci@sta/bus_pci_linux_pci_vfio.c.o 
gcc -Idrivers/a715181@@tmp_rte_bus_pci@sta -Idrivers -I../drivers -Idrivers/bus/pci -I../drivers/bus/pci -I../drivers/bus/pci/linux -I. -I../ -Iconfig -I../config -Ilib/librte_eal/include -I../lib/librte_eal/include -Ilib/librte_eal/linux/include -I../lib/librte_eal/linux/include -Ilib/librte_eal/x86/include -I../lib/librte_eal/x86/include -Ilib/librte_eal/common -I../lib/librte_eal/common -Ilib/librte_eal -I../lib/librte_eal -Ilib/librte_kvargs -I../lib/librte_kvargs -Ilib/librte_telemetry/../librte_metrics -I../lib/librte_telemetry/../librte_metrics -Ilib/librte_telemetry -I../lib/librte_telemetry -Ilib/librte_pci -I../lib/librte_pci -fdiagnostics-color=always -pipe -D_FILE_OFFSET_BITS=64 -Wall -Winvalid-pch -Werror -O2 -g -include rte_config.h -Wextra -Wcast-qual -Wdeprecated -Wformat-nonliteral -Wformat-security -Wmissing-declarations -Wmissing-prototypes -Wnested-externs -Wold-style-definition -Wpointer-arith -Wsign-compare -Wstrict-prototypes -Wundef -Wwrite-strings -Wno-missing-field-initializers -D_GNU_SOURCE -fPIC -march=native -DALLOW_EXPERIMENTAL_API -DALLOW_INTERNAL_API -Wno-format-truncation -MD -MQ 'drivers/a715181@@tmp_rte_bus_pci@sta/bus_pci_linux_pci_vfio.c.o' -MF 'drivers/a715181@@tmp_rte_bus_pci@sta/bus_pci_linux_pci_vfio.c.o.d' -o 'drivers/a715181@@tmp_rte_bus_pci@sta/bus_pci_linux_pci_vfio.c.o' -c ../drivers/bus/pci/linux/pci_vfio.c
../drivers/bus/pci/linux/pci_vfio.c:186:1: error: redefinition of ‘pci_vfio_enable_bus_memory’
 pci_vfio_enable_bus_memory(int dev_fd)
 ^~~~~~~~~~~~~~~~~~~~~~~~~~
../drivers/bus/pci/linux/pci_vfio.c:154:1: note: previous definition of ‘pci_vfio_enable_bus_memory’ was here
 pci_vfio_enable_bus_memory(int dev_fd)
 ^~~~~~~~~~~~~~~~~~~~~~~~~~
../drivers/bus/pci/linux/pci_vfio.c:154:1: error: ‘pci_vfio_enable_bus_memory’ defined but not used [-Werror=unused-function]
cc1: all warnings being treated as errors
[569/2103] Compiling C object 'drivers/a715181@@rte_bus_ifpga@sta/meson-generated_.._rte_bus_ifpga.pmd.c.o'.
[570/2103] Linking static target drivers/libtmp_rte_bus_fslmc.a.
[571/2103] Compiling C object 'drivers/a715181@@rte_bus_ifpga@sha/meson-generated_.._rte_bus_ifpga.pmd.c.o'.
[572/2103] Compiling C object 'drivers/a715181@@tmp_rte_bus_pci@sta/bus_pci_linux_pci_uio.c.o'.
[573/2103] Compiling C object 'drivers/a715181@@tmp_rte_bus_vdev@sta/bus_vdev_vdev_params.c.o'.
[574/2103] Generating rte_common_octeontx2.sym_chk with a meson_exe.py custom command.
[575/2103] Compiling C object 'drivers/a715181@@tmp_rte_bus_pci@sta/bus_pci_linux_pci.c.o'.
[576/2103] Compiling C object 'drivers/a715181@@tmp_rte_bus_dpaa@sta/bus_dpaa_base_qbman_qman.c.o'.
[577/2103] Compiling C object 'lib/76b5a35@@rte_pipeline@sta/librte_pipeline_rte_table_action.c.o'.
ninja: build stopped: subcommand failed




*Meson Build Failed #4:
OS: UB1804-32
Target:./build-gcc-static
FAILED: drivers/a715181@@tmp_rte_bus_pci@sta/bus_pci_linux_pci_vfio.c.o 
gcc -Idrivers/a715181@@tmp_rte_bus_pci@sta -Idrivers -I../drivers -Idrivers/bus/pci -I../drivers/bus/pci -I../drivers/bus/pci/linux -I. -I../ -Iconfig -I../config -Ilib/librte_eal/include -I../lib/librte_eal/include -Ilib/librte_eal/linux/include -I../lib/librte_eal/linux/include -Ilib/librte_eal/x86/include -I../lib/librte_eal/x86/include -Ilib/librte_eal/common -I../lib/librte_eal/common -Ilib/librte_eal -I../lib/librte_eal -Ilib/librte_kvargs -I../lib/librte_kvargs -Ilib/librte_telemetry/../librte_metrics -I../lib/librte_telemetry/../librte_metrics -Ilib/librte_telemetry -I../lib/librte_telemetry -Ilib/librte_pci -I../lib/librte_pci -fdiagnostics-color=always -pipe -D_FILE_OFFSET_BITS=64 -Wall -Winvalid-pch -Werror -O2 -g -include rte_config.h -Wextra -Wcast-qual -Wdeprecated -Wformat-nonliteral -Wformat-security -Wmissing-declarations -Wmissing-prototypes -Wnested-externs -Wold-style-definition -Wpointer-arith -Wsign-compare -Wstrict-prototypes -Wundef -Wwrite-strings -Wno-missing-field-initializers -Wno-pointer-to-int-cast -D_GNU_SOURCE -m32 -fPIC -march=native -DALLOW_EXPERIMENTAL_API -DALLOW_INTERNAL_API -Wno-format-truncation -MD -MQ 'drivers/a715181@@tmp_rte_bus_pci@sta/bus_pci_linux_pci_vfio.c.o' -MF 'drivers/a715181@@tmp_rte_bus_pci@sta/bus_pci_linux_pci_vfio.c.o.d' -o 'drivers/a715181@@tmp_rte_bus_pci@sta/bus_pci_linux_pci_vfio.c.o' -c ../drivers/bus/pci/linux/pci_vfio.c
../drivers/bus/pci/linux/pci_vfio.c:186:1: error: redefinition of ‘pci_vfio_enable_bus_memory’
 pci_vfio_enable_bus_memory(int dev_fd)
 ^~~~~~~~~~~~~~~~~~~~~~~~~~
../drivers/bus/pci/linux/pci_vfio.c:154:1: note: previous definition of ‘pci_vfio_enable_bus_memory’ was here
 pci_vfio_enable_bus_memory(int dev_fd)
 ^~~~~~~~~~~~~~~~~~~~~~~~~~
../drivers/bus/pci/linux/pci_vfio.c:154:1: error: ‘pci_vfio_enable_bus_memory’ defined but not used [-Werror=unused-function]
cc1: all warnings being treated as errors
[563/1955] Compiling C object 'drivers/a715181@@rte_bus_ifpga@sta/meson-generated_.._rte_bus_ifpga.pmd.c.o'.
[564/1955] Compiling C object 'drivers/a715181@@rte_bus_ifpga@sha/meson-generated_.._rte_bus_ifpga.pmd.c.o'.
[565/1955] Compiling C object 'drivers/a715181@@tmp_rte_bus_vdev@sta/bus_vdev_vdev_params.c.o'.
[566/1955] Compiling C object 'drivers/a715181@@tmp_rte_bus_pci@sta/bus_pci_pci_common.c.o'.
[567/1955] Compiling C object 'drivers/a715181@@tmp_rte_bus_pci@sta/bus_pci_linux_pci_uio.c.o'.
[568/1955] Generating rte_common_octeontx2.sym_chk with a meson_exe.py custom command.
[569/1955] Compiling C object 'drivers/a715181@@tmp_rte_bus_fslmc@sta/bus_fslmc_qbman_qbman_portal.c.o'.
[570/1955] Compiling C object 'drivers/a715181@@tmp_rte_bus_vdev@sta/bus_vdev_vdev.c.o'.
[571/1955] Compiling C object 'drivers/a715181@@tmp_rte_bus_pci@sta/bus_pci_linux_pci.c.o'.
[572/1955] Compiling C object 'drivers/a715181@@tmp_rte_bus_dpaa@sta/bus_dpaa_base_qbman_qman.c.o'.
[573/1955] Compiling C object 'lib/76b5a35@@rte_pipeline@sta/librte_pipeline_rte_table_action.c.o'.
ninja: build stopped: subcommand failed




*Meson Build Failed #5:
OS: UB2004-64
Target:./build-gcc-static
FAILED: drivers/a715181@@tmp_rte_bus_pci@sta/bus_pci_linux_pci_vfio.c.o 
gcc -Idrivers/a715181@@tmp_rte_bus_pci@sta -Idrivers -I../drivers -Idrivers/bus/pci -I../drivers/bus/pci -I../drivers/bus/pci/linux -I. -I../ -Iconfig -I../config -Ilib/librte_eal/include -I../lib/librte_eal/include -Ilib/librte_eal/linux/include -I../lib/librte_eal/linux/include -Ilib/librte_eal/x86/include -I../lib/librte_eal/x86/include -Ilib/librte_eal/common -I../lib/librte_eal/common -Ilib/librte_eal -I../lib/librte_eal -Ilib/librte_kvargs -I../lib/librte_kvargs -Ilib/librte_telemetry/../librte_metrics -I../lib/librte_telemetry/../librte_metrics -Ilib/librte_telemetry -I../lib/librte_telemetry -Ilib/librte_pci -I../lib/librte_pci -fdiagnostics-color=always -pipe -D_FILE_OFFSET_BITS=64 -Wall -Winvalid-pch -Werror -O2 -g -include rte_config.h -Wextra -Wcast-qual -Wdeprecated -Wformat-nonliteral -Wformat-security -Wmissing-declarations -Wmissing-prototypes -Wnested-externs -Wold-style-definition -Wpointer-arith -Wsign-compare -Wstrict-prototypes -Wundef -Wwrite-strings -Wno-address-of-packed-member -Wno-packed-not-aligned -Wno-missing-field-initializers -D_GNU_SOURCE -fPIC -march=native -DALLOW_EXPERIMENTAL_API -DALLOW_INTERNAL_API -Wno-format-truncation -MD -MQ 'drivers/a715181@@tmp_rte_bus_pci@sta/bus_pci_linux_pci_vfio.c.o' -MF 'drivers/a715181@@tmp_rte_bus_pci@sta/bus_pci_linux_pci_vfio.c.o.d' -o 'drivers/a715181@@tmp_rte_bus_pci@sta/bus_pci_linux_pci_vfio.c.o' -c ../drivers/bus/pci/linux/pci_vfio.c
../drivers/bus/pci/linux/pci_vfio.c:186:1: error: redefinition of ‘pci_vfio_enable_bus_memory’
  186 | pci_vfio_enable_bus_memory(int dev_fd)
      | ^~~~~~~~~~~~~~~~~~~~~~~~~~
../drivers/bus/pci/linux/pci_vfio.c:154:1: note: previous definition of ‘pci_vfio_enable_bus_memory’ was here
  154 | pci_vfio_enable_bus_memory(int dev_fd)
      | ^~~~~~~~~~~~~~~~~~~~~~~~~~
../drivers/bus/pci/linux/pci_vfio.c:154:1: error: ‘pci_vfio_enable_bus_memory’ defined but not used [-Werror=unused-function]
cc1: all warnings being treated as errors
[568/2191] Compiling C object 'drivers/a715181@@tmp_rte_bus_vdev@sta/bus_vdev_vdev_params.c.o'.
[569/2191] Generating rte_bus_ifpga.pmd.c with a custom command.
[570/2191] Compiling C object 'drivers/a715181@@tmp_rte_bus_pci@sta/bus_pci_linux_pci_uio.c.o'.
[571/2191] Compiling C object 'drivers/a715181@@tmp_rte_bus_pci@sta/bus_pci_pci_common.c.o'.
[572/2191] Generating rte_common_octeontx2.sym_chk with a meson_exe.py custom command.
[573/2191] Compiling C object 'drivers/a715181@@tmp_rte_bus_vmbus@sta/bus_vmbus_vmbus_common.c.o'.
[574/2191] Compiling C object 'drivers/a715181@@tmp_rte_bus_vdev@sta/bus_vdev_vdev.c.o'.
[575/2191] Compiling C object 'drivers/a715181@@tmp_rte_bus_fslmc@sta/bus_fslmc_qbman_qbman_portal.c.o'.
[576/2191] Compiling C object 'drivers/a715181@@tmp_rte_bus_pci@sta/bus_pci_linux_pci.c.o'.
[577/2191] Compiling C object 'drivers/a715181@@tmp_rte_bus_dpaa@sta/bus_dpaa_base_qbman_qman.c.o'.
[578/2191] Compiling C object 'lib/76b5a35@@rte_pipeline@sta/librte_pipeline_rte_table_action.c.o'.
ninja: build stopped: subcommand failed



*Makefile Build Failed #1:
OS: CENTOS77-64
Target: x86_64-native-linuxapp-gcc
  CC linux/pci_vfio.o
  CC base/qbman/bman_driver.o
  CC mc/dpmng.o
/root/CENTOS77-64_K3.10.0_GCC4.8.5/x86_64-native-linuxapp-gcc/343c35f2883f4c67b4f2fb9a78343eed/dpdk/drivers/bus/pci/linux/pci_vfio.c:186:1: error: redefinition of ‘pci_vfio_enable_bus_memory’
 pci_vfio_enable_bus_memory(int dev_fd)
 ^
/root/CENTOS77-64_K3.10.0_GCC4.8.5/x86_64-native-linuxapp-gcc/343c35f2883f4c67b4f2fb9a78343eed/dpdk/drivers/bus/pci/linux/pci_vfio.c:154:1: note: previous definition of ‘pci_vfio_enable_bus_memory’ was here
--
 ^
/root/CENTOS77-64_K3.10.0_GCC4.8.5/x86_64-native-linuxapp-gcc/343c35f2883f4c67b4f2fb9a78343eed/dpdk/drivers/bus/pci/linux/pci_vfio.c:154:1: warning: ‘pci_vfio_enable_bus_memory’ defined but not used [-Wunused-function]
cc1: warning: unrecognized command line option "-Wno-address-of-packed-member" [enabled by default]
make[6]: *** [linux/pci_vfio.o] Error 1
make[5]: *** [pci] Error 2
make[5]: *** Waiting for unfinished jobs....
  CC vmbus_common_uio.o
  CC base/qbman/qman.o
--
  INSTALL-LIB librte_bus_dpaa.a
  AR librte_bus_fslmc.a
  INSTALL-LIB librte_bus_fslmc.a
make[4]: *** [bus] Error 2
make[3]: *** [drivers] Error 2
make[2]: *** [all] Error 2
make[1]: *** [pre_install] Error 2
make: *** [install] Error 2


*Makefile Build Failed #2:
OS: CENTOS82-64
Target: x86_64-native-linuxapp-gcc
  CC vmbus_common_uio.o
  CC linux/pci_vfio.o
  CC pci_params.o
/root/CENTOS82-64_K4.18.0_GCC8.3.1/x86_64-native-linuxapp-gcc/343c35f2883f4c67b4f2fb9a78343eed/dpdk/drivers/bus/pci/linux/pci_vfio.c:186:1: error: redefinition of ‘pci_vfio_enable_bus_memory’
 pci_vfio_enable_bus_memory(int dev_fd)
 ^~~~~~~~~~~~~~~~~~~~~~~~~~
/root/CENTOS82-64_K4.18.0_GCC8.3.1/x86_64-native-linuxapp-gcc/343c35f2883f4c67b4f2fb9a78343eed/dpdk/drivers/bus/pci/linux/pci_vfio.c:154:1: note: previous definition of ‘pci_vfio_enable_bus_memory’ was here
--
/root/CENTOS82-64_K4.18.0_GCC8.3.1/x86_64-native-linuxapp-gcc/343c35f2883f4c67b4f2fb9a78343eed/dpdk/drivers/bus/pci/linux/pci_vfio.c:154:1: warning: ‘pci_vfio_enable_bus_memory’ defined but not used [-Wunused-function]
cc1: warning: unrecognized command line option ‘-Wno-address-of-packed-member’
  CC pci_common.o
make[6]: *** [/root/CENTOS82-64_K4.18.0_GCC8.3.1/x86_64-native-linuxapp-gcc/343c35f2883f4c67b4f2fb9a78343eed/dpdk/mk/internal/rte.compile-pre.mk:114: linux/pci_vfio.o] Error 1
make[6]: *** Waiting for unfinished jobs....
  CC mc/dpmng.o
  AR librte_bus_vmbus.a
--
  MODPOST 1 modules
  CC mc/dpbp.o
  CC base/qbman/bman.o
make[5]: *** [/root/CENTOS82-64_K4.18.0_GCC8.3.1/x86_64-native-linuxapp-gcc/343c35f2883f4c67b4f2fb9a78343eed/dpdk/mk/rte.subdir.mk:35: pci] Error 2
make[5]: *** Waiting for unfinished jobs....
  CC base/qbman/bman_driver.o
  CC      /root/CENTOS82-64_K4.18.0_GCC8.3.1/x86_64-native-linuxapp-gcc/343c35f2883f4c67b4f2fb9a78343eed/dpdk/x86_64-native-linuxapp-gcc/build/kernel/linux/igb_uio/igb_uio.mod.o
--
  INSTALL-LIB librte_bus_fslmc.a
  AR librte_bus_dpaa.a
  INSTALL-LIB librte_bus_dpaa.a
make[4]: *** [/root/CENTOS82-64_K4.18.0_GCC8.3.1/x86_64-native-linuxapp-gcc/343c35f2883f4c67b4f2fb9a78343eed/dpdk/mk/rte.subdir.mk:37: bus] Error 2
make[3]: *** [/root/CENTOS82-64_K4.18.0_GCC8.3.1/x86_64-native-linuxapp-gcc/343c35f2883f4c67b4f2fb9a78343eed/dpdk/mk/rte.sdkbuild.mk:51: drivers] Error 2
make[2]: *** [/root/CENTOS82-64_K4.18.0_GCC8.3.1/x86_64-native-linuxapp-gcc/343c35f2883f4c67b4f2fb9a78343eed/dpdk/mk/rte.sdkroot.mk:99: all] Error 2
make[1]: *** [/root/CENTOS82-64_K4.18.0_GCC8.3.1/x86_64-native-linuxapp-gcc/343c35f2883f4c67b4f2fb9a78343eed/dpdk/mk/rte.sdkinstall.mk:61: pre_install] Error 2
make: *** [/root/CENTOS82-64_K4.18.0_GCC8.3.1/x86_64-native-linuxapp-gcc/343c35f2883f4c67b4f2fb9a78343eed/dpdk/mk/rte.sdkroot.mk:77: install] Error 2


*Makefile Build Failed #3:
OS: CENTOS82-64
Target: x86_64-native-linuxapp-clang
  CC linux/pci_vfio.o
  CC mc/dpci.o
  CC vmbus_bufring.o
/root/CENTOS82-64_K4.18.0_Clang7.0.1/x86_64-native-linuxapp-clang/343c35f2883f4c67b4f2fb9a78343eed/dpdk/drivers/bus/pci/linux/pci_vfio.c:186:1: error: redefinition of 'pci_vfio_enable_bus_memory'
pci_vfio_enable_bus_memory(int dev_fd)
^
/root/CENTOS82-64_K4.18.0_Clang7.0.1/x86_64-native-linuxapp-clang/343c35f2883f4c67b4f2fb9a78343eed/dpdk/drivers/bus/pci/linux/pci_vfio.c:154:1: note: previous definition is here
pci_vfio_enable_bus_memory(int dev_fd)
^
1 error generated.
make[6]: *** [/root/CENTOS82-64_K4.18.0_Clang7.0.1/x86_64-native-linuxapp-clang/343c35f2883f4c67b4f2fb9a78343eed/dpdk/mk/internal/rte.compile-pre.mk:114: linux/pci_vfio.o] Error 1
make[5]: *** [/root/CENTOS82-64_K4.18.0_Clang7.0.1/x86_64-native-linuxapp-clang/343c35f2883f4c67b4f2fb9a78343eed/dpdk/mk/rte.subdir.mk:35: pci] Error 2
make[5]: *** Waiting for unfinished jobs....
  CC vmbus_common_uio.o
  CC base/qbman/dpaa_alloc.o
--
  INSTALL-LIB librte_bus_fslmc.a
  AR librte_bus_dpaa.a
  INSTALL-LIB librte_bus_dpaa.a
make[4]: *** [/root/CENTOS82-64_K4.18.0_Clang7.0.1/x86_64-native-linuxapp-clang/343c35f2883f4c67b4f2fb9a78343eed/dpdk/mk/rte.subdir.mk:37: bus] Error 2
make[3]: *** [/root/CENTOS82-64_K4.18.0_Clang7.0.1/x86_64-native-linuxapp-clang/343c35f2883f4c67b4f2fb9a78343eed/dpdk/mk/rte.sdkbuild.mk:51: drivers] Error 2
make[2]: *** [/root/CENTOS82-64_K4.18.0_Clang7.0.1/x86_64-native-linuxapp-clang/343c35f2883f4c67b4f2fb9a78343eed/dpdk/mk/rte.sdkroot.mk:99: all] Error 2
make[1]: *** [/root/CENTOS82-64_K4.18.0_Clang7.0.1/x86_64-native-linuxapp-clang/343c35f2883f4c67b4f2fb9a78343eed/dpdk/mk/rte.sdkinstall.mk:61: pre_install] Error 2
make: *** [/root/CENTOS82-64_K4.18.0_Clang7.0.1/x86_64-native-linuxapp-clang/343c35f2883f4c67b4f2fb9a78343eed/dpdk/mk/rte.sdkroot.mk:77: install] Error 2


*Makefile Build Failed #4:
OS: CENTOS82-64
Target: x86_64-native-linuxapp-icc
  CC linux/vmbus_bus.o
  CC pci_params.o
  CC vdev.o
/root/CENTOS82-64_K4.18.0_ICC19.1.1/x86_64-native-linuxapp-icc/343c35f2883f4c67b4f2fb9a78343eed/dpdk/drivers/bus/pci/linux/pci_vfio.c(186): error: function "pci_vfio_enable_bus_memory" has already been defined
  pci_vfio_enable_bus_memory(int dev_fd)
  ^

compilation aborted for /root/CENTOS82-64_K4.18.0_ICC19.1.1/x86_64-native-linuxapp-icc/343c35f2883f4c67b4f2fb9a78343eed/dpdk/drivers/bus/pci/linux/pci_vfio.c (code 2)
make[6]: *** [/root/CENTOS82-64_K4.18.0_ICC19.1.1/x86_64-native-linuxapp-icc/343c35f2883f4c67b4f2fb9a78343eed/dpdk/mk/internal/rte.compile-pre.mk:114: linux/pci_vfio.o] Error 2
make[6]: *** Waiting for unfinished jobs....
  CC mc/dpmng.o
  CC mc/dpbp.o
  CC ifpga_common.o
  CC mc/dpio.o
make[5]: *** [/root/CENTOS82-64_K4.18.0_ICC19.1.1/x86_64-native-linuxapp-icc/343c35f2883f4c67b4f2fb9a78343eed/dpdk/mk/rte.subdir.mk:37: pci] Error 2
make[5]: *** Waiting for unfinished jobs....
  CC vdev_params.o
  CC linux/vmbus_uio.o
--
  INSTALL-LIB librte_bus_fslmc.a
  AR librte_bus_dpaa.a
  INSTALL-LIB librte_bus_dpaa.a
make[4]: *** [/root/CENTOS82-64_K4.18.0_ICC19.1.1/x86_64-native-linuxapp-icc/343c35f2883f4c67b4f2fb9a78343eed/dpdk/mk/rte.subdir.mk:37: bus] Error 2
make[3]: *** [/root/CENTOS82-64_K4.18.0_ICC19.1.1/x86_64-native-linuxapp-icc/343c35f2883f4c67b4f2fb9a78343eed/dpdk/mk/rte.sdkbuild.mk:51: drivers] Error 2
make[2]: *** [/root/CENTOS82-64_K4.18.0_ICC19.1.1/x86_64-native-linuxapp-icc/343c35f2883f4c67b4f2fb9a78343eed/dpdk/mk/rte.sdkroot.mk:99: all] Error 2
make[1]: *** [/root/CENTOS82-64_K4.18.0_ICC19.1.1/x86_64-native-linuxapp-icc/343c35f2883f4c67b4f2fb9a78343eed/dpdk/mk/rte.sdkinstall.mk:61: pre_install] Error 2
make: *** [/root/CENTOS82-64_K4.18.0_ICC19.1.1/x86_64-native-linuxapp-icc/343c35f2883f4c67b4f2fb9a78343eed/dpdk/mk/rte.sdkroot.mk:77: install] Error 2


*Makefile Build Failed #5:
OS: CENTOS82-64
Target: x86_64-native-linuxapp-gcc+shared
  CC base/qbman/process.o
  CC      /root/CENTOS82-64_K4.18.0_GCC8.3.1/x86_64-native-linuxapp-gcc+shared/343c35f2883f4c67b4f2fb9a78343eed/dpdk/x86_64-native-linuxapp-gcc/build/kernel/linux/igb_uio/igb_uio.mod.o
  CC base/qbman/bman.o
/root/CENTOS82-64_K4.18.0_GCC8.3.1/x86_64-native-linuxapp-gcc+shared/343c35f2883f4c67b4f2fb9a78343eed/dpdk/drivers/bus/pci/linux/pci_vfio.c:186:1: error: redefinition of ‘pci_vfio_enable_bus_memory’
 pci_vfio_enable_bus_memory(int dev_fd)
 ^~~~~~~~~~~~~~~~~~~~~~~~~~
/root/CENTOS82-64_K4.18.0_GCC8.3.1/x86_64-native-linuxapp-gcc+shared/343c35f2883f4c67b4f2fb9a78343eed/dpdk/drivers/bus/pci/linux/pci_vfio.c:154:1: note: previous definition of ‘pci_vfio_enable_bus_memory’ was here
--
 ^~~~~~~~~~~~~~~~~~~~~~~~~~
/root/CENTOS82-64_K4.18.0_GCC8.3.1/x86_64-native-linuxapp-gcc+shared/343c35f2883f4c67b4f2fb9a78343eed/dpdk/drivers/bus/pci/linux/pci_vfio.c:154:1: warning: ‘pci_vfio_enable_bus_memory’ defined but not used [-Wunused-function]
cc1: warning: unrecognized command line option ‘-Wno-address-of-packed-member’
make[6]: *** [/root/CENTOS82-64_K4.18.0_GCC8.3.1/x86_64-native-linuxapp-gcc+shared/343c35f2883f4c67b4f2fb9a78343eed/dpdk/mk/internal/rte.compile-pre.mk:114: linux/pci_vfio.o] Error 1
make[5]: *** [/root/CENTOS82-64_K4.18.0_GCC8.3.1/x86_64-native-linuxapp-gcc+shared/343c35f2883f4c67b4f2fb9a78343eed/dpdk/mk/rte.subdir.mk:35: pci] Error 2
make[5]: *** Waiting for unfinished jobs....
  CC base/qbman/bman_driver.o
  LD [M]  /root/CENTOS82-64_K4.18.0_GCC8.3.1/x86_64-native-linuxapp-gcc+shared/343c35f2883f4c67b4f2fb9a78343eed/dpdk/x86_64-native-linuxapp-gcc/build/kernel/linux/igb_uio/igb_uio.ko
--
  INSTALL-LIB librte_bus_dpaa.so.20.0.3
  LD librte_bus_fslmc.so.20.0.3
  INSTALL-LIB librte_bus_fslmc.so.20.0.3
make[4]: *** [/root/CENTOS82-64_K4.18.0_GCC8.3.1/x86_64-native-linuxapp-gcc+shared/343c35f2883f4c67b4f2fb9a78343eed/dpdk/mk/rte.subdir.mk:37: bus] Error 2
make[3]: *** [/root/CENTOS82-64_K4.18.0_GCC8.3.1/x86_64-native-linuxapp-gcc+shared/343c35f2883f4c67b4f2fb9a78343eed/dpdk/mk/rte.sdkbuild.mk:51: drivers] Error 2
make[2]: *** [/root/CENTOS82-64_K4.18.0_GCC8.3.1/x86_64-native-linuxapp-gcc+shared/343c35f2883f4c67b4f2fb9a78343eed/dpdk/mk/rte.sdkroot.mk:99: all] Error 2
make[1]: *** [/root/CENTOS82-64_K4.18.0_GCC8.3.1/x86_64-native-linuxapp-gcc+shared/343c35f2883f4c67b4f2fb9a78343eed/dpdk/mk/rte.sdkinstall.mk:61: pre_install] Error 2
make: *** [/root/CENTOS82-64_K4.18.0_GCC8.3.1/x86_64-native-linuxapp-gcc+shared/343c35f2883f4c67b4f2fb9a78343eed/dpdk/mk/rte.sdkroot.mk:77: install] Error 2


*Makefile Build Failed #6:
OS: CENTOS82-64
Target: x86_64-native-linuxapp-gcc+debug
  CC linux/vmbus_bus.o
  CC linux/pci_vfio.o
  CC pci_params.o
/root/CENTOS82-64_K4.18.0_GCC8.3.1/x86_64-native-linuxapp-gcc+debug/343c35f2883f4c67b4f2fb9a78343eed/dpdk/drivers/bus/pci/linux/pci_vfio.c:186:1: error: redefinition of ‘pci_vfio_enable_bus_memory’
 pci_vfio_enable_bus_memory(int dev_fd)
 ^~~~~~~~~~~~~~~~~~~~~~~~~~
/root/CENTOS82-64_K4.18.0_GCC8.3.1/x86_64-native-linuxapp-gcc+debug/343c35f2883f4c67b4f2fb9a78343eed/dpdk/drivers/bus/pci/linux/pci_vfio.c:154:1: note: previous definition of ‘pci_vfio_enable_bus_memory’ was here
--
 ^~~~~~~~~~~~~~~~~~~~~~~~~~
/root/CENTOS82-64_K4.18.0_GCC8.3.1/x86_64-native-linuxapp-gcc+debug/343c35f2883f4c67b4f2fb9a78343eed/dpdk/drivers/bus/pci/linux/pci_vfio.c:154:1: warning: ‘pci_vfio_enable_bus_memory’ defined but not used [-Wunused-function]
cc1: warning: unrecognized command line option ‘-Wno-address-of-packed-member’
make[6]: *** [/root/CENTOS82-64_K4.18.0_GCC8.3.1/x86_64-native-linuxapp-gcc+debug/343c35f2883f4c67b4f2fb9a78343eed/dpdk/mk/internal/rte.compile-pre.mk:114: linux/pci_vfio.o] Error 1
make[6]: *** Waiting for unfinished jobs....
  CC linux/vmbus_uio.o
  CC vdev_params.o
  CC ifpga_common.o
  CC vmbus_common.o
make[5]: *** [/root/CENTOS82-64_K4.18.0_GCC8.3.1/x86_64-native-linuxapp-gcc+debug/343c35f2883f4c67b4f2fb9a78343eed/dpdk/mk/rte.subdir.mk:37: pci] Error 2
make[5]: *** Waiting for unfinished jobs....
  CC qbman/qbman_debug.o
  AR librte_bus_vdev.a
--
  INSTALL-LIB librte_bus_dpaa.a
  AR librte_bus_fslmc.a
  INSTALL-LIB librte_bus_fslmc.a
make[4]: *** [/root/CENTOS82-64_K4.18.0_GCC8.3.1/x86_64-native-linuxapp-gcc+debug/343c35f2883f4c67b4f2fb9a78343eed/dpdk/mk/rte.subdir.mk:37: bus] Error 2
make[3]: *** [/root/CENTOS82-64_K4.18.0_GCC8.3.1/x86_64-native-linuxapp-gcc+debug/343c35f2883f4c67b4f2fb9a78343eed/dpdk/mk/rte.sdkbuild.mk:51: drivers] Error 2
make[2]: *** [/root/CENTOS82-64_K4.18.0_GCC8.3.1/x86_64-native-linuxapp-gcc+debug/343c35f2883f4c67b4f2fb9a78343eed/dpdk/mk/rte.sdkroot.mk:99: all] Error 2
make[1]: *** [/root/CENTOS82-64_K4.18.0_GCC8.3.1/x86_64-native-linuxapp-gcc+debug/343c35f2883f4c67b4f2fb9a78343eed/dpdk/mk/rte.sdkinstall.mk:61: pre_install] Error 2
make: *** [/root/CENTOS82-64_K4.18.0_GCC8.3.1/x86_64-native-linuxapp-gcc+debug/343c35f2883f4c67b4f2fb9a78343eed/dpdk/mk/rte.sdkroot.mk:77: install] Error 2


*Makefile Build Failed #7:
OS: FC32-64
Target: x86_64-native-linuxapp-gcc
  CC mc/mc_sys.o
  CC linux/pci_vfio.o
  CC base/qbman/bman.o
/root/FC32-64_K5.6.0_GCC10.0.1/x86_64-native-linuxapp-gcc/343c35f2883f4c67b4f2fb9a78343eed/dpdk/drivers/bus/pci/linux/pci_vfio.c:186:1: error: redefinition of ‘pci_vfio_enable_bus_memory’
  186 | pci_vfio_enable_bus_memory(int dev_fd)
      | ^~~~~~~~~~~~~~~~~~~~~~~~~~
/root/FC32-64_K5.6.0_GCC10.0.1/x86_64-native-linuxapp-gcc/343c35f2883f4c67b4f2fb9a78343eed/dpdk/drivers/bus/pci/linux/pci_vfio.c:154:1: note: previous definition of ‘pci_vfio_enable_bus_memory’ was here
  154 | pci_vfio_enable_bus_memory(int dev_fd)
      | ^~~~~~~~~~~~~~~~~~~~~~~~~~
/root/FC32-64_K5.6.0_GCC10.0.1/x86_64-native-linuxapp-gcc/343c35f2883f4c67b4f2fb9a78343eed/dpdk/drivers/bus/pci/linux/pci_vfio.c:154:1: warning: ‘pci_vfio_enable_bus_memory’ defined but not used [-Wunused-function]
make[6]: *** [/root/FC32-64_K5.6.0_GCC10.0.1/x86_64-native-linuxapp-gcc/343c35f2883f4c67b4f2fb9a78343eed/dpdk/mk/internal/rte.compile-pre.mk:116: linux/pci_vfio.o] Error 1
make[5]: *** [/root/FC32-64_K5.6.0_GCC10.0.1/x86_64-native-linuxapp-gcc/343c35f2883f4c67b4f2fb9a78343eed/dpdk/mk/rte.subdir.mk:35: pci] Error 2
make[5]: *** Waiting for unfinished jobs....
  CC base/qbman/bman_driver.o
  CC mc/dpcon.o
--
  INSTALL-LIB librte_bus_fslmc.a
  AR librte_bus_dpaa.a
  INSTALL-LIB librte_bus_dpaa.a
make[4]: *** [/root/FC32-64_K5.6.0_GCC10.0.1/x86_64-native-linuxapp-gcc/343c35f2883f4c67b4f2fb9a78343eed/dpdk/mk/rte.subdir.mk:37: bus] Error 2
make[3]: *** [/root/FC32-64_K5.6.0_GCC10.0.1/x86_64-native-linuxapp-gcc/343c35f2883f4c67b4f2fb9a78343eed/dpdk/mk/rte.sdkbuild.mk:51: drivers] Error 2
make[2]: *** [/root/FC32-64_K5.6.0_GCC10.0.1/x86_64-native-linuxapp-gcc/343c35f2883f4c67b4f2fb9a78343eed/dpdk/mk/rte.sdkroot.mk:99: all] Error 2
make[1]: *** [/root/FC32-64_K5.6.0_GCC10.0.1/x86_64-native-linuxapp-gcc/343c35f2883f4c67b4f2fb9a78343eed/dpdk/mk/rte.sdkinstall.mk:61: pre_install] Error 2
make: *** [/root/FC32-64_K5.6.0_GCC10.0.1/x86_64-native-linuxapp-gcc/343c35f2883f4c67b4f2fb9a78343eed/dpdk/mk/rte.sdkroot.mk:77: install] Error 2


*Makefile Build Failed #8:
OS: FC32-64
Target: x86_64-native-linuxapp-clang
  CC vmbus_bufring.o
  CC vmbus_common_uio.o
  CC mc/dpdmai.o
/root/FC32-64_K5.6.0_Clang10.0.0/x86_64-native-linuxapp-clang/343c35f2883f4c67b4f2fb9a78343eed/dpdk/drivers/bus/pci/linux/pci_vfio.c:186:1: error: redefinition of 'pci_vfio_enable_bus_memory'
pci_vfio_enable_bus_memory(int dev_fd)
^
/root/FC32-64_K5.6.0_Clang10.0.0/x86_64-native-linuxapp-clang/343c35f2883f4c67b4f2fb9a78343eed/dpdk/drivers/bus/pci/linux/pci_vfio.c:154:1: note: previous definition is here
--
  CC portal/dpaa2_hw_dpio.o
  CC portal/dpaa2_hw_dpbp.o
1 error generated.
make[6]: *** [/root/FC32-64_K5.6.0_Clang10.0.0/x86_64-native-linuxapp-clang/343c35f2883f4c67b4f2fb9a78343eed/dpdk/mk/internal/rte.compile-pre.mk:116: linux/pci_vfio.o] Error 1
make[6]: *** Waiting for unfinished jobs....
  CC portal/dpaa2_hw_dpci.o
  CC base/fman/fman_hw.o
make[5]: *** [/root/FC32-64_K5.6.0_Clang10.0.0/x86_64-native-linuxapp-clang/343c35f2883f4c67b4f2fb9a78343eed/dpdk/mk/rte.subdir.mk:35: pci] Error 2
make[5]: *** Waiting for unfinished jobs....
  CC base/fman/netcfg_layer.o
  CC fslmc_vfio.o
--
  INSTALL-LIB librte_bus_fslmc.a
  AR librte_bus_dpaa.a
  INSTALL-LIB librte_bus_dpaa.a
make[4]: *** [/root/FC32-64_K5.6.0_Clang10.0.0/x86_64-native-linuxapp-clang/343c35f2883f4c67b4f2fb9a78343eed/dpdk/mk/rte.subdir.mk:37: bus] Error 2
make[3]: *** [/root/FC32-64_K5.6.0_Clang10.0.0/x86_64-native-linuxapp-clang/343c35f2883f4c67b4f2fb9a78343eed/dpdk/mk/rte.sdkbuild.mk:51: drivers] Error 2
make[2]: *** [/root/FC32-64_K5.6.0_Clang10.0.0/x86_64-native-linuxapp-clang/343c35f2883f4c67b4f2fb9a78343eed/dpdk/mk/rte.sdkroot.mk:99: all] Error 2
make[1]: *** [/root/FC32-64_K5.6.0_Clang10.0.0/x86_64-native-linuxapp-clang/343c35f2883f4c67b4f2fb9a78343eed/dpdk/mk/rte.sdkinstall.mk:61: pre_install] Error 2
make: *** [/root/FC32-64_K5.6.0_Clang10.0.0/x86_64-native-linuxapp-clang/343c35f2883f4c67b4f2fb9a78343eed/dpdk/mk/rte.sdkroot.mk:77: install] Error 2


*Makefile Build Failed #9:
OS: RHEL82-64
Target: x86_64-native-linuxapp-gcc
  CC linux/pci_vfio.o
  AR librte_bus_vdev.a
  CC vmbus_common.o
/root/RHEL82-64_K4.18.0_GCC8.3.1/x86_64-native-linuxapp-gcc/343c35f2883f4c67b4f2fb9a78343eed/dpdk/drivers/bus/pci/linux/pci_vfio.c:186:1: error: redefinition of ‘pci_vfio_enable_bus_memory’
 pci_vfio_enable_bus_memory(int dev_fd)
 ^~~~~~~~~~~~~~~~~~~~~~~~~~
/root/RHEL82-64_K4.18.0_GCC8.3.1/x86_64-native-linuxapp-gcc/343c35f2883f4c67b4f2fb9a78343eed/dpdk/drivers/bus/pci/linux/pci_vfio.c:154:1: note: previous definition of ‘pci_vfio_enable_bus_memory’ was here
--
  INSTALL-LIB librte_bus_vdev.a
/root/RHEL82-64_K4.18.0_GCC8.3.1/x86_64-native-linuxapp-gcc/343c35f2883f4c67b4f2fb9a78343eed/dpdk/drivers/bus/pci/linux/pci_vfio.c:154:1: warning: ‘pci_vfio_enable_bus_memory’ defined but not used [-Wunused-function]
cc1: warning: unrecognized command line option ‘-Wno-address-of-packed-member’
make[6]: *** [/root/RHEL82-64_K4.18.0_GCC8.3.1/x86_64-native-linuxapp-gcc/343c35f2883f4c67b4f2fb9a78343eed/dpdk/mk/internal/rte.compile-pre.mk:114: linux/pci_vfio.o] Error 1
make[6]: *** Waiting for unfinished jobs....
  CC base/fman/fman_hw.o
  CC vmbus_channel.o
  CC vmbus_bufring.o
  CC vmbus_common_uio.o
make[5]: *** [/root/RHEL82-64_K4.18.0_GCC8.3.1/x86_64-native-linuxapp-gcc/343c35f2883f4c67b4f2fb9a78343eed/dpdk/mk/rte.subdir.mk:35: pci] Error 2
make[5]: *** Waiting for unfinished jobs....
  CC base/fman/netcfg_layer.o
  CC base/qbman/process.o
--
  INSTALL-LIB librte_bus_dpaa.a
  AR librte_bus_fslmc.a
  INSTALL-LIB librte_bus_fslmc.a
make[4]: *** [/root/RHEL82-64_K4.18.0_GCC8.3.1/x86_64-native-linuxapp-gcc/343c35f2883f4c67b4f2fb9a78343eed/dpdk/mk/rte.subdir.mk:37: bus] Error 2
make[3]: *** [/root/RHEL82-64_K4.18.0_GCC8.3.1/x86_64-native-linuxapp-gcc/343c35f2883f4c67b4f2fb9a78343eed/dpdk/mk/rte.sdkbuild.mk:51: drivers] Error 2
make[2]: *** [/root/RHEL82-64_K4.18.0_GCC8.3.1/x86_64-native-linuxapp-gcc/343c35f2883f4c67b4f2fb9a78343eed/dpdk/mk/rte.sdkroot.mk:99: all] Error 2
make[1]: *** [/root/RHEL82-64_K4.18.0_GCC8.3.1/x86_64-native-linuxapp-gcc/343c35f2883f4c67b4f2fb9a78343eed/dpdk/mk/rte.sdkinstall.mk:61: pre_install] Error 2
make: *** [/root/RHEL82-64_K4.18.0_GCC8.3.1/x86_64-native-linuxapp-gcc/343c35f2883f4c67b4f2fb9a78343eed/dpdk/mk/rte.sdkroot.mk:77: install] Error 2


*Makefile Build Failed #10:
OS: SUSE15-64
Target: x86_64-native-linuxapp-clang
  CC linux/pci_vfio.o
  CC mc/dpdmai.o
  CC base/qbman/bman.o
/root/SUSE15-64_K4.12.14_Clang5.0.1/x86_64-native-linuxapp-clang/343c35f2883f4c67b4f2fb9a78343eed/dpdk/drivers/bus/pci/linux/pci_vfio.c:186:1: error: redefinition of 'pci_vfio_enable_bus_memory'
pci_vfio_enable_bus_memory(int dev_fd)
^
/root/SUSE15-64_K4.12.14_Clang5.0.1/x86_64-native-linuxapp-clang/343c35f2883f4c67b4f2fb9a78343eed/dpdk/drivers/bus/pci/linux/pci_vfio.c:154:1: note: previous definition is here
pci_vfio_enable_bus_memory(int dev_fd)
^
1 error generated.
make[6]: *** [/root/SUSE15-64_K4.12.14_Clang5.0.1/x86_64-native-linuxapp-clang/343c35f2883f4c67b4f2fb9a78343eed/dpdk/mk/internal/rte.compile-pre.mk:114: linux/pci_vfio.o] Error 1
make[5]: *** [/root/SUSE15-64_K4.12.14_Clang5.0.1/x86_64-native-linuxapp-clang/343c35f2883f4c67b4f2fb9a78343eed/dpdk/mk/rte.subdir.mk:35: pci] Error 2
make[5]: *** Waiting for unfinished jobs....
  CC portal/dpaa2_hw_dpio.o
  CC portal/dpaa2_hw_dpbp.o
--
  INSTALL-LIB librte_bus_fslmc.a
  AR librte_bus_dpaa.a
  INSTALL-LIB librte_bus_dpaa.a
make[4]: *** [/root/SUSE15-64_K4.12.14_Clang5.0.1/x86_64-native-linuxapp-clang/343c35f2883f4c67b4f2fb9a78343eed/dpdk/mk/rte.subdir.mk:37: bus] Error 2
make[3]: *** [/root/SUSE15-64_K4.12.14_Clang5.0.1/x86_64-native-linuxapp-clang/343c35f2883f4c67b4f2fb9a78343eed/dpdk/mk/rte.sdkbuild.mk:51: drivers] Error 2
make[2]: *** [/root/SUSE15-64_K4.12.14_Clang5.0.1/x86_64-native-linuxapp-clang/343c35f2883f4c67b4f2fb9a78343eed/dpdk/mk/rte.sdkroot.mk:99: all] Error 2
make[1]: *** [/root/SUSE15-64_K4.12.14_Clang5.0.1/x86_64-native-linuxapp-clang/343c35f2883f4c67b4f2fb9a78343eed/dpdk/mk/rte.sdkinstall.mk:61: pre_install] Error 2
make: *** [/root/SUSE15-64_K4.12.14_Clang5.0.1/x86_64-native-linuxapp-clang/343c35f2883f4c67b4f2fb9a78343eed/dpdk/mk/rte.sdkroot.mk:77: install] Error 2


*Makefile Build Failed #11:
OS: SUSE15-64
Target: x86_64-native-linuxapp-gcc
  CC qbman/qbman_debug.o
  CC vdev.o
  CC dpaa_bus.o
/root/SUSE15-64_K4.12.14_GCC7.3.1/x86_64-native-linuxapp-gcc/343c35f2883f4c67b4f2fb9a78343eed/dpdk/drivers/bus/pci/linux/pci_vfio.c:186:1: error: redefinition of ‘pci_vfio_enable_bus_memory’
 pci_vfio_enable_bus_memory(int dev_fd)
 ^~~~~~~~~~~~~~~~~~~~~~~~~~
/root/SUSE15-64_K4.12.14_GCC7.3.1/x86_64-native-linuxapp-gcc/343c35f2883f4c67b4f2fb9a78343eed/dpdk/drivers/bus/pci/linux/pci_vfio.c:154:1: note: previous definition of ‘pci_vfio_enable_bus_memory’ was here
--
  SYMLINK-FILE include/rte_bus_ifpga.h
/root/SUSE15-64_K4.12.14_GCC7.3.1/x86_64-native-linuxapp-gcc/343c35f2883f4c67b4f2fb9a78343eed/dpdk/drivers/bus/pci/linux/pci_vfio.c:154:1: warning: ‘pci_vfio_enable_bus_memory’ defined but not used [-Wunused-function]
cc1: warning: unrecognized command line option ‘-Wno-address-of-packed-member’
make[6]: *** [/root/SUSE15-64_K4.12.14_GCC7.3.1/x86_64-native-linuxapp-gcc/343c35f2883f4c67b4f2fb9a78343eed/dpdk/mk/internal/rte.compile-pre.mk:114: linux/pci_vfio.o] Error 1
make[6]: *** Waiting for unfinished jobs....
  SYMLINK-FILE include/rte_bus_vmbus.h
  CC base/fman/fman.o
--
  CC linux/vmbus_uio.o
  CC ifpga_common.o
  CC vdev_params.o
make[5]: *** [/root/SUSE15-64_K4.12.14_GCC7.3.1/x86_64-native-linuxapp-gcc/343c35f2883f4c67b4f2fb9a78343eed/dpdk/mk/rte.subdir.mk:37: pci] Error 2
make[5]: *** Waiting for unfinished jobs....
  CC vmbus_common.o
  CC vmbus_channel.o
--
  INSTALL-LIB librte_bus_fslmc.a
  AR librte_bus_dpaa.a
  INSTALL-LIB librte_bus_dpaa.a
make[4]: *** [/root/SUSE15-64_K4.12.14_GCC7.3.1/x86_64-native-linuxapp-gcc/343c35f2883f4c67b4f2fb9a78343eed/dpdk/mk/rte.subdir.mk:37: bus] Error 2
make[3]: *** [/root/SUSE15-64_K4.12.14_GCC7.3.1/x86_64-native-linuxapp-gcc/343c35f2883f4c67b4f2fb9a78343eed/dpdk/mk/rte.sdkbuild.mk:51: drivers] Error 2
make[2]: *** [/root/SUSE15-64_K4.12.14_GCC7.3.1/x86_64-native-linuxapp-gcc/343c35f2883f4c67b4f2fb9a78343eed/dpdk/mk/rte.sdkroot.mk:99: all] Error 2
make[1]: *** [/root/SUSE15-64_K4.12.14_GCC7.3.1/x86_64-native-linuxapp-gcc/343c35f2883f4c67b4f2fb9a78343eed/dpdk/mk/rte.sdkinstall.mk:61: pre_install] Error 2
make: *** [/root/SUSE15-64_K4.12.14_GCC7.3.1/x86_64-native-linuxapp-gcc/343c35f2883f4c67b4f2fb9a78343eed/dpdk/mk/rte.sdkroot.mk:77: install] Error 2


*Makefile Build Failed #12:
OS: UB1804-64
Target: x86_64-native-linuxapp-gcc
  INSTALL-LIB librte_bus_ifpga.a
  CC linux/pci_vfio.o
  CC vmbus_channel.o
/root/UB1804-64_K4.15.0_GCC7.3.0/x86_64-native-linuxapp-gcc/343c35f2883f4c67b4f2fb9a78343eed/dpdk/drivers/bus/pci/linux/pci_vfio.c:186:1: error: redefinition of ‘pci_vfio_enable_bus_memory’
 pci_vfio_enable_bus_memory(int dev_fd)
 ^~~~~~~~~~~~~~~~~~~~~~~~~~
/root/UB1804-64_K4.15.0_GCC7.3.0/x86_64-native-linuxapp-gcc/343c35f2883f4c67b4f2fb9a78343eed/dpdk/drivers/bus/pci/linux/pci_vfio.c:154:1: note: previous definition of ‘pci_vfio_enable_bus_memory’ was here
--
 ^~~~~~~~~~~~~~~~~~~~~~~~~~
/root/UB1804-64_K4.15.0_GCC7.3.0/x86_64-native-linuxapp-gcc/343c35f2883f4c67b4f2fb9a78343eed/dpdk/drivers/bus/pci/linux/pci_vfio.c:154:1: warning: ‘pci_vfio_enable_bus_memory’ defined but not used [-Wunused-function]
cc1: warning: unrecognized command line option ‘-Wno-address-of-packed-member’
/root/UB1804-64_K4.15.0_GCC7.3.0/x86_64-native-linuxapp-gcc/343c35f2883f4c67b4f2fb9a78343eed/dpdk/mk/internal/rte.compile-pre.mk:114: recipe for target 'linux/pci_vfio.o' failed
make[6]: *** [linux/pci_vfio.o] Error 1
make[6]: *** Waiting for unfinished jobs....
  CC base/qbman/bman_driver.o
  CC qbman/qbman_debug.o
/root/UB1804-64_K4.15.0_GCC7.3.0/x86_64-native-linuxapp-gcc/343c35f2883f4c67b4f2fb9a78343eed/dpdk/mk/rte.subdir.mk:35: recipe for target 'pci' failed
make[5]: *** [pci] Error 2
make[5]: *** Waiting for unfinished jobs....
  CC mc/dpmng.o
  MODPOST 1 modules
--
  INSTALL-LIB librte_bus_dpaa.a
  AR librte_bus_fslmc.a
  INSTALL-LIB librte_bus_fslmc.a
/root/UB1804-64_K4.15.0_GCC7.3.0/x86_64-native-linuxapp-gcc/343c35f2883f4c67b4f2fb9a78343eed/dpdk/mk/rte.subdir.mk:35: recipe for target 'bus' failed
make[4]: *** [bus] Error 2
/root/UB1804-64_K4.15.0_GCC7.3.0/x86_64-native-linuxapp-gcc/343c35f2883f4c67b4f2fb9a78343eed/dpdk/mk/rte.sdkbuild.mk:51: recipe for target 'drivers' failed
make[3]: *** [drivers] Error 2
/root/UB1804-64_K4.15.0_GCC7.3.0/x86_64-native-linuxapp-gcc/343c35f2883f4c67b4f2fb9a78343eed/dpdk/mk/rte.sdkroot.mk:98: recipe for target 'all' failed
make[2]: *** [all] Error 2
/root/UB1804-64_K4.15.0_GCC7.3.0/x86_64-native-linuxapp-gcc/343c35f2883f4c67b4f2fb9a78343eed/dpdk/mk/rte.sdkinstall.mk:60: recipe for target 'pre_install' failed
make[1]: *** [pre_install] Error 2
/root/UB1804-64_K4.15.0_GCC7.3.0/x86_64-native-linuxapp-gcc/343c35f2883f4c67b4f2fb9a78343eed/dpdk/mk/rte.sdkroot.mk:77: recipe for target 'install' failed
make: *** [install] Error 2


*Makefile Build Failed #13:
OS: UB2004-32
Target: i686-native-linuxapp-gcc
  CC linux/pci_vfio.o
  CC mc/mc_sys.o
  CC vmbus_channel.o
/root/UB2004-32_K4.15.0_GCC9.3.0/i686-native-linuxapp-gcc/343c35f2883f4c67b4f2fb9a78343eed/dpdk/drivers/bus/pci/linux/pci_vfio.c:186:1: error: redefinition of ‘pci_vfio_enable_bus_memory’
  186 | pci_vfio_enable_bus_memory(int dev_fd)
      | ^~~~~~~~~~~~~~~~~~~~~~~~~~
/root/UB2004-32_K4.15.0_GCC9.3.0/i686-native-linuxapp-gcc/343c35f2883f4c67b4f2fb9a78343eed/dpdk/drivers/bus/pci/linux/pci_vfio.c:154:1: note: previous definition of ‘pci_vfio_enable_bus_memory’ was here
  154 | pci_vfio_enable_bus_memory(int dev_fd)
      | ^~~~~~~~~~~~~~~~~~~~~~~~~~
/root/UB2004-32_K4.15.0_GCC9.3.0/i686-native-linuxapp-gcc/343c35f2883f4c67b4f2fb9a78343eed/dpdk/drivers/bus/pci/linux/pci_vfio.c:154:1: warning: ‘pci_vfio_enable_bus_memory’ defined but not used [-Wunused-function]
make[6]: *** [/root/UB2004-32_K4.15.0_GCC9.3.0/i686-native-linuxapp-gcc/343c35f2883f4c67b4f2fb9a78343eed/dpdk/mk/internal/rte.compile-pre.mk:116: linux/pci_vfio.o] Error 1
make[6]: *** Waiting for unfinished jobs....
  CC mc/dpcon.o
  CC vmbus_bufring.o
  CC mc/dpci.o
  CC base/fman/fman.o
make[5]: *** [/root/UB2004-32_K4.15.0_GCC9.3.0/i686-native-linuxapp-gcc/343c35f2883f4c67b4f2fb9a78343eed/dpdk/mk/rte.subdir.mk:35: pci] Error 2
make[5]: *** Waiting for unfinished jobs....
  CC mc/dpdmai.o
  CC vmbus_common_uio.o
--
  INSTALL-LIB librte_bus_fslmc.a
  AR librte_bus_dpaa.a
  INSTALL-LIB librte_bus_dpaa.a
make[4]: *** [/root/UB2004-32_K4.15.0_GCC9.3.0/i686-native-linuxapp-gcc/343c35f2883f4c67b4f2fb9a78343eed/dpdk/mk/rte.subdir.mk:37: bus] Error 2
make[3]: *** [/root/UB2004-32_K4.15.0_GCC9.3.0/i686-native-linuxapp-gcc/343c35f2883f4c67b4f2fb9a78343eed/dpdk/mk/rte.sdkbuild.mk:53: drivers] Error 2
make[2]: *** [/root/UB2004-32_K4.15.0_GCC9.3.0/i686-native-linuxapp-gcc/343c35f2883f4c67b4f2fb9a78343eed/dpdk/mk/rte.sdkroot.mk:99: all] Error 2
make[1]: *** [/root/UB2004-32_K4.15.0_GCC9.3.0/i686-native-linuxapp-gcc/343c35f2883f4c67b4f2fb9a78343eed/dpdk/mk/rte.sdkinstall.mk:61: pre_install] Error 2
make: *** [/root/UB2004-32_K4.15.0_GCC9.3.0/i686-native-linuxapp-gcc/343c35f2883f4c67b4f2fb9a78343eed/dpdk/mk/rte.sdkroot.mk:77: install] Error 2


*Makefile Build Failed #14:
OS: UB2004-64
Target: x86_64-native-linuxapp-clang
  CC vmbus_common_uio.o
  CC linux/pci_vfio.o
  CC mc/mc_sys.o
/root/UB2004-64_K5.4.0_Clang10.0.0/x86_64-native-linuxapp-clang/343c35f2883f4c67b4f2fb9a78343eed/dpdk/drivers/bus/pci/linux/pci_vfio.c:186:1: error: redefinition of 'pci_vfio_enable_bus_memory'
pci_vfio_enable_bus_memory(int dev_fd)
^
/root/UB2004-64_K5.4.0_Clang10.0.0/x86_64-native-linuxapp-clang/343c35f2883f4c67b4f2fb9a78343eed/dpdk/drivers/bus/pci/linux/pci_vfio.c:154:1: note: previous definition is here
pci_vfio_enable_bus_memory(int dev_fd)
^
1 error generated.
make[6]: *** [/root/UB2004-64_K5.4.0_Clang10.0.0/x86_64-native-linuxapp-clang/343c35f2883f4c67b4f2fb9a78343eed/dpdk/mk/internal/rte.compile-pre.mk:114: linux/pci_vfio.o] Error 1
make[6]: *** Waiting for unfinished jobs....
  CC mc/dpcon.o
  CC mc/dpci.o
--
  AR librte_bus_vmbus.a
  INSTALL-LIB librte_bus_vmbus.a
  CC portal/dpaa2_hw_dpio.o
make[5]: *** [/root/UB2004-64_K5.4.0_Clang10.0.0/x86_64-native-linuxapp-clang/343c35f2883f4c67b4f2fb9a78343eed/dpdk/mk/rte.subdir.mk:35: pci] Error 2
make[5]: *** Waiting for unfinished jobs....
  CC portal/dpaa2_hw_dpbp.o
  CC portal/dpaa2_hw_dpci.o
--
  INSTALL-LIB librte_bus_fslmc.a
  AR librte_bus_dpaa.a
  INSTALL-LIB librte_bus_dpaa.a
make[4]: *** [/root/UB2004-64_K5.4.0_Clang10.0.0/x86_64-native-linuxapp-clang/343c35f2883f4c67b4f2fb9a78343eed/dpdk/mk/rte.subdir.mk:37: bus] Error 2
make[3]: *** [/root/UB2004-64_K5.4.0_Clang10.0.0/x86_64-native-linuxapp-clang/343c35f2883f4c67b4f2fb9a78343eed/dpdk/mk/rte.sdkbuild.mk:51: drivers] Error 2
make[2]: *** [/root/UB2004-64_K5.4.0_Clang10.0.0/x86_64-native-linuxapp-clang/343c35f2883f4c67b4f2fb9a78343eed/dpdk/mk/rte.sdkroot.mk:99: all] Error 2
make[1]: *** [/root/UB2004-64_K5.4.0_Clang10.0.0/x86_64-native-linuxapp-clang/343c35f2883f4c67b4f2fb9a78343eed/dpdk/mk/rte.sdkinstall.mk:61: pre_install] Error 2
make: *** [/root/UB2004-64_K5.4.0_Clang10.0.0/x86_64-native-linuxapp-clang/343c35f2883f4c67b4f2fb9a78343eed/dpdk/mk/rte.sdkroot.mk:77: install] Error 2


*Makefile Build Failed #15:
OS: UB2004-64
Target: x86_64-native-linuxapp-gcc
  CC vmbus_common.o
  CC vmbus_channel.o
  CC linux/pci_vfio.o
/root/UB2004-64_K5.4.0_GCC9.3.0/x86_64-native-linuxapp-gcc/343c35f2883f4c67b4f2fb9a78343eed/dpdk/drivers/bus/pci/linux/pci_vfio.c:186:1: error: redefinition of ‘pci_vfio_enable_bus_memory’
  186 | pci_vfio_enable_bus_memory(int dev_fd)
      | ^~~~~~~~~~~~~~~~~~~~~~~~~~
/root/UB2004-64_K5.4.0_GCC9.3.0/x86_64-native-linuxapp-gcc/343c35f2883f4c67b4f2fb9a78343eed/dpdk/drivers/bus/pci/linux/pci_vfio.c:154:1: note: previous definition of ‘pci_vfio_enable_bus_memory’ was here
  154 | pci_vfio_enable_bus_memory(int dev_fd)
      | ^~~~~~~~~~~~~~~~~~~~~~~~~~
/root/UB2004-64_K5.4.0_GCC9.3.0/x86_64-native-linuxapp-gcc/343c35f2883f4c67b4f2fb9a78343eed/dpdk/drivers/bus/pci/linux/pci_vfio.c:154:1: warning: ‘pci_vfio_enable_bus_memory’ defined but not used [-Wunused-function]
make[6]: *** [/root/UB2004-64_K5.4.0_GCC9.3.0/x86_64-native-linuxapp-gcc/343c35f2883f4c67b4f2fb9a78343eed/dpdk/mk/internal/rte.compile-pre.mk:116: linux/pci_vfio.o] Error 1
make[5]: *** [/root/UB2004-64_K5.4.0_GCC9.3.0/x86_64-native-linuxapp-gcc/343c35f2883f4c67b4f2fb9a78343eed/dpdk/mk/rte.subdir.mk:35: pci] Error 2
make[5]: *** Waiting for unfinished jobs....
  CC vmbus_bufring.o
  CC base/qbman/qman_driver.o
--
  INSTALL-LIB librte_bus_dpaa.a
  AR librte_bus_fslmc.a
  INSTALL-LIB librte_bus_fslmc.a
make[4]: *** [/root/UB2004-64_K5.4.0_GCC9.3.0/x86_64-native-linuxapp-gcc/343c35f2883f4c67b4f2fb9a78343eed/dpdk/mk/rte.subdir.mk:37: bus] Error 2
make[3]: *** [/root/UB2004-64_K5.4.0_GCC9.3.0/x86_64-native-linuxapp-gcc/343c35f2883f4c67b4f2fb9a78343eed/dpdk/mk/rte.sdkbuild.mk:51: drivers] Error 2
make[2]: *** [/root/UB2004-64_K5.4.0_GCC9.3.0/x86_64-native-linuxapp-gcc/343c35f2883f4c67b4f2fb9a78343eed/dpdk/mk/rte.sdkroot.mk:99: all] Error 2
make[1]: *** [/root/UB2004-64_K5.4.0_GCC9.3.0/x86_64-native-linuxapp-gcc/343c35f2883f4c67b4f2fb9a78343eed/dpdk/mk/rte.sdkinstall.mk:61: pre_install] Error 2
make: *** [/root/UB2004-64_K5.4.0_GCC9.3.0/x86_64-native-linuxapp-gcc/343c35f2883f4c67b4f2fb9a78343eed/dpdk/mk/rte.sdkroot.mk:77: install] Error 2


*Makefile Build Failed #16:
OS: UB2004-64
Target: x86_64-native-linuxapp-icc
  INSTALL-LIB librte_bus_ifpga.a
  CC base/qbman/dpaa_sys.o
  CC vmbus_channel.o
/root/UB2004-64_K5.4.0_ICC19.1.0/x86_64-native-linuxapp-icc/343c35f2883f4c67b4f2fb9a78343eed/dpdk/drivers/bus/pci/linux/pci_vfio.c(186): error: function "pci_vfio_enable_bus_memory" has already been defined
  pci_vfio_enable_bus_memory(int dev_fd)
  ^

compilation aborted for /root/UB2004-64_K5.4.0_ICC19.1.0/x86_64-native-linuxapp-icc/343c35f2883f4c67b4f2fb9a78343eed/dpdk/drivers/bus/pci/linux/pci_vfio.c (code 2)
make[6]: *** [/root/UB2004-64_K5.4.0_ICC19.1.0/x86_64-native-linuxapp-icc/343c35f2883f4c67b4f2fb9a78343eed/dpdk/mk/internal/rte.compile-pre.mk:116: linux/pci_vfio.o] Error 2
make[5]: *** [/root/UB2004-64_K5.4.0_ICC19.1.0/x86_64-native-linuxapp-icc/343c35f2883f4c67b4f2fb9a78343eed/dpdk/mk/rte.subdir.mk:35: pci] Error 2
make[5]: *** Waiting for unfinished jobs....
  CC vmbus_bufring.o
  CC vmbus_common_uio.o
--
  LD portal/dpaa2_hw_dpci.o
  AR librte_bus_fslmc.a
  INSTALL-LIB librte_bus_fslmc.a
make[4]: *** [/root/UB2004-64_K5.4.0_ICC19.1.0/x86_64-native-linuxapp-icc/343c35f2883f4c67b4f2fb9a78343eed/dpdk/mk/rte.subdir.mk:37: bus] Error 2
make[3]: *** [/root/UB2004-64_K5.4.0_ICC19.1.0/x86_64-native-linuxapp-icc/343c35f2883f4c67b4f2fb9a78343eed/dpdk/mk/rte.sdkbuild.mk:51: drivers] Error 2
make[2]: *** [/root/UB2004-64_K5.4.0_ICC19.1.0/x86_64-native-linuxapp-icc/343c35f2883f4c67b4f2fb9a78343eed/dpdk/mk/rte.sdkroot.mk:99: all] Error 2
make[1]: *** [/root/UB2004-64_K5.4.0_ICC19.1.0/x86_64-native-linuxapp-icc/343c35f2883f4c67b4f2fb9a78343eed/dpdk/mk/rte.sdkinstall.mk:61: pre_install] Error 2
make: *** [/root/UB2004-64_K5.4.0_ICC19.1.0/x86_64-native-linuxapp-icc/343c35f2883f4c67b4f2fb9a78343eed/dpdk/mk/rte.sdkroot.mk:77: install] Error 2
DPDK STV team

^ permalink raw reply	[flat|nested] 2+ messages in thread

* [dpdk-test-report] |FAILURE| pw(72163) [v4] bus/pci: fix VF bus error for memory access
@ 2020-06-26  0:41 sys_stv
  0 siblings, 0 replies; 2+ messages in thread
From: sys_stv @ 2020-06-26  0:41 UTC (permalink / raw)
  To: test-report

[-- Attachment #1: Type: text/plain, Size: 54870 bytes --]


Test-Label: Intel-compilation
Test-Status: FAILURE
http://dpdk.org/patch/72163

_Compilation issues_

Submitter: Wang, Haiyue <haiyue.wang@intel.com>
Date: 2020-06-25 03:50:46
Reply_mail: 20200625035046.19820-1-haiyue.wang@intel.com

DPDK git baseline: Repo:dpdk, CommitID: 6248368a9ae1eadf6b7fb05ab37497afdb714429


Meson build Summary: 8 Builds Done, 3 Successful, 5 Failures, 0 Blocked

Makefile build Summary: 20 Builds Done, 4 Successful, 16 Failures, 0 Blocked

                +==============================================+===========+==========+
                |                   Makefile                   |   Meson   | Document |
+----------------+------+-------+------+------------+-----------+-----------+----------+
| os             | gcc  | clang | icc  | gcc+shared | gcc+debug | gcc/clang | pdf/html |
+----------------+------+-------+------+------------+-----------+-----------+----------+
| CENTOS82-64    | FAIL | FAIL  | FAIL | FAIL       | FAIL      | FAIL      |          |
| RHEL82-64      | FAIL |       |      |            |           |           |          |
| UB1804-64      | FAIL |       |      |            |           |           |          |
| FC32-64        | FAIL | FAIL  |      |            |           | FAIL      |          |
| CENTOS77-64    | FAIL |       |      |            |           |           |          |
| UB2004-64      | FAIL | FAIL  | FAIL |            |           | FAIL      | pass     |
| WIN10-64       |      |       |      |            |           | pass      |          |
| UB2004-32      | FAIL |       |      |            |           |           |          |
| UB1804-32      |      |       |      |            |           | FAIL      |          |
| FreeBSD1201-64 | pass | pass  |      | pass       | pass      | pass      |          |
| SUSE15-64      | FAIL | FAIL  |      |            |           | FAIL      |          |
+----------------+------+-------+------+------------+-----------+-----------+----------+
Test environment and configuration as below:

** Makefile build **


OS: CENTOS82-64
	Kernel Version: 4.18.0-193.el8.x86_64
	CPU info: Intel(R) Xeon(R) Platinum 8280M CPU @ 2.70GHz
	GCC Version: gcc (GCC) 8.3.1 20191121 (Red Hat 8.3.1-5)
	Clang Version: 9.0.1 (Red Hat 9.0.1-2.module_el8.2.0+309+0c7b6b03)
	x86_64-native-linuxapp-gcc
	x86_64-native-linuxapp-clang
	x86_64-native-linuxapp-icc
	x86_64-native-linuxapp-gcc+shared
	x86_64-native-linuxapp-gcc+debug


OS: RHEL82-64
	Kernel Version: 4.18.0-193.el8.x86_64
	CPU info: Intel(R) Xeon(R) Platinum 8280M CPU @ 2.70GHz
	GCC Version: gcc (GCC) 8.3.1 20191121 (Red Hat 8.3.1-5)
	Clang Version: 8.0.1 (Red Hat 8.0.1-1.module_el8.1.0+215+a01033fb)
	x86_64-native-linuxapp-gcc


OS: UB1804-64
	Kernel Version: 4.15.0-29-generic
	CPU info: Intel(R) Xeon(R) Platinum 8180 CPU @ 2.50GHz
	GCC Version: gcc (Ubuntu 7.5.0-3ubuntu1~18.04) 7.5.0
	Clang Version: 6.0.0-1ubuntu2 (tags/RELEASE_600/final)
	x86_64-native-linuxapp-gcc


OS: FC32-64
	Kernel Version: 5.6.0-0.rc7.git0.2.fc32.x86_64
	CPU info: Intel(R) Xeon(R) Platinum 8280M CPU @ 2.70GHz
	GCC Version: gcc (GCC) 10.0.1 20200311 (Red Hat 10.0.1-0.9)
	Clang Version: 10.0.0 (Fedora 10.0.0-0.3.rc4.fc32)
	x86_64-native-linuxapp-gcc
	x86_64-native-linuxapp-clang


OS: CENTOS77-64
	Kernel Version: 3.10.0-1062.9.1.el7.x86_64
	CPU info: Intel(R) Xeon(R) Platinum 8280M CPU @ 2.70GHz
	GCC Version: gcc (GCC) 4.8.5 20150623 (Red Hat 4.8.5-39)
	Clang Version: 3.4.2 (tags/RELEASE_34/dot2-final)
	x86_64-native-linuxapp-gcc


OS: UB2004-64
	Kernel Version: 5.4.0-26-generic
	CPU info: Intel(R) Xeon(R) Platinum 8180 CPU @ 2.50GHz
	GCC Version: gcc (Ubuntu 10-20200416-0ubuntu1) 10.0.1 20200416 (experimental) [master revision 3c3f12e2a76:dcee354ce56:44b326839d864fc10c459916abcc97f35a9ac3de]
	Clang Version: 10.0.0-4ubuntu1
	x86_64-native-linuxapp-clang
	x86_64-native-linuxapp-gcc
	x86_64-native-linuxapp-icc


OS: UB2004-32
	Kernel Version: 5.4.0-26-generic
	CPU info: Intel(R) Xeon(R) Platinum 8180 CPU @ 2.50GHz
	GCC Version: gcc (Ubuntu 9.3.0-10ubuntu2) 9.3.0
	Clang Version: 10.0.0-4ubuntu1
	i686-native-linuxapp-gcc


OS: FreeBSD1201-64
	Kernel Version: 12.1-RELEASE
	CPU info: Intel(R) Xeon(R) CPU E5-2699 v3 @ 2.30GHz (2294.74-MHz K8-class CPU)
	GCC Version: gcc (FreeBSD Ports Collection) 9.2.0
	Clang Version: 8.0.1 (tags/RELEASE_801/final 366581) (based on LLVM 8.0.1)
	x86_64-native-bsdapp-gcc
	x86_64-native-bsdapp-clang
	x86_64-native-bsdapp-gcc+shared
	x86_64-native-bsdapp-gcc+debug


OS: SUSE15-64
	Kernel Version: 4.12.14-lp150.11-default
	CPU info: Intel(R) Xeon(R) CPU E5-2699 v4 @ 2.20GHz
	GCC Version: gcc (SUSE Linux) 7.3.1 20180323 [gcc-7-branch revision 258812]
	Clang Version: 5.0.1 (tags/RELEASE_501/final 312548)
	x86_64-native-linuxapp-clang
	x86_64-native-linuxapp-gcc

** Meson build **


OS: CENTOS82-64
	Kernel Version: 4.18.0-193.el8.x86_64
	CPU info: Intel(R) Xeon(R) CPU E5-2699 v4 @ 2.20GHz
	GCC Version: gcc (GCC) 8.3.1 20191121 (Red Hat 8.3.1-5)
	Clang Version: 9.0.1 (Red Hat 9.0.1-2.module_el8.2.0+309+0c7b6b03)
	./build-gcc-static
	./build-gcc-shared
	./build-clang-static
	./build-clang-shared
	./build-x86-default


OS: UB2004-64
	Kernel Version: 5.4.0-26-generic
	CPU info: Intel(R) Xeon(R) Platinum 8180 CPU @ 2.50GHz
	GCC Version: gcc (Ubuntu 9.3.0-10ubuntu2) 9.3.0
	Clang Version: 10.0.0-4ubuntu1
	x86_64-native-linuxapp-doc
	./build-gcc-static
	./build-gcc-shared
	./build-clang-static
	./build-clang-shared
	./build-x86-default


OS: FC32-64
	Kernel Version: 5.6.0-0.rc7.git0.2.fc32.x86_64
	CPU info: Intel(R) Xeon(R) CPU E5-2699 v4 @ 2.20GHz
	GCC Version: gcc (GCC) 10.0.1 20200311 (Red Hat 10.0.1-0.9)
	Clang Version: 10.0.0 (Fedora 10.0.0-0.3.rc4.fc32)
	./build-gcc-static
	./build-gcc-shared
	./build-clang-static
	./build-clang-shared
	./build-x86-default


OS: WIN10-64
	Kernel Version: N/A
	CPU info: N/A
	GCC Version: N/A
	Clang Version: Clang 8.0.0
	x86_64-windows-clang


OS: UB1804-32
	Kernel Version: 4.15.0-20-generic
	CPU info: Intel(R) Xeon(R) CPU E5-2699 v4 @ 2.20GHz
	GCC Version: gcc (Ubuntu 7.5.0-3ubuntu1~18.04) 7.5.0
	Clang Version: 6.0.0-1ubuntu2 (tags/RELEASE_600/final)
	./build-gcc-static
	./build-gcc-shared
	./build-clang-static
	./build-clang-shared
	./build-x86-default


OS: FreeBSD1201-64
	Kernel Version: 12.1-RELEASE
	CPU info: Intel(R) Xeon(R) CPU E5-2699 v4 @ 2.20GHz (2194.97-MHz K8-class CPU)
	GCC Version: gcc (FreeBSD Ports Collection) 9.2.0
	Clang Version: 8.0.1 (tags/RELEASE_801/final 366581) (based on LLVM 8.0.1)
	./build-gcc-static
	./build-gcc-shared
	./build-clang-static
	./build-clang-shared
	./build-x86-default


OS: SUSE15-64
	Kernel Version: 4.12.14-lp150.12.82-default
	CPU info: Intel(R) Xeon(R) CPU E5-2699 v4 @ 2.20GHz
	GCC Version: gcc (SUSE Linux) 7.4.1 20190905 [gcc-7-branch revision 275407]
	Clang Version: 5.0.1 (tags/RELEASE_501/final 312548)
	./build-gcc-static
	./build-gcc-shared
	./build-clang-static
	./build-clang-shared
	./build-x86-default



*Meson Build Failed #1:
OS: CENTOS82-64
Target:./build-gcc-static
FAILED: drivers/a715181@@tmp_rte_bus_pci@sta/bus_pci_linux_pci_vfio.c.o 
gcc -Idrivers/a715181@@tmp_rte_bus_pci@sta -Idrivers -I../drivers -Idrivers/bus/pci -I../drivers/bus/pci -I../drivers/bus/pci/linux -I. -I../ -Iconfig -I../config -Ilib/librte_eal/include -I../lib/librte_eal/include -Ilib/librte_eal/linux/include -I../lib/librte_eal/linux/include -Ilib/librte_eal/x86/include -I../lib/librte_eal/x86/include -Ilib/librte_eal/common -I../lib/librte_eal/common -Ilib/librte_eal -I../lib/librte_eal -Ilib/librte_kvargs -I../lib/librte_kvargs -Ilib/librte_telemetry/../librte_metrics -I../lib/librte_telemetry/../librte_metrics -Ilib/librte_telemetry -I../lib/librte_telemetry -Ilib/librte_pci -I../lib/librte_pci -fdiagnostics-color=always -pipe -D_FILE_OFFSET_BITS=64 -Wall -Winvalid-pch -Werror -O2 -g -include rte_config.h -Wextra -Wcast-qual -Wdeprecated -Wformat-nonliteral -Wformat-security -Wmissing-declarations -Wmissing-prototypes -Wnested-externs -Wold-style-definition -Wpointer-arith -Wsign-compare -Wstrict-prototypes -Wundef -Wwrite-strings -Wno-packed-not-aligned -Wno-missing-field-initializers -D_GNU_SOURCE -fPIC -march=native -mno-avx512f -DALLOW_EXPERIMENTAL_API -DALLOW_INTERNAL_API -Wno-format-truncation -MD -MQ 'drivers/a715181@@tmp_rte_bus_pci@sta/bus_pci_linux_pci_vfio.c.o' -MF 'drivers/a715181@@tmp_rte_bus_pci@sta/bus_pci_linux_pci_vfio.c.o.d' -o 'drivers/a715181@@tmp_rte_bus_pci@sta/bus_pci_linux_pci_vfio.c.o' -c ../drivers/bus/pci/linux/pci_vfio.c
../drivers/bus/pci/linux/pci_vfio.c:186:1: error: redefinition of ‘pci_vfio_enable_bus_memory’
 pci_vfio_enable_bus_memory(int dev_fd)
 ^~~~~~~~~~~~~~~~~~~~~~~~~~
../drivers/bus/pci/linux/pci_vfio.c:154:1: note: previous definition of ‘pci_vfio_enable_bus_memory’ was here
 pci_vfio_enable_bus_memory(int dev_fd)
 ^~~~~~~~~~~~~~~~~~~~~~~~~~
../drivers/bus/pci/linux/pci_vfio.c:154:1: error: ‘pci_vfio_enable_bus_memory’ defined but not used [-Werror=unused-function]
cc1: all warnings being treated as errors
[568/2199] Compiling C object 'drivers/a715181@@rte_bus_ifpga@sha/meson-generated_.._rte_bus_ifpga.pmd.c.o'.
[569/2199] Linking static target drivers/librte_bus_ifpga.a.
[570/2199] Compiling C object 'drivers/a715181@@tmp_rte_bus_fslmc@sta/bus_fslmc_portal_dpaa2_hw_dpio.c.o'.
[571/2199] Compiling C object 'drivers/a715181@@tmp_rte_bus_vdev@sta/bus_vdev_vdev_params.c.o'.
[572/2199] Compiling C object 'drivers/a715181@@tmp_rte_bus_pci@sta/bus_pci_pci_common.c.o'.
[573/2199] Compiling C object 'drivers/a715181@@tmp_rte_bus_pci@sta/bus_pci_linux_pci_uio.c.o'.
[574/2199] Compiling C object 'drivers/a715181@@tmp_rte_bus_fslmc@sta/bus_fslmc_qbman_qbman_portal.c.o'.
[575/2199] Generating rte_common_octeontx2.sym_chk with a meson_exe.py custom command.
[576/2199] Compiling C object 'drivers/a715181@@tmp_rte_bus_pci@sta/bus_pci_linux_pci.c.o'.
[577/2199] Compiling C object 'drivers/a715181@@tmp_rte_bus_dpaa@sta/bus_dpaa_base_qbman_qman.c.o'.
[578/2199] Compiling C object 'lib/76b5a35@@rte_pipeline@sta/librte_pipeline_rte_table_action.c.o'.
ninja: build stopped: subcommand failed




*Meson Build Failed #2:
OS: FC32-64
Target:./build-gcc-static
FAILED: drivers/a715181@@tmp_rte_bus_pci@sta/bus_pci_linux_pci_vfio.c.o 
gcc -Idrivers/a715181@@tmp_rte_bus_pci@sta -Idrivers -I../drivers -Idrivers/bus/pci -I../drivers/bus/pci -I../drivers/bus/pci/linux -I. -I../ -Iconfig -I../config -Ilib/librte_eal/include -I../lib/librte_eal/include -Ilib/librte_eal/linux/include -I../lib/librte_eal/linux/include -Ilib/librte_eal/x86/include -I../lib/librte_eal/x86/include -Ilib/librte_eal/common -I../lib/librte_eal/common -Ilib/librte_eal -I../lib/librte_eal -Ilib/librte_kvargs -I../lib/librte_kvargs -Ilib/librte_telemetry/../librte_metrics -I../lib/librte_telemetry/../librte_metrics -Ilib/librte_telemetry -I../lib/librte_telemetry -Ilib/librte_pci -I../lib/librte_pci -fdiagnostics-color=always -pipe -D_FILE_OFFSET_BITS=64 -Wall -Winvalid-pch -Werror -O2 -g -include rte_config.h -Wextra -Wcast-qual -Wdeprecated -Wformat-nonliteral -Wformat-security -Wmissing-declarations -Wmissing-prototypes -Wnested-externs -Wold-style-definition -Wpointer-arith -Wsign-compare -Wstrict-prototypes -Wundef -Wwrite-strings -Wno-address-of-packed-member -Wno-packed-not-aligned -Wno-missing-field-initializers -Wno-zero-length-bounds -D_GNU_SOURCE -fPIC -march=native -DALLOW_EXPERIMENTAL_API -DALLOW_INTERNAL_API -Wno-format-truncation -MD -MQ 'drivers/a715181@@tmp_rte_bus_pci@sta/bus_pci_linux_pci_vfio.c.o' -MF 'drivers/a715181@@tmp_rte_bus_pci@sta/bus_pci_linux_pci_vfio.c.o.d' -o 'drivers/a715181@@tmp_rte_bus_pci@sta/bus_pci_linux_pci_vfio.c.o' -c ../drivers/bus/pci/linux/pci_vfio.c
../drivers/bus/pci/linux/pci_vfio.c:186:1: error: redefinition of ‘pci_vfio_enable_bus_memory’
  186 | pci_vfio_enable_bus_memory(int dev_fd)
      | ^~~~~~~~~~~~~~~~~~~~~~~~~~
../drivers/bus/pci/linux/pci_vfio.c:154:1: note: previous definition of ‘pci_vfio_enable_bus_memory’ was here
  154 | pci_vfio_enable_bus_memory(int dev_fd)
      | ^~~~~~~~~~~~~~~~~~~~~~~~~~
../drivers/bus/pci/linux/pci_vfio.c:154:1: error: ‘pci_vfio_enable_bus_memory’ defined but not used [-Werror=unused-function]
cc1: all warnings being treated as errors
[570/2200] Compiling C object 'drivers/a715181@@tmp_rte_bus_pci@sta/bus_pci_pci_common.c.o'.
[571/2200] Compiling C object 'drivers/a715181@@rte_bus_ifpga@sha/meson-generated_.._rte_bus_ifpga.pmd.c.o'.
[572/2200] Compiling C object 'drivers/a715181@@tmp_rte_bus_fslmc@sta/bus_fslmc_qbman_qbman_portal.c.o'.
[573/2200] Compiling C object 'drivers/a715181@@tmp_rte_bus_pci@sta/bus_pci_linux_pci_uio.c.o'.
[574/2200] Generating rte_common_octeontx2.sym_chk with a meson_exe.py custom command.
[575/2200] Generating rte_bus_ifpga.sym_chk with a meson_exe.py custom command.
[576/2200] Compiling C object 'drivers/a715181@@tmp_rte_bus_pci@sta/bus_pci_linux_pci.c.o'.
[577/2200] Compiling C object 'drivers/a715181@@tmp_rte_bus_dpaa@sta/bus_dpaa_base_qbman_qman.c.o'.
[578/2200] Compiling C object 'lib/76b5a35@@rte_pipeline@sta/librte_pipeline_rte_table_action.c.o'.
ninja: build stopped: subcommand failed




*Meson Build Failed #3:
OS: SUSE15-64
Target:./build-gcc-static
FAILED: drivers/a715181@@tmp_rte_bus_pci@sta/bus_pci_linux_pci_vfio.c.o 
gcc -Idrivers/a715181@@tmp_rte_bus_pci@sta -Idrivers -I../drivers -Idrivers/bus/pci -I../drivers/bus/pci -I../drivers/bus/pci/linux -I. -I../ -Iconfig -I../config -Ilib/librte_eal/include -I../lib/librte_eal/include -Ilib/librte_eal/linux/include -I../lib/librte_eal/linux/include -Ilib/librte_eal/x86/include -I../lib/librte_eal/x86/include -Ilib/librte_eal/common -I../lib/librte_eal/common -Ilib/librte_eal -I../lib/librte_eal -Ilib/librte_kvargs -I../lib/librte_kvargs -Ilib/librte_telemetry/../librte_metrics -I../lib/librte_telemetry/../librte_metrics -Ilib/librte_telemetry -I../lib/librte_telemetry -Ilib/librte_pci -I../lib/librte_pci -fdiagnostics-color=always -pipe -D_FILE_OFFSET_BITS=64 -Wall -Winvalid-pch -Werror -O2 -g -include rte_config.h -Wextra -Wcast-qual -Wdeprecated -Wformat-nonliteral -Wformat-security -Wmissing-declarations -Wmissing-prototypes -Wnested-externs -Wold-style-definition -Wpointer-arith -Wsign-compare -Wstrict-prototypes -Wundef -Wwrite-strings -Wno-missing-field-initializers -D_GNU_SOURCE -fPIC -march=native -DALLOW_EXPERIMENTAL_API -DALLOW_INTERNAL_API -Wno-format-truncation -MD -MQ 'drivers/a715181@@tmp_rte_bus_pci@sta/bus_pci_linux_pci_vfio.c.o' -MF 'drivers/a715181@@tmp_rte_bus_pci@sta/bus_pci_linux_pci_vfio.c.o.d' -o 'drivers/a715181@@tmp_rte_bus_pci@sta/bus_pci_linux_pci_vfio.c.o' -c ../drivers/bus/pci/linux/pci_vfio.c
../drivers/bus/pci/linux/pci_vfio.c:186:1: error: redefinition of ‘pci_vfio_enable_bus_memory’
 pci_vfio_enable_bus_memory(int dev_fd)
 ^~~~~~~~~~~~~~~~~~~~~~~~~~
../drivers/bus/pci/linux/pci_vfio.c:154:1: note: previous definition of ‘pci_vfio_enable_bus_memory’ was here
 pci_vfio_enable_bus_memory(int dev_fd)
 ^~~~~~~~~~~~~~~~~~~~~~~~~~
../drivers/bus/pci/linux/pci_vfio.c:154:1: error: ‘pci_vfio_enable_bus_memory’ defined but not used [-Werror=unused-function]
cc1: all warnings being treated as errors
[570/2103] Linking static target drivers/libtmp_rte_bus_fslmc.a.
[571/2103] Compiling C object 'drivers/a715181@@rte_bus_ifpga@sta/meson-generated_.._rte_bus_ifpga.pmd.c.o'.
[572/2103] Generating rte_bus_vdev_def with a custom command.
[573/2103] Compiling C object 'drivers/a715181@@tmp_rte_bus_pci@sta/bus_pci_linux_pci_uio.c.o'.
[574/2103] Generating rte_common_octeontx2.sym_chk with a meson_exe.py custom command.
[575/2103] Compiling C object 'drivers/a715181@@tmp_rte_bus_vdev@sta/bus_vdev_vdev.c.o'.
[576/2103] Compiling C object 'drivers/a715181@@tmp_rte_bus_pci@sta/bus_pci_linux_pci.c.o'.
[577/2103] Compiling C object 'drivers/a715181@@tmp_rte_bus_dpaa@sta/bus_dpaa_base_qbman_qman.c.o'.
[578/2103] Compiling C object 'lib/76b5a35@@rte_pipeline@sta/librte_pipeline_rte_table_action.c.o'.
ninja: build stopped: subcommand failed




*Meson Build Failed #4:
OS: UB1804-32
Target:./build-gcc-static
FAILED: drivers/a715181@@tmp_rte_bus_pci@sta/bus_pci_linux_pci_vfio.c.o 
gcc -Idrivers/a715181@@tmp_rte_bus_pci@sta -Idrivers -I../drivers -Idrivers/bus/pci -I../drivers/bus/pci -I../drivers/bus/pci/linux -I. -I../ -Iconfig -I../config -Ilib/librte_eal/include -I../lib/librte_eal/include -Ilib/librte_eal/linux/include -I../lib/librte_eal/linux/include -Ilib/librte_eal/x86/include -I../lib/librte_eal/x86/include -Ilib/librte_eal/common -I../lib/librte_eal/common -Ilib/librte_eal -I../lib/librte_eal -Ilib/librte_kvargs -I../lib/librte_kvargs -Ilib/librte_telemetry/../librte_metrics -I../lib/librte_telemetry/../librte_metrics -Ilib/librte_telemetry -I../lib/librte_telemetry -Ilib/librte_pci -I../lib/librte_pci -fdiagnostics-color=always -pipe -D_FILE_OFFSET_BITS=64 -Wall -Winvalid-pch -Werror -O2 -g -include rte_config.h -Wextra -Wcast-qual -Wdeprecated -Wformat-nonliteral -Wformat-security -Wmissing-declarations -Wmissing-prototypes -Wnested-externs -Wold-style-definition -Wpointer-arith -Wsign-compare -Wstrict-prototypes -Wundef -Wwrite-strings -Wno-missing-field-initializers -Wno-pointer-to-int-cast -D_GNU_SOURCE -m32 -fPIC -march=native -DALLOW_EXPERIMENTAL_API -DALLOW_INTERNAL_API -Wno-format-truncation -MD -MQ 'drivers/a715181@@tmp_rte_bus_pci@sta/bus_pci_linux_pci_vfio.c.o' -MF 'drivers/a715181@@tmp_rte_bus_pci@sta/bus_pci_linux_pci_vfio.c.o.d' -o 'drivers/a715181@@tmp_rte_bus_pci@sta/bus_pci_linux_pci_vfio.c.o' -c ../drivers/bus/pci/linux/pci_vfio.c
../drivers/bus/pci/linux/pci_vfio.c:186:1: error: redefinition of ‘pci_vfio_enable_bus_memory’
 pci_vfio_enable_bus_memory(int dev_fd)
 ^~~~~~~~~~~~~~~~~~~~~~~~~~
../drivers/bus/pci/linux/pci_vfio.c:154:1: note: previous definition of ‘pci_vfio_enable_bus_memory’ was here
 pci_vfio_enable_bus_memory(int dev_fd)
 ^~~~~~~~~~~~~~~~~~~~~~~~~~
../drivers/bus/pci/linux/pci_vfio.c:154:1: error: ‘pci_vfio_enable_bus_memory’ defined but not used [-Werror=unused-function]
cc1: all warnings being treated as errors
[566/1955] Compiling C object 'drivers/a715181@@tmp_rte_bus_vdev@sta/bus_vdev_vdev_params.c.o'.
[567/1955] Generating rte_bus_vdev_def with a custom command.
[568/1955] Compiling C object 'drivers/a715181@@tmp_rte_bus_fslmc@sta/bus_fslmc_portal_dpaa2_hw_dpio.c.o'.
[569/1955] Compiling C object 'drivers/a715181@@tmp_rte_bus_pci@sta/bus_pci_linux_pci_uio.c.o'.
[570/1955] Generating rte_common_octeontx2.sym_chk with a meson_exe.py custom command.
[571/1955] Compiling C object 'drivers/a715181@@tmp_rte_bus_vdev@sta/bus_vdev_vdev.c.o'.
[572/1955] Generating rte_bus_ifpga.sym_chk with a meson_exe.py custom command.
[573/1955] Compiling C object 'drivers/a715181@@tmp_rte_bus_fslmc@sta/bus_fslmc_qbman_qbman_portal.c.o'.
[574/1955] Compiling C object 'drivers/a715181@@tmp_rte_bus_pci@sta/bus_pci_linux_pci.c.o'.
[575/1955] Compiling C object 'drivers/a715181@@tmp_rte_bus_dpaa@sta/bus_dpaa_base_qbman_qman.c.o'.
[576/1955] Compiling C object 'lib/76b5a35@@rte_pipeline@sta/librte_pipeline_rte_table_action.c.o'.
ninja: build stopped: subcommand failed




*Meson Build Failed #5:
OS: UB2004-64
Target:./build-gcc-static
FAILED: drivers/a715181@@tmp_rte_bus_pci@sta/bus_pci_linux_pci_vfio.c.o 
gcc -Idrivers/a715181@@tmp_rte_bus_pci@sta -Idrivers -I../drivers -Idrivers/bus/pci -I../drivers/bus/pci -I../drivers/bus/pci/linux -I. -I../ -Iconfig -I../config -Ilib/librte_eal/include -I../lib/librte_eal/include -Ilib/librte_eal/linux/include -I../lib/librte_eal/linux/include -Ilib/librte_eal/x86/include -I../lib/librte_eal/x86/include -Ilib/librte_eal/common -I../lib/librte_eal/common -Ilib/librte_eal -I../lib/librte_eal -Ilib/librte_kvargs -I../lib/librte_kvargs -Ilib/librte_telemetry/../librte_metrics -I../lib/librte_telemetry/../librte_metrics -Ilib/librte_telemetry -I../lib/librte_telemetry -Ilib/librte_pci -I../lib/librte_pci -fdiagnostics-color=always -pipe -D_FILE_OFFSET_BITS=64 -Wall -Winvalid-pch -Werror -O2 -g -include rte_config.h -Wextra -Wcast-qual -Wdeprecated -Wformat-nonliteral -Wformat-security -Wmissing-declarations -Wmissing-prototypes -Wnested-externs -Wold-style-definition -Wpointer-arith -Wsign-compare -Wstrict-prototypes -Wundef -Wwrite-strings -Wno-address-of-packed-member -Wno-packed-not-aligned -Wno-missing-field-initializers -D_GNU_SOURCE -fPIC -march=native -DALLOW_EXPERIMENTAL_API -DALLOW_INTERNAL_API -Wno-format-truncation -MD -MQ 'drivers/a715181@@tmp_rte_bus_pci@sta/bus_pci_linux_pci_vfio.c.o' -MF 'drivers/a715181@@tmp_rte_bus_pci@sta/bus_pci_linux_pci_vfio.c.o.d' -o 'drivers/a715181@@tmp_rte_bus_pci@sta/bus_pci_linux_pci_vfio.c.o' -c ../drivers/bus/pci/linux/pci_vfio.c
../drivers/bus/pci/linux/pci_vfio.c:186:1: error: redefinition of ‘pci_vfio_enable_bus_memory’
  186 | pci_vfio_enable_bus_memory(int dev_fd)
      | ^~~~~~~~~~~~~~~~~~~~~~~~~~
../drivers/bus/pci/linux/pci_vfio.c:154:1: note: previous definition of ‘pci_vfio_enable_bus_memory’ was here
  154 | pci_vfio_enable_bus_memory(int dev_fd)
      | ^~~~~~~~~~~~~~~~~~~~~~~~~~
../drivers/bus/pci/linux/pci_vfio.c:154:1: error: ‘pci_vfio_enable_bus_memory’ defined but not used [-Werror=unused-function]
cc1: all warnings being treated as errors
[572/2191] Compiling C object 'drivers/a715181@@tmp_rte_bus_pci@sta/bus_pci_linux_pci_uio.c.o'.
[573/2191] Generating rte_bus_vdev_def with a custom command.
[574/2191] Compiling C object 'drivers/a715181@@tmp_rte_bus_fslmc@sta/bus_fslmc_qbman_qbman_portal.c.o'.
[575/2191] Compiling C object 'drivers/a715181@@tmp_rte_bus_fslmc@sta/bus_fslmc_fslmc_vfio.c.o'.
[576/2191] Generating rte_common_octeontx2.sym_chk with a meson_exe.py custom command.
[577/2191] Compiling C object 'drivers/a715181@@tmp_rte_bus_vmbus@sta/bus_vmbus_vmbus_common.c.o'.
[578/2191] Generating rte_bus_ifpga.sym_chk with a meson_exe.py custom command.
[579/2191] Compiling C object 'drivers/a715181@@tmp_rte_bus_vdev@sta/bus_vdev_vdev.c.o'.
[580/2191] Compiling C object 'drivers/a715181@@tmp_rte_bus_pci@sta/bus_pci_linux_pci.c.o'.
[581/2191] Compiling C object 'drivers/a715181@@tmp_rte_bus_dpaa@sta/bus_dpaa_base_qbman_qman.c.o'.
[582/2191] Compiling C object 'lib/76b5a35@@rte_pipeline@sta/librte_pipeline_rte_table_action.c.o'.
ninja: build stopped: subcommand failed



*Makefile Build Failed #1:
OS: CENTOS77-64
Target: x86_64-native-linuxapp-gcc
  CC linux/pci_uio.o
  CC linux/pci_vfio.o
  CC portal/dpaa2_hw_dpio.o
/root/CENTOS77-64_K3.10.0_GCC4.8.5/x86_64-native-linuxapp-gcc/343c35f2883f4c67b4f2fb9a78343eed/dpdk/drivers/bus/pci/linux/pci_vfio.c:186:1: error: redefinition of ‘pci_vfio_enable_bus_memory’
 pci_vfio_enable_bus_memory(int dev_fd)
 ^
/root/CENTOS77-64_K3.10.0_GCC4.8.5/x86_64-native-linuxapp-gcc/343c35f2883f4c67b4f2fb9a78343eed/dpdk/drivers/bus/pci/linux/pci_vfio.c:154:1: note: previous definition of ‘pci_vfio_enable_bus_memory’ was here
--
 ^
/root/CENTOS77-64_K3.10.0_GCC4.8.5/x86_64-native-linuxapp-gcc/343c35f2883f4c67b4f2fb9a78343eed/dpdk/drivers/bus/pci/linux/pci_vfio.c:154:1: warning: ‘pci_vfio_enable_bus_memory’ defined but not used [-Wunused-function]
cc1: warning: unrecognized command line option "-Wno-address-of-packed-member" [enabled by default]
make[6]: *** [linux/pci_vfio.o] Error 1
make[5]: *** [pci] Error 2
make[5]: *** Waiting for unfinished jobs....
  CC portal/dpaa2_hw_dpbp.o
  PMDINFO portal/dpaa2_hw_dpbp.o.pmd.c
--
  INSTALL-LIB librte_bus_dpaa.a
  AR librte_bus_fslmc.a
  INSTALL-LIB librte_bus_fslmc.a
make[4]: *** [bus] Error 2
make[3]: *** [drivers] Error 2
make[2]: *** [all] Error 2
make[1]: *** [pre_install] Error 2
make: *** [install] Error 2


*Makefile Build Failed #2:
OS: CENTOS82-64
Target: x86_64-native-linuxapp-gcc
  CC linux/pci_vfio.o
  CC base/fman/fman_hw.o
  CC mc/dpmng.o
/root/CENTOS82-64_K4.18.0_GCC8.3.1/x86_64-native-linuxapp-gcc/343c35f2883f4c67b4f2fb9a78343eed/dpdk/drivers/bus/pci/linux/pci_vfio.c:186:1: error: redefinition of ‘pci_vfio_enable_bus_memory’
 pci_vfio_enable_bus_memory(int dev_fd)
 ^~~~~~~~~~~~~~~~~~~~~~~~~~
/root/CENTOS82-64_K4.18.0_GCC8.3.1/x86_64-native-linuxapp-gcc/343c35f2883f4c67b4f2fb9a78343eed/dpdk/drivers/bus/pci/linux/pci_vfio.c:154:1: note: previous definition of ‘pci_vfio_enable_bus_memory’ was here
--
 ^~~~~~~~~~~~~~~~~~~~~~~~~~
/root/CENTOS82-64_K4.18.0_GCC8.3.1/x86_64-native-linuxapp-gcc/343c35f2883f4c67b4f2fb9a78343eed/dpdk/drivers/bus/pci/linux/pci_vfio.c:154:1: warning: ‘pci_vfio_enable_bus_memory’ defined but not used [-Wunused-function]
cc1: warning: unrecognized command line option ‘-Wno-address-of-packed-member’
make[6]: *** [/root/CENTOS82-64_K4.18.0_GCC8.3.1/x86_64-native-linuxapp-gcc/343c35f2883f4c67b4f2fb9a78343eed/dpdk/mk/internal/rte.compile-pre.mk:116: linux/pci_vfio.o] Error 1
make[5]: *** [/root/CENTOS82-64_K4.18.0_GCC8.3.1/x86_64-native-linuxapp-gcc/343c35f2883f4c67b4f2fb9a78343eed/dpdk/mk/rte.subdir.mk:37: pci] Error 2
make[5]: *** Waiting for unfinished jobs....
  CC mc/dpbp.o
  CC mc/dpio.o
--
  CC base/qbman/dpaa_sys.o
  AR librte_bus_dpaa.a
  INSTALL-LIB librte_bus_dpaa.a
make[4]: *** [/root/CENTOS82-64_K4.18.0_GCC8.3.1/x86_64-native-linuxapp-gcc/343c35f2883f4c67b4f2fb9a78343eed/dpdk/mk/rte.subdir.mk:37: bus] Error 2
make[3]: *** [/root/CENTOS82-64_K4.18.0_GCC8.3.1/x86_64-native-linuxapp-gcc/343c35f2883f4c67b4f2fb9a78343eed/dpdk/mk/rte.sdkbuild.mk:51: drivers] Error 2
make[2]: *** [/root/CENTOS82-64_K4.18.0_GCC8.3.1/x86_64-native-linuxapp-gcc/343c35f2883f4c67b4f2fb9a78343eed/dpdk/mk/rte.sdkroot.mk:99: all] Error 2
make[1]: *** [/root/CENTOS82-64_K4.18.0_GCC8.3.1/x86_64-native-linuxapp-gcc/343c35f2883f4c67b4f2fb9a78343eed/dpdk/mk/rte.sdkinstall.mk:61: pre_install] Error 2
make: *** [/root/CENTOS82-64_K4.18.0_GCC8.3.1/x86_64-native-linuxapp-gcc/343c35f2883f4c67b4f2fb9a78343eed/dpdk/mk/rte.sdkroot.mk:77: install] Error 2


*Makefile Build Failed #3:
OS: CENTOS82-64
Target: x86_64-native-linuxapp-clang
  CC mc/dpbp.o
  CC linux/pci_vfio.o
  CC base/fman/fman_hw.o
/root/CENTOS82-64_K4.18.0_Clang7.0.1/x86_64-native-linuxapp-clang/343c35f2883f4c67b4f2fb9a78343eed/dpdk/drivers/bus/pci/linux/pci_vfio.c:186:1: error: redefinition of 'pci_vfio_enable_bus_memory'
pci_vfio_enable_bus_memory(int dev_fd)
^
/root/CENTOS82-64_K4.18.0_Clang7.0.1/x86_64-native-linuxapp-clang/343c35f2883f4c67b4f2fb9a78343eed/dpdk/drivers/bus/pci/linux/pci_vfio.c:154:1: note: previous definition is here
pci_vfio_enable_bus_memory(int dev_fd)
^
1 error generated.
make[6]: *** [/root/CENTOS82-64_K4.18.0_Clang7.0.1/x86_64-native-linuxapp-clang/343c35f2883f4c67b4f2fb9a78343eed/dpdk/mk/internal/rte.compile-pre.mk:116: linux/pci_vfio.o] Error 1
make[5]: *** [/root/CENTOS82-64_K4.18.0_Clang7.0.1/x86_64-native-linuxapp-clang/343c35f2883f4c67b4f2fb9a78343eed/dpdk/mk/rte.subdir.mk:37: pci] Error 2
make[5]: *** Waiting for unfinished jobs....
  CC base/fman/netcfg_layer.o
  CC mc/dpio.o
--
  CC fslmc_bus.o
  AR librte_bus_fslmc.a
  INSTALL-LIB librte_bus_fslmc.a
make[4]: *** [/root/CENTOS82-64_K4.18.0_Clang7.0.1/x86_64-native-linuxapp-clang/343c35f2883f4c67b4f2fb9a78343eed/dpdk/mk/rte.subdir.mk:37: bus] Error 2
make[3]: *** [/root/CENTOS82-64_K4.18.0_Clang7.0.1/x86_64-native-linuxapp-clang/343c35f2883f4c67b4f2fb9a78343eed/dpdk/mk/rte.sdkbuild.mk:51: drivers] Error 2
make[2]: *** [/root/CENTOS82-64_K4.18.0_Clang7.0.1/x86_64-native-linuxapp-clang/343c35f2883f4c67b4f2fb9a78343eed/dpdk/mk/rte.sdkroot.mk:99: all] Error 2
make[1]: *** [/root/CENTOS82-64_K4.18.0_Clang7.0.1/x86_64-native-linuxapp-clang/343c35f2883f4c67b4f2fb9a78343eed/dpdk/mk/rte.sdkinstall.mk:61: pre_install] Error 2
make: *** [/root/CENTOS82-64_K4.18.0_Clang7.0.1/x86_64-native-linuxapp-clang/343c35f2883f4c67b4f2fb9a78343eed/dpdk/mk/rte.sdkroot.mk:77: install] Error 2


*Makefile Build Failed #4:
OS: CENTOS82-64
Target: x86_64-native-linuxapp-icc
  CC base/fman/netcfg_layer.o
  CC linux/pci_vfio.o
  CC mc/dpbp.o
/root/CENTOS82-64_K4.18.0_ICC19.1.1/x86_64-native-linuxapp-icc/343c35f2883f4c67b4f2fb9a78343eed/dpdk/drivers/bus/pci/linux/pci_vfio.c(186): error: function "pci_vfio_enable_bus_memory" has already been defined
  pci_vfio_enable_bus_memory(int dev_fd)
  ^

compilation aborted for /root/CENTOS82-64_K4.18.0_ICC19.1.1/x86_64-native-linuxapp-icc/343c35f2883f4c67b4f2fb9a78343eed/dpdk/drivers/bus/pci/linux/pci_vfio.c (code 2)
make[6]: *** [/root/CENTOS82-64_K4.18.0_ICC19.1.1/x86_64-native-linuxapp-icc/343c35f2883f4c67b4f2fb9a78343eed/dpdk/mk/internal/rte.compile-pre.mk:116: linux/pci_vfio.o] Error 2
make[5]: *** [/root/CENTOS82-64_K4.18.0_ICC19.1.1/x86_64-native-linuxapp-icc/343c35f2883f4c67b4f2fb9a78343eed/dpdk/mk/rte.subdir.mk:37: pci] Error 2
make[5]: *** Waiting for unfinished jobs....
  CC mc/dpio.o
  CC base/qbman/process.o
--
  INSTALL-LIB librte_bus_fslmc.a
  AR librte_bus_dpaa.a
  INSTALL-LIB librte_bus_dpaa.a
make[4]: *** [/root/CENTOS82-64_K4.18.0_ICC19.1.1/x86_64-native-linuxapp-icc/343c35f2883f4c67b4f2fb9a78343eed/dpdk/mk/rte.subdir.mk:37: bus] Error 2
make[3]: *** [/root/CENTOS82-64_K4.18.0_ICC19.1.1/x86_64-native-linuxapp-icc/343c35f2883f4c67b4f2fb9a78343eed/dpdk/mk/rte.sdkbuild.mk:51: drivers] Error 2
make[2]: *** [/root/CENTOS82-64_K4.18.0_ICC19.1.1/x86_64-native-linuxapp-icc/343c35f2883f4c67b4f2fb9a78343eed/dpdk/mk/rte.sdkroot.mk:99: all] Error 2
make[1]: *** [/root/CENTOS82-64_K4.18.0_ICC19.1.1/x86_64-native-linuxapp-icc/343c35f2883f4c67b4f2fb9a78343eed/dpdk/mk/rte.sdkinstall.mk:61: pre_install] Error 2
make: *** [/root/CENTOS82-64_K4.18.0_ICC19.1.1/x86_64-native-linuxapp-icc/343c35f2883f4c67b4f2fb9a78343eed/dpdk/mk/rte.sdkroot.mk:77: install] Error 2


*Makefile Build Failed #5:
OS: CENTOS82-64
Target: x86_64-native-linuxapp-gcc+shared
  CC base/fman/fman_hw.o
  CC mc/dpmng.o
  CC linux/pci_vfio.o
/root/CENTOS82-64_K4.18.0_GCC8.3.1/x86_64-native-linuxapp-gcc+shared/343c35f2883f4c67b4f2fb9a78343eed/dpdk/drivers/bus/pci/linux/pci_vfio.c:186:1: error: redefinition of ‘pci_vfio_enable_bus_memory’
 pci_vfio_enable_bus_memory(int dev_fd)
 ^~~~~~~~~~~~~~~~~~~~~~~~~~
/root/CENTOS82-64_K4.18.0_GCC8.3.1/x86_64-native-linuxapp-gcc+shared/343c35f2883f4c67b4f2fb9a78343eed/dpdk/drivers/bus/pci/linux/pci_vfio.c:154:1: note: previous definition of ‘pci_vfio_enable_bus_memory’ was here
--
 ^~~~~~~~~~~~~~~~~~~~~~~~~~
/root/CENTOS82-64_K4.18.0_GCC8.3.1/x86_64-native-linuxapp-gcc+shared/343c35f2883f4c67b4f2fb9a78343eed/dpdk/drivers/bus/pci/linux/pci_vfio.c:154:1: warning: ‘pci_vfio_enable_bus_memory’ defined but not used [-Wunused-function]
cc1: warning: unrecognized command line option ‘-Wno-address-of-packed-member’
make[6]: *** [/root/CENTOS82-64_K4.18.0_GCC8.3.1/x86_64-native-linuxapp-gcc+shared/343c35f2883f4c67b4f2fb9a78343eed/dpdk/mk/internal/rte.compile-pre.mk:116: linux/pci_vfio.o] Error 1
make[5]: *** [/root/CENTOS82-64_K4.18.0_GCC8.3.1/x86_64-native-linuxapp-gcc+shared/343c35f2883f4c67b4f2fb9a78343eed/dpdk/mk/rte.subdir.mk:37: pci] Error 2
make[5]: *** Waiting for unfinished jobs....
  CC mc/dpbp.o
  CC mc/dpio.o
--
  CC base/qbman/dpaa_sys.o
  LD librte_bus_dpaa.so.20.0.3
  INSTALL-LIB librte_bus_dpaa.so.20.0.3
make[4]: *** [/root/CENTOS82-64_K4.18.0_GCC8.3.1/x86_64-native-linuxapp-gcc+shared/343c35f2883f4c67b4f2fb9a78343eed/dpdk/mk/rte.subdir.mk:37: bus] Error 2
make[3]: *** [/root/CENTOS82-64_K4.18.0_GCC8.3.1/x86_64-native-linuxapp-gcc+shared/343c35f2883f4c67b4f2fb9a78343eed/dpdk/mk/rte.sdkbuild.mk:51: drivers] Error 2
make[2]: *** [/root/CENTOS82-64_K4.18.0_GCC8.3.1/x86_64-native-linuxapp-gcc+shared/343c35f2883f4c67b4f2fb9a78343eed/dpdk/mk/rte.sdkroot.mk:99: all] Error 2
make[1]: *** [/root/CENTOS82-64_K4.18.0_GCC8.3.1/x86_64-native-linuxapp-gcc+shared/343c35f2883f4c67b4f2fb9a78343eed/dpdk/mk/rte.sdkinstall.mk:61: pre_install] Error 2
make: *** [/root/CENTOS82-64_K4.18.0_GCC8.3.1/x86_64-native-linuxapp-gcc+shared/343c35f2883f4c67b4f2fb9a78343eed/dpdk/mk/rte.sdkroot.mk:77: install] Error 2


*Makefile Build Failed #6:
OS: CENTOS82-64
Target: x86_64-native-linuxapp-gcc+debug
  CC base/fman/fman_hw.o
  CC linux/pci_vfio.o
  CC mc/dpmng.o
/root/CENTOS82-64_K4.18.0_GCC8.3.1/x86_64-native-linuxapp-gcc+debug/343c35f2883f4c67b4f2fb9a78343eed/dpdk/drivers/bus/pci/linux/pci_vfio.c:186:1: error: redefinition of ‘pci_vfio_enable_bus_memory’
 pci_vfio_enable_bus_memory(int dev_fd)
 ^~~~~~~~~~~~~~~~~~~~~~~~~~
/root/CENTOS82-64_K4.18.0_GCC8.3.1/x86_64-native-linuxapp-gcc+debug/343c35f2883f4c67b4f2fb9a78343eed/dpdk/drivers/bus/pci/linux/pci_vfio.c:154:1: note: previous definition of ‘pci_vfio_enable_bus_memory’ was here
--
 ^~~~~~~~~~~~~~~~~~~~~~~~~~
/root/CENTOS82-64_K4.18.0_GCC8.3.1/x86_64-native-linuxapp-gcc+debug/343c35f2883f4c67b4f2fb9a78343eed/dpdk/drivers/bus/pci/linux/pci_vfio.c:154:1: warning: ‘pci_vfio_enable_bus_memory’ defined but not used [-Wunused-function]
cc1: warning: unrecognized command line option ‘-Wno-address-of-packed-member’
make[6]: *** [/root/CENTOS82-64_K4.18.0_GCC8.3.1/x86_64-native-linuxapp-gcc+debug/343c35f2883f4c67b4f2fb9a78343eed/dpdk/mk/internal/rte.compile-pre.mk:116: linux/pci_vfio.o] Error 1
make[5]: *** [/root/CENTOS82-64_K4.18.0_GCC8.3.1/x86_64-native-linuxapp-gcc+debug/343c35f2883f4c67b4f2fb9a78343eed/dpdk/mk/rte.subdir.mk:37: pci] Error 2
make[5]: *** Waiting for unfinished jobs....
  CC base/fman/netcfg_layer.o
  CC mc/dpbp.o
--
  CC base/qbman/dpaa_sys.o
  AR librte_bus_dpaa.a
  INSTALL-LIB librte_bus_dpaa.a
make[4]: *** [/root/CENTOS82-64_K4.18.0_GCC8.3.1/x86_64-native-linuxapp-gcc+debug/343c35f2883f4c67b4f2fb9a78343eed/dpdk/mk/rte.subdir.mk:37: bus] Error 2
make[3]: *** [/root/CENTOS82-64_K4.18.0_GCC8.3.1/x86_64-native-linuxapp-gcc+debug/343c35f2883f4c67b4f2fb9a78343eed/dpdk/mk/rte.sdkbuild.mk:51: drivers] Error 2
make[2]: *** [/root/CENTOS82-64_K4.18.0_GCC8.3.1/x86_64-native-linuxapp-gcc+debug/343c35f2883f4c67b4f2fb9a78343eed/dpdk/mk/rte.sdkroot.mk:99: all] Error 2
make[1]: *** [/root/CENTOS82-64_K4.18.0_GCC8.3.1/x86_64-native-linuxapp-gcc+debug/343c35f2883f4c67b4f2fb9a78343eed/dpdk/mk/rte.sdkinstall.mk:61: pre_install] Error 2
make: *** [/root/CENTOS82-64_K4.18.0_GCC8.3.1/x86_64-native-linuxapp-gcc+debug/343c35f2883f4c67b4f2fb9a78343eed/dpdk/mk/rte.sdkroot.mk:77: install] Error 2


*Makefile Build Failed #7:
OS: FC32-64
Target: x86_64-native-linuxapp-gcc
  CC base/fman/fman_hw.o
  CC mc/dpmng.o
  CC linux/pci_vfio.o
/root/FC32-64_K5.6.0_GCC10.0.1/x86_64-native-linuxapp-gcc/343c35f2883f4c67b4f2fb9a78343eed/dpdk/drivers/bus/pci/linux/pci_vfio.c:186:1: error: redefinition of ‘pci_vfio_enable_bus_memory’
  186 | pci_vfio_enable_bus_memory(int dev_fd)
      | ^~~~~~~~~~~~~~~~~~~~~~~~~~
/root/FC32-64_K5.6.0_GCC10.0.1/x86_64-native-linuxapp-gcc/343c35f2883f4c67b4f2fb9a78343eed/dpdk/drivers/bus/pci/linux/pci_vfio.c:154:1: note: previous definition of ‘pci_vfio_enable_bus_memory’ was here
  154 | pci_vfio_enable_bus_memory(int dev_fd)
      | ^~~~~~~~~~~~~~~~~~~~~~~~~~
/root/FC32-64_K5.6.0_GCC10.0.1/x86_64-native-linuxapp-gcc/343c35f2883f4c67b4f2fb9a78343eed/dpdk/drivers/bus/pci/linux/pci_vfio.c:154:1: warning: ‘pci_vfio_enable_bus_memory’ defined but not used [-Wunused-function]
make[6]: *** [/root/FC32-64_K5.6.0_GCC10.0.1/x86_64-native-linuxapp-gcc/343c35f2883f4c67b4f2fb9a78343eed/dpdk/mk/internal/rte.compile-pre.mk:116: linux/pci_vfio.o] Error 1
make[5]: *** [/root/FC32-64_K5.6.0_GCC10.0.1/x86_64-native-linuxapp-gcc/343c35f2883f4c67b4f2fb9a78343eed/dpdk/mk/rte.subdir.mk:37: pci] Error 2
make[5]: *** Waiting for unfinished jobs....
  CC base/fman/netcfg_layer.o
  CC mc/dpbp.o
--
  INSTALL-LIB librte_bus_dpaa.a
  AR librte_bus_fslmc.a
  INSTALL-LIB librte_bus_fslmc.a
make[4]: *** [/root/FC32-64_K5.6.0_GCC10.0.1/x86_64-native-linuxapp-gcc/343c35f2883f4c67b4f2fb9a78343eed/dpdk/mk/rte.subdir.mk:37: bus] Error 2
make[3]: *** [/root/FC32-64_K5.6.0_GCC10.0.1/x86_64-native-linuxapp-gcc/343c35f2883f4c67b4f2fb9a78343eed/dpdk/mk/rte.sdkbuild.mk:51: drivers] Error 2
make[2]: *** [/root/FC32-64_K5.6.0_GCC10.0.1/x86_64-native-linuxapp-gcc/343c35f2883f4c67b4f2fb9a78343eed/dpdk/mk/rte.sdkroot.mk:99: all] Error 2
make[1]: *** [/root/FC32-64_K5.6.0_GCC10.0.1/x86_64-native-linuxapp-gcc/343c35f2883f4c67b4f2fb9a78343eed/dpdk/mk/rte.sdkinstall.mk:61: pre_install] Error 2
make: *** [/root/FC32-64_K5.6.0_GCC10.0.1/x86_64-native-linuxapp-gcc/343c35f2883f4c67b4f2fb9a78343eed/dpdk/mk/rte.sdkroot.mk:77: install] Error 2


*Makefile Build Failed #8:
OS: FC32-64
Target: x86_64-native-linuxapp-clang
  CC linux/pci_uio.o
  CC mc/dpmng.o
  CC linux/pci_vfio.o
/root/FC32-64_K5.6.0_Clang10.0.0/x86_64-native-linuxapp-clang/343c35f2883f4c67b4f2fb9a78343eed/dpdk/drivers/bus/pci/linux/pci_vfio.c:186:1: error: redefinition of 'pci_vfio_enable_bus_memory'
pci_vfio_enable_bus_memory(int dev_fd)
^
/root/FC32-64_K5.6.0_Clang10.0.0/x86_64-native-linuxapp-clang/343c35f2883f4c67b4f2fb9a78343eed/dpdk/drivers/bus/pci/linux/pci_vfio.c:154:1: note: previous definition is here
pci_vfio_enable_bus_memory(int dev_fd)
^
1 error generated.
make[6]: *** [/root/FC32-64_K5.6.0_Clang10.0.0/x86_64-native-linuxapp-clang/343c35f2883f4c67b4f2fb9a78343eed/dpdk/mk/internal/rte.compile-pre.mk:116: linux/pci_vfio.o] Error 1
make[5]: *** [/root/FC32-64_K5.6.0_Clang10.0.0/x86_64-native-linuxapp-clang/343c35f2883f4c67b4f2fb9a78343eed/dpdk/mk/rte.subdir.mk:37: pci] Error 2
make[5]: *** Waiting for unfinished jobs....
  CC base/fman/fman_hw.o
  CC mc/dpbp.o
--
  CC fslmc_bus.o
  AR librte_bus_fslmc.a
  INSTALL-LIB librte_bus_fslmc.a
make[4]: *** [/root/FC32-64_K5.6.0_Clang10.0.0/x86_64-native-linuxapp-clang/343c35f2883f4c67b4f2fb9a78343eed/dpdk/mk/rte.subdir.mk:37: bus] Error 2
make[3]: *** [/root/FC32-64_K5.6.0_Clang10.0.0/x86_64-native-linuxapp-clang/343c35f2883f4c67b4f2fb9a78343eed/dpdk/mk/rte.sdkbuild.mk:51: drivers] Error 2
make[2]: *** [/root/FC32-64_K5.6.0_Clang10.0.0/x86_64-native-linuxapp-clang/343c35f2883f4c67b4f2fb9a78343eed/dpdk/mk/rte.sdkroot.mk:99: all] Error 2
make[1]: *** [/root/FC32-64_K5.6.0_Clang10.0.0/x86_64-native-linuxapp-clang/343c35f2883f4c67b4f2fb9a78343eed/dpdk/mk/rte.sdkinstall.mk:61: pre_install] Error 2
make: *** [/root/FC32-64_K5.6.0_Clang10.0.0/x86_64-native-linuxapp-clang/343c35f2883f4c67b4f2fb9a78343eed/dpdk/mk/rte.sdkroot.mk:77: install] Error 2


*Makefile Build Failed #9:
OS: RHEL82-64
Target: x86_64-native-linuxapp-gcc
  CC mc/dpmng.o
  CC linux/pci_vfio.o
  CC base/fman/fman_hw.o
/root/RHEL82-64_K4.18.0_GCC8.3.1/x86_64-native-linuxapp-gcc/343c35f2883f4c67b4f2fb9a78343eed/dpdk/drivers/bus/pci/linux/pci_vfio.c:186:1: error: redefinition of ‘pci_vfio_enable_bus_memory’
 pci_vfio_enable_bus_memory(int dev_fd)
 ^~~~~~~~~~~~~~~~~~~~~~~~~~
/root/RHEL82-64_K4.18.0_GCC8.3.1/x86_64-native-linuxapp-gcc/343c35f2883f4c67b4f2fb9a78343eed/dpdk/drivers/bus/pci/linux/pci_vfio.c:154:1: note: previous definition of ‘pci_vfio_enable_bus_memory’ was here
--
 ^~~~~~~~~~~~~~~~~~~~~~~~~~
/root/RHEL82-64_K4.18.0_GCC8.3.1/x86_64-native-linuxapp-gcc/343c35f2883f4c67b4f2fb9a78343eed/dpdk/drivers/bus/pci/linux/pci_vfio.c:154:1: warning: ‘pci_vfio_enable_bus_memory’ defined but not used [-Wunused-function]
cc1: warning: unrecognized command line option ‘-Wno-address-of-packed-member’
make[6]: *** [/root/RHEL82-64_K4.18.0_GCC8.3.1/x86_64-native-linuxapp-gcc/343c35f2883f4c67b4f2fb9a78343eed/dpdk/mk/internal/rte.compile-pre.mk:114: linux/pci_vfio.o] Error 1
make[5]: *** [/root/RHEL82-64_K4.18.0_GCC8.3.1/x86_64-native-linuxapp-gcc/343c35f2883f4c67b4f2fb9a78343eed/dpdk/mk/rte.subdir.mk:37: pci] Error 2
make[5]: *** Waiting for unfinished jobs....
  CC base/fman/netcfg_layer.o
  CC mc/dpbp.o
--
  CC fslmc_bus.o
  AR librte_bus_fslmc.a
  INSTALL-LIB librte_bus_fslmc.a
make[4]: *** [/root/RHEL82-64_K4.18.0_GCC8.3.1/x86_64-native-linuxapp-gcc/343c35f2883f4c67b4f2fb9a78343eed/dpdk/mk/rte.subdir.mk:37: bus] Error 2
make[3]: *** [/root/RHEL82-64_K4.18.0_GCC8.3.1/x86_64-native-linuxapp-gcc/343c35f2883f4c67b4f2fb9a78343eed/dpdk/mk/rte.sdkbuild.mk:51: drivers] Error 2
make[2]: *** [/root/RHEL82-64_K4.18.0_GCC8.3.1/x86_64-native-linuxapp-gcc/343c35f2883f4c67b4f2fb9a78343eed/dpdk/mk/rte.sdkroot.mk:99: all] Error 2
make[1]: *** [/root/RHEL82-64_K4.18.0_GCC8.3.1/x86_64-native-linuxapp-gcc/343c35f2883f4c67b4f2fb9a78343eed/dpdk/mk/rte.sdkinstall.mk:61: pre_install] Error 2
make: *** [/root/RHEL82-64_K4.18.0_GCC8.3.1/x86_64-native-linuxapp-gcc/343c35f2883f4c67b4f2fb9a78343eed/dpdk/mk/rte.sdkroot.mk:77: install] Error 2


*Makefile Build Failed #10:
OS: SUSE15-64
Target: x86_64-native-linuxapp-clang
  CC base/fman/fman.o
  CC linux/pci_uio.o
  CC linux/pci_vfio.o
/root/SUSE15-64_K4.12.14_Clang5.0.1/x86_64-native-linuxapp-clang/343c35f2883f4c67b4f2fb9a78343eed/dpdk/drivers/bus/pci/linux/pci_vfio.c:186:1: error: redefinition of 'pci_vfio_enable_bus_memory'
pci_vfio_enable_bus_memory(int dev_fd)
^
/root/SUSE15-64_K4.12.14_Clang5.0.1/x86_64-native-linuxapp-clang/343c35f2883f4c67b4f2fb9a78343eed/dpdk/drivers/bus/pci/linux/pci_vfio.c:154:1: note: previous definition is here
pci_vfio_enable_bus_memory(int dev_fd)
^
1 error generated.
make[6]: *** [/root/SUSE15-64_K4.12.14_Clang5.0.1/x86_64-native-linuxapp-clang/343c35f2883f4c67b4f2fb9a78343eed/dpdk/mk/internal/rte.compile-pre.mk:116: linux/pci_vfio.o] Error 1
make[5]: *** [/root/SUSE15-64_K4.12.14_Clang5.0.1/x86_64-native-linuxapp-clang/343c35f2883f4c67b4f2fb9a78343eed/dpdk/mk/rte.subdir.mk:37: pci] Error 2
make[5]: *** Waiting for unfinished jobs....
  CC qbman/qbman_debug.o
  CC base/fman/fman_hw.o
--
  CC fslmc_bus.o
  AR librte_bus_fslmc.a
  INSTALL-LIB librte_bus_fslmc.a
make[4]: *** [/root/SUSE15-64_K4.12.14_Clang5.0.1/x86_64-native-linuxapp-clang/343c35f2883f4c67b4f2fb9a78343eed/dpdk/mk/rte.subdir.mk:37: bus] Error 2
make[3]: *** [/root/SUSE15-64_K4.12.14_Clang5.0.1/x86_64-native-linuxapp-clang/343c35f2883f4c67b4f2fb9a78343eed/dpdk/mk/rte.sdkbuild.mk:51: drivers] Error 2
make[2]: *** [/root/SUSE15-64_K4.12.14_Clang5.0.1/x86_64-native-linuxapp-clang/343c35f2883f4c67b4f2fb9a78343eed/dpdk/mk/rte.sdkroot.mk:99: all] Error 2
make[1]: *** [/root/SUSE15-64_K4.12.14_Clang5.0.1/x86_64-native-linuxapp-clang/343c35f2883f4c67b4f2fb9a78343eed/dpdk/mk/rte.sdkinstall.mk:61: pre_install] Error 2
make: *** [/root/SUSE15-64_K4.12.14_Clang5.0.1/x86_64-native-linuxapp-clang/343c35f2883f4c67b4f2fb9a78343eed/dpdk/mk/rte.sdkroot.mk:77: install] Error 2


*Makefile Build Failed #11:
OS: SUSE15-64
Target: x86_64-native-linuxapp-gcc
  CC mc/dpio.o
  CC mc/mc_sys.o
  CC linux/pci_vfio.o
/root/SUSE15-64_K4.12.14_GCC7.3.1/x86_64-native-linuxapp-gcc/343c35f2883f4c67b4f2fb9a78343eed/dpdk/drivers/bus/pci/linux/pci_vfio.c:186:1: error: redefinition of ‘pci_vfio_enable_bus_memory’
 pci_vfio_enable_bus_memory(int dev_fd)
 ^~~~~~~~~~~~~~~~~~~~~~~~~~
/root/SUSE15-64_K4.12.14_GCC7.3.1/x86_64-native-linuxapp-gcc/343c35f2883f4c67b4f2fb9a78343eed/dpdk/drivers/bus/pci/linux/pci_vfio.c:154:1: note: previous definition of ‘pci_vfio_enable_bus_memory’ was here
--
 ^~~~~~~~~~~~~~~~~~~~~~~~~~
/root/SUSE15-64_K4.12.14_GCC7.3.1/x86_64-native-linuxapp-gcc/343c35f2883f4c67b4f2fb9a78343eed/dpdk/drivers/bus/pci/linux/pci_vfio.c:154:1: warning: ‘pci_vfio_enable_bus_memory’ defined but not used [-Wunused-function]
cc1: warning: unrecognized command line option ‘-Wno-address-of-packed-member’
make[6]: *** [/root/SUSE15-64_K4.12.14_GCC7.3.1/x86_64-native-linuxapp-gcc/343c35f2883f4c67b4f2fb9a78343eed/dpdk/mk/internal/rte.compile-pre.mk:114: linux/pci_vfio.o] Error 1
make[5]: *** [/root/SUSE15-64_K4.12.14_GCC7.3.1/x86_64-native-linuxapp-gcc/343c35f2883f4c67b4f2fb9a78343eed/dpdk/mk/rte.subdir.mk:35: pci] Error 2
make[5]: *** Waiting for unfinished jobs....
  CC mc/dpcon.o
  CC mc/dpci.o
--
  CC base/qbman/dpaa_sys.o
  AR librte_bus_dpaa.a
  INSTALL-LIB librte_bus_dpaa.a
make[4]: *** [/root/SUSE15-64_K4.12.14_GCC7.3.1/x86_64-native-linuxapp-gcc/343c35f2883f4c67b4f2fb9a78343eed/dpdk/mk/rte.subdir.mk:37: bus] Error 2
make[3]: *** [/root/SUSE15-64_K4.12.14_GCC7.3.1/x86_64-native-linuxapp-gcc/343c35f2883f4c67b4f2fb9a78343eed/dpdk/mk/rte.sdkbuild.mk:51: drivers] Error 2
make[2]: *** [/root/SUSE15-64_K4.12.14_GCC7.3.1/x86_64-native-linuxapp-gcc/343c35f2883f4c67b4f2fb9a78343eed/dpdk/mk/rte.sdkroot.mk:99: all] Error 2
make[1]: *** [/root/SUSE15-64_K4.12.14_GCC7.3.1/x86_64-native-linuxapp-gcc/343c35f2883f4c67b4f2fb9a78343eed/dpdk/mk/rte.sdkinstall.mk:61: pre_install] Error 2
make: *** [/root/SUSE15-64_K4.12.14_GCC7.3.1/x86_64-native-linuxapp-gcc/343c35f2883f4c67b4f2fb9a78343eed/dpdk/mk/rte.sdkroot.mk:77: install] Error 2


*Makefile Build Failed #12:
OS: UB1804-64
Target: x86_64-native-linuxapp-gcc
  CC base/fman/fman_hw.o
  CC linux/pci_vfio.o
  CC mc/dpmng.o
/root/UB1804-64_K4.15.0_GCC7.3.0/x86_64-native-linuxapp-gcc/343c35f2883f4c67b4f2fb9a78343eed/dpdk/drivers/bus/pci/linux/pci_vfio.c:186:1: error: redefinition of ‘pci_vfio_enable_bus_memory’
 pci_vfio_enable_bus_memory(int dev_fd)
 ^~~~~~~~~~~~~~~~~~~~~~~~~~
/root/UB1804-64_K4.15.0_GCC7.3.0/x86_64-native-linuxapp-gcc/343c35f2883f4c67b4f2fb9a78343eed/dpdk/drivers/bus/pci/linux/pci_vfio.c:154:1: note: previous definition of ‘pci_vfio_enable_bus_memory’ was here
--
 ^~~~~~~~~~~~~~~~~~~~~~~~~~
/root/UB1804-64_K4.15.0_GCC7.3.0/x86_64-native-linuxapp-gcc/343c35f2883f4c67b4f2fb9a78343eed/dpdk/drivers/bus/pci/linux/pci_vfio.c:154:1: warning: ‘pci_vfio_enable_bus_memory’ defined but not used [-Wunused-function]
cc1: warning: unrecognized command line option ‘-Wno-address-of-packed-member’
/root/UB1804-64_K4.15.0_GCC7.3.0/x86_64-native-linuxapp-gcc/343c35f2883f4c67b4f2fb9a78343eed/dpdk/mk/internal/rte.compile-pre.mk:114: recipe for target 'linux/pci_vfio.o' failed
make[6]: *** [linux/pci_vfio.o] Error 1
/root/UB1804-64_K4.15.0_GCC7.3.0/x86_64-native-linuxapp-gcc/343c35f2883f4c67b4f2fb9a78343eed/dpdk/mk/rte.subdir.mk:35: recipe for target 'pci' failed
make[5]: *** [pci] Error 2
make[5]: *** Waiting for unfinished jobs....
  CC mc/dpbp.o
  CC mc/dpio.o
--
  CC base/qbman/dpaa_sys.o
  AR librte_bus_dpaa.a
  INSTALL-LIB librte_bus_dpaa.a
/root/UB1804-64_K4.15.0_GCC7.3.0/x86_64-native-linuxapp-gcc/343c35f2883f4c67b4f2fb9a78343eed/dpdk/mk/rte.subdir.mk:35: recipe for target 'bus' failed
make[4]: *** [bus] Error 2
/root/UB1804-64_K4.15.0_GCC7.3.0/x86_64-native-linuxapp-gcc/343c35f2883f4c67b4f2fb9a78343eed/dpdk/mk/rte.sdkbuild.mk:51: recipe for target 'drivers' failed
make[3]: *** [drivers] Error 2
/root/UB1804-64_K4.15.0_GCC7.3.0/x86_64-native-linuxapp-gcc/343c35f2883f4c67b4f2fb9a78343eed/dpdk/mk/rte.sdkroot.mk:98: recipe for target 'all' failed
make[2]: *** [all] Error 2
/root/UB1804-64_K4.15.0_GCC7.3.0/x86_64-native-linuxapp-gcc/343c35f2883f4c67b4f2fb9a78343eed/dpdk/mk/rte.sdkinstall.mk:60: recipe for target 'pre_install' failed
make[1]: *** [pre_install] Error 2
/root/UB1804-64_K4.15.0_GCC7.3.0/x86_64-native-linuxapp-gcc/343c35f2883f4c67b4f2fb9a78343eed/dpdk/mk/rte.sdkroot.mk:77: recipe for target 'install' failed
make: *** [install] Error 2


*Makefile Build Failed #13:
OS: UB2004-32
Target: i686-native-linuxapp-gcc
  CC mc/dpmng.o
  CC linux/pci_vfio.o
  CC base/fman/fman_hw.o
/root/UB2004-32_K4.15.0_GCC9.3.0/i686-native-linuxapp-gcc/343c35f2883f4c67b4f2fb9a78343eed/dpdk/drivers/bus/pci/linux/pci_vfio.c:186:1: error: redefinition of ‘pci_vfio_enable_bus_memory’
  186 | pci_vfio_enable_bus_memory(int dev_fd)
      | ^~~~~~~~~~~~~~~~~~~~~~~~~~
/root/UB2004-32_K4.15.0_GCC9.3.0/i686-native-linuxapp-gcc/343c35f2883f4c67b4f2fb9a78343eed/dpdk/drivers/bus/pci/linux/pci_vfio.c:154:1: note: previous definition of ‘pci_vfio_enable_bus_memory’ was here
  154 | pci_vfio_enable_bus_memory(int dev_fd)
      | ^~~~~~~~~~~~~~~~~~~~~~~~~~
/root/UB2004-32_K4.15.0_GCC9.3.0/i686-native-linuxapp-gcc/343c35f2883f4c67b4f2fb9a78343eed/dpdk/drivers/bus/pci/linux/pci_vfio.c:154:1: warning: ‘pci_vfio_enable_bus_memory’ defined but not used [-Wunused-function]
make[6]: *** [/root/UB2004-32_K4.15.0_GCC9.3.0/i686-native-linuxapp-gcc/343c35f2883f4c67b4f2fb9a78343eed/dpdk/mk/internal/rte.compile-pre.mk:116: linux/pci_vfio.o] Error 1
make[5]: *** [/root/UB2004-32_K4.15.0_GCC9.3.0/i686-native-linuxapp-gcc/343c35f2883f4c67b4f2fb9a78343eed/dpdk/mk/rte.subdir.mk:37: pci] Error 2
make[5]: *** Waiting for unfinished jobs....
  CC base/fman/netcfg_layer.o
  CC mc/dpbp.o
--
  LD portal/dpaa2_hw_dpci.o
  AR librte_bus_fslmc.a
  INSTALL-LIB librte_bus_fslmc.a
make[4]: *** [/root/UB2004-32_K4.15.0_GCC9.3.0/i686-native-linuxapp-gcc/343c35f2883f4c67b4f2fb9a78343eed/dpdk/mk/rte.subdir.mk:37: bus] Error 2
make[3]: *** [/root/UB2004-32_K4.15.0_GCC9.3.0/i686-native-linuxapp-gcc/343c35f2883f4c67b4f2fb9a78343eed/dpdk/mk/rte.sdkbuild.mk:53: drivers] Error 2
make[2]: *** [/root/UB2004-32_K4.15.0_GCC9.3.0/i686-native-linuxapp-gcc/343c35f2883f4c67b4f2fb9a78343eed/dpdk/mk/rte.sdkroot.mk:99: all] Error 2
make[1]: *** [/root/UB2004-32_K4.15.0_GCC9.3.0/i686-native-linuxapp-gcc/343c35f2883f4c67b4f2fb9a78343eed/dpdk/mk/rte.sdkinstall.mk:61: pre_install] Error 2
make: *** [/root/UB2004-32_K4.15.0_GCC9.3.0/i686-native-linuxapp-gcc/343c35f2883f4c67b4f2fb9a78343eed/dpdk/mk/rte.sdkroot.mk:77: install] Error 2


*Makefile Build Failed #14:
OS: UB2004-64
Target: x86_64-native-linuxapp-clang
  CC mc/dpmng.o
  CC linux/pci_vfio.o
  CC mc/dpbp.o
/root/UB2004-64_K5.4.0_Clang10.0.0/x86_64-native-linuxapp-clang/343c35f2883f4c67b4f2fb9a78343eed/dpdk/drivers/bus/pci/linux/pci_vfio.c:186:1: error: redefinition of 'pci_vfio_enable_bus_memory'
pci_vfio_enable_bus_memory(int dev_fd)
^
/root/UB2004-64_K5.4.0_Clang10.0.0/x86_64-native-linuxapp-clang/343c35f2883f4c67b4f2fb9a78343eed/dpdk/drivers/bus/pci/linux/pci_vfio.c:154:1: note: previous definition is here
pci_vfio_enable_bus_memory(int dev_fd)
^
1 error generated.
make[6]: *** [/root/UB2004-64_K5.4.0_Clang10.0.0/x86_64-native-linuxapp-clang/343c35f2883f4c67b4f2fb9a78343eed/dpdk/mk/internal/rte.compile-pre.mk:114: linux/pci_vfio.o] Error 1
make[5]: *** [/root/UB2004-64_K5.4.0_Clang10.0.0/x86_64-native-linuxapp-clang/343c35f2883f4c67b4f2fb9a78343eed/dpdk/mk/rte.subdir.mk:37: pci] Error 2
make[5]: *** Waiting for unfinished jobs....
  CC mc/dpio.o
  CC mc/mc_sys.o
--
  CC base/qbman/dpaa_sys.o
  AR librte_bus_dpaa.a
  INSTALL-LIB librte_bus_dpaa.a
make[4]: *** [/root/UB2004-64_K5.4.0_Clang10.0.0/x86_64-native-linuxapp-clang/343c35f2883f4c67b4f2fb9a78343eed/dpdk/mk/rte.subdir.mk:37: bus] Error 2
make[3]: *** [/root/UB2004-64_K5.4.0_Clang10.0.0/x86_64-native-linuxapp-clang/343c35f2883f4c67b4f2fb9a78343eed/dpdk/mk/rte.sdkbuild.mk:51: drivers] Error 2
make[2]: *** [/root/UB2004-64_K5.4.0_Clang10.0.0/x86_64-native-linuxapp-clang/343c35f2883f4c67b4f2fb9a78343eed/dpdk/mk/rte.sdkroot.mk:99: all] Error 2
make[1]: *** [/root/UB2004-64_K5.4.0_Clang10.0.0/x86_64-native-linuxapp-clang/343c35f2883f4c67b4f2fb9a78343eed/dpdk/mk/rte.sdkinstall.mk:61: pre_install] Error 2
make: *** [/root/UB2004-64_K5.4.0_Clang10.0.0/x86_64-native-linuxapp-clang/343c35f2883f4c67b4f2fb9a78343eed/dpdk/mk/rte.sdkroot.mk:77: install] Error 2


*Makefile Build Failed #15:
OS: UB2004-64
Target: x86_64-native-linuxapp-gcc
  CC mc/dpmng.o
  CC linux/pci_vfio.o
  CC base/fman/fman_hw.o
/root/UB2004-64_K5.4.0_GCC9.3.0/x86_64-native-linuxapp-gcc/343c35f2883f4c67b4f2fb9a78343eed/dpdk/drivers/bus/pci/linux/pci_vfio.c:186:1: error: redefinition of ‘pci_vfio_enable_bus_memory’
  186 | pci_vfio_enable_bus_memory(int dev_fd)
      | ^~~~~~~~~~~~~~~~~~~~~~~~~~
/root/UB2004-64_K5.4.0_GCC9.3.0/x86_64-native-linuxapp-gcc/343c35f2883f4c67b4f2fb9a78343eed/dpdk/drivers/bus/pci/linux/pci_vfio.c:154:1: note: previous definition of ‘pci_vfio_enable_bus_memory’ was here
  154 | pci_vfio_enable_bus_memory(int dev_fd)
      | ^~~~~~~~~~~~~~~~~~~~~~~~~~
/root/UB2004-64_K5.4.0_GCC9.3.0/x86_64-native-linuxapp-gcc/343c35f2883f4c67b4f2fb9a78343eed/dpdk/drivers/bus/pci/linux/pci_vfio.c:154:1: warning: ‘pci_vfio_enable_bus_memory’ defined but not used [-Wunused-function]
make[6]: *** [/root/UB2004-64_K5.4.0_GCC9.3.0/x86_64-native-linuxapp-gcc/343c35f2883f4c67b4f2fb9a78343eed/dpdk/mk/internal/rte.compile-pre.mk:114: linux/pci_vfio.o] Error 1
make[5]: *** [/root/UB2004-64_K5.4.0_GCC9.3.0/x86_64-native-linuxapp-gcc/343c35f2883f4c67b4f2fb9a78343eed/dpdk/mk/rte.subdir.mk:37: pci] Error 2
make[5]: *** Waiting for unfinished jobs....
  CC base/fman/netcfg_layer.o
  CC mc/dpbp.o
--
  CC fslmc_bus.o
  AR librte_bus_fslmc.a
  INSTALL-LIB librte_bus_fslmc.a
make[4]: *** [/root/UB2004-64_K5.4.0_GCC9.3.0/x86_64-native-linuxapp-gcc/343c35f2883f4c67b4f2fb9a78343eed/dpdk/mk/rte.subdir.mk:37: bus] Error 2
make[3]: *** [/root/UB2004-64_K5.4.0_GCC9.3.0/x86_64-native-linuxapp-gcc/343c35f2883f4c67b4f2fb9a78343eed/dpdk/mk/rte.sdkbuild.mk:51: drivers] Error 2
make[2]: *** [/root/UB2004-64_K5.4.0_GCC9.3.0/x86_64-native-linuxapp-gcc/343c35f2883f4c67b4f2fb9a78343eed/dpdk/mk/rte.sdkroot.mk:99: all] Error 2
make[1]: *** [/root/UB2004-64_K5.4.0_GCC9.3.0/x86_64-native-linuxapp-gcc/343c35f2883f4c67b4f2fb9a78343eed/dpdk/mk/rte.sdkinstall.mk:61: pre_install] Error 2
make: *** [/root/UB2004-64_K5.4.0_GCC9.3.0/x86_64-native-linuxapp-gcc/343c35f2883f4c67b4f2fb9a78343eed/dpdk/mk/rte.sdkroot.mk:77: install] Error 2


*Makefile Build Failed #16:
OS: UB2004-64
Target: x86_64-native-linuxapp-icc
  CC base/fman/netcfg_layer.o
  CC mc/dpbp.o
  CC linux/pci_vfio.o
/root/UB2004-64_K5.4.0_ICC19.1.0/x86_64-native-linuxapp-icc/343c35f2883f4c67b4f2fb9a78343eed/dpdk/drivers/bus/pci/linux/pci_vfio.c(186): error: function "pci_vfio_enable_bus_memory" has already been defined
  pci_vfio_enable_bus_memory(int dev_fd)
  ^

compilation aborted for /root/UB2004-64_K5.4.0_ICC19.1.0/x86_64-native-linuxapp-icc/343c35f2883f4c67b4f2fb9a78343eed/dpdk/drivers/bus/pci/linux/pci_vfio.c (code 2)
make[6]: *** [/root/UB2004-64_K5.4.0_ICC19.1.0/x86_64-native-linuxapp-icc/343c35f2883f4c67b4f2fb9a78343eed/dpdk/mk/internal/rte.compile-pre.mk:116: linux/pci_vfio.o] Error 2
make[5]: *** [/root/UB2004-64_K5.4.0_ICC19.1.0/x86_64-native-linuxapp-icc/343c35f2883f4c67b4f2fb9a78343eed/dpdk/mk/rte.subdir.mk:37: pci] Error 2
make[5]: *** Waiting for unfinished jobs....
  CC mc/dpio.o
  CC base/qbman/process.o
--
  CC base/qbman/dpaa_sys.o
  AR librte_bus_dpaa.a
  INSTALL-LIB librte_bus_dpaa.a
make[4]: *** [/root/UB2004-64_K5.4.0_ICC19.1.0/x86_64-native-linuxapp-icc/343c35f2883f4c67b4f2fb9a78343eed/dpdk/mk/rte.subdir.mk:37: bus] Error 2
make[3]: *** [/root/UB2004-64_K5.4.0_ICC19.1.0/x86_64-native-linuxapp-icc/343c35f2883f4c67b4f2fb9a78343eed/dpdk/mk/rte.sdkbuild.mk:51: drivers] Error 2
make[2]: *** [/root/UB2004-64_K5.4.0_ICC19.1.0/x86_64-native-linuxapp-icc/343c35f2883f4c67b4f2fb9a78343eed/dpdk/mk/rte.sdkroot.mk:99: all] Error 2
make[1]: *** [/root/UB2004-64_K5.4.0_ICC19.1.0/x86_64-native-linuxapp-icc/343c35f2883f4c67b4f2fb9a78343eed/dpdk/mk/rte.sdkinstall.mk:61: pre_install] Error 2
make: *** [/root/UB2004-64_K5.4.0_ICC19.1.0/x86_64-native-linuxapp-icc/343c35f2883f4c67b4f2fb9a78343eed/dpdk/mk/rte.sdkroot.mk:77: install] Error 2
DPDK STV team

^ permalink raw reply	[flat|nested] 2+ messages in thread

end of thread, other threads:[~2020-06-28 12:21 UTC | newest]

Thread overview: 2+ messages (download: mbox.gz / follow: Atom feed)
-- links below jump to the message on this page --
2020-06-28 12:21 [dpdk-test-report] |FAILURE| pw(72163) [v4] bus/pci: fix VF bus error for memory access sys_stv
  -- strict thread matches above, loose matches on Subject: below --
2020-06-26  0:41 sys_stv

automatic DPDK test reports

This inbox may be cloned and mirrored by anyone:

	git clone --mirror https://inbox.dpdk.org/test-report/0 test-report/git/0.git

	# If you have public-inbox 1.1+ installed, you may
	# initialize and index your mirror using the following commands:
	public-inbox-init -V2 test-report test-report/ https://inbox.dpdk.org/test-report \
		test-report@dpdk.org
	public-inbox-index test-report

Example config snippet for mirrors.
Newsgroup available over NNTP:
	nntp://inbox.dpdk.org/inbox.dpdk.test-report


AGPL code for this site: git clone https://public-inbox.org/public-inbox.git