automatic DPDK test reports
 help / color / mirror / Atom feed
* [dpdk-test-report]  |FAILURE| pw(72184) [v2, 1/3] crypto/qat: add data-path APIs
@ 2020-06-28 14:04 sys_stv
  0 siblings, 0 replies; 2+ messages in thread
From: sys_stv @ 2020-06-28 14:04 UTC (permalink / raw)
  To: test-report

[-- Attachment #1: Type: text/plain, Size: 160874 bytes --]


Test-Label: Intel-compilation
Test-Status: FAILURE
http://dpdk.org/patch/72184

_Compilation issues_

Submitter: Fan Zhang <roy.fan.zhang@intel.com>
Date: 2020-06-25 13:31:36
Reply_mail: 20200625133138.42827-2-roy.fan.zhang@intel.com

DPDK git baseline: Repo:dpdk-next-crypto, CommitID: 27991115743bc0e1feb2c4ba7a766020d51bdb5d


Meson build Summary: 8 Builds Done, 5 Successful, 3 Failures, 0 Blocked

Makefile build Summary: 20 Builds Done, 1 Successful, 19 Failures, 0 Blocked

                +==============================================+===========+==========+
                |                   Makefile                   |   Meson   | Document |
+----------------+------+-------+------+------------+-----------+-----------+----------+
| os             | gcc  | clang | icc  | gcc+shared | gcc+debug | gcc/clang | pdf/html |
+----------------+------+-------+------+------------+-----------+-----------+----------+
| CENTOS82-64    | FAIL | FAIL  | FAIL | FAIL       | FAIL      | FAIL      |          |
| RHEL82-64      | FAIL |       |      |            |           |           |          |
| UB1804-64      | FAIL |       |      |            |           |           |          |
| FC32-64        | FAIL | FAIL  |      |            |           | FAIL      |          |
| CENTOS77-64    | FAIL |       |      |            |           |           |          |
| UB2004-64      | FAIL | FAIL  | FAIL |            |           | FAIL      | pass     |
| WIN10-64       |      |       |      |            |           | pass      |          |
| UB2004-32      | pass |       |      |            |           |           |          |
| UB1804-32      |      |       |      |            |           | pass      |          |
| FreeBSD1201-64 | FAIL | FAIL  |      | FAIL       | FAIL      | pass      |          |
| SUSE15-64      | FAIL | FAIL  |      |            |           | pass      |          |
+----------------+------+-------+------+------------+-----------+-----------+----------+
Test environment and configuration as below:

** Makefile build **


OS: CENTOS82-64
	Kernel Version: 4.18.0-193.el8.x86_64
	CPU info: Intel(R) Xeon(R) Platinum 8280M CPU @ 2.70GHz
	GCC Version: gcc (GCC) 8.3.1 20191121 (Red Hat 8.3.1-5)
	Clang Version: 9.0.1 (Red Hat 9.0.1-2.module_el8.2.0+309+0c7b6b03)
	x86_64-native-linuxapp-gcc
	x86_64-native-linuxapp-clang
	x86_64-native-linuxapp-icc
	x86_64-native-linuxapp-gcc+shared
	x86_64-native-linuxapp-gcc+debug


OS: RHEL82-64
	Kernel Version: 4.18.0-193.el8.x86_64
	CPU info: Intel(R) Xeon(R) Platinum 8280M CPU @ 2.70GHz
	GCC Version: gcc (GCC) 8.3.1 20191121 (Red Hat 8.3.1-5)
	Clang Version: 8.0.1 (Red Hat 8.0.1-1.module_el8.1.0+215+a01033fb)
	x86_64-native-linuxapp-gcc


OS: UB1804-64
	Kernel Version: 4.15.0-29-generic
	CPU info: Intel(R) Xeon(R) Platinum 8180 CPU @ 2.50GHz
	GCC Version: gcc (Ubuntu 7.5.0-3ubuntu1~18.04) 7.5.0
	Clang Version: 6.0.0-1ubuntu2 (tags/RELEASE_600/final)
	x86_64-native-linuxapp-gcc


OS: FC32-64
	Kernel Version: 5.6.0-0.rc7.git0.2.fc32.x86_64
	CPU info: Intel(R) Xeon(R) Platinum 8280M CPU @ 2.70GHz
	GCC Version: gcc (GCC) 10.0.1 20200311 (Red Hat 10.0.1-0.9)
	Clang Version: 10.0.0 (Fedora 10.0.0-0.3.rc4.fc32)
	x86_64-native-linuxapp-gcc
	x86_64-native-linuxapp-clang


OS: CENTOS77-64
	Kernel Version: 3.10.0-1062.9.1.el7.x86_64
	CPU info: Intel(R) Xeon(R) Platinum 8280M CPU @ 2.70GHz
	GCC Version: gcc (GCC) 4.8.5 20150623 (Red Hat 4.8.5-39)
	Clang Version: 3.4.2 (tags/RELEASE_34/dot2-final)
	x86_64-native-linuxapp-gcc


OS: UB2004-64
	Kernel Version: 5.4.0-26-generic
	CPU info: Intel(R) Xeon(R) Platinum 8180 CPU @ 2.50GHz
	GCC Version: gcc (Ubuntu 10-20200416-0ubuntu1) 10.0.1 20200416 (experimental) [master revision 3c3f12e2a76:dcee354ce56:44b326839d864fc10c459916abcc97f35a9ac3de]
	Clang Version: 10.0.0-4ubuntu1
	x86_64-native-linuxapp-clang
	x86_64-native-linuxapp-gcc
	x86_64-native-linuxapp-icc


OS: UB2004-32
	Kernel Version: 5.4.0-26-generic
	CPU info: Intel(R) Xeon(R) Platinum 8180 CPU @ 2.50GHz
	GCC Version: gcc (Ubuntu 9.3.0-10ubuntu2) 9.3.0
	Clang Version: 10.0.0-4ubuntu1
	i686-native-linuxapp-gcc


OS: FreeBSD1201-64
	Kernel Version: 12.1-RELEASE
	CPU info: Intel(R) Xeon(R) CPU E5-2699 v3 @ 2.30GHz (2294.74-MHz K8-class CPU)
	GCC Version: gcc (FreeBSD Ports Collection) 9.2.0
	Clang Version: 8.0.1 (tags/RELEASE_801/final 366581) (based on LLVM 8.0.1)
	x86_64-native-bsdapp-gcc
	x86_64-native-bsdapp-clang
	x86_64-native-bsdapp-gcc+shared
	x86_64-native-bsdapp-gcc+debug


OS: SUSE15-64
	Kernel Version: 4.12.14-lp150.11-default
	CPU info: Intel(R) Xeon(R) CPU E5-2699 v4 @ 2.20GHz
	GCC Version: gcc (SUSE Linux) 7.3.1 20180323 [gcc-7-branch revision 258812]
	Clang Version: 5.0.1 (tags/RELEASE_501/final 312548)
	x86_64-native-linuxapp-clang
	x86_64-native-linuxapp-gcc

** Meson build **


OS: CENTOS82-64
	Kernel Version: 4.18.0-193.el8.x86_64
	CPU info: Intel(R) Xeon(R) CPU E5-2699 v4 @ 2.20GHz
	GCC Version: gcc (GCC) 8.3.1 20191121 (Red Hat 8.3.1-5)
	Clang Version: 9.0.1 (Red Hat 9.0.1-2.module_el8.2.0+309+0c7b6b03)
	./build-gcc-static
	./build-gcc-shared
	./build-clang-static
	./build-clang-shared
	./build-x86-default


OS: UB2004-64
	Kernel Version: 5.4.0-26-generic
	CPU info: Intel(R) Xeon(R) Platinum 8180 CPU @ 2.50GHz
	GCC Version: gcc (Ubuntu 9.3.0-10ubuntu2) 9.3.0
	Clang Version: 10.0.0-4ubuntu1
	x86_64-native-linuxapp-doc
	./build-gcc-static
	./build-gcc-shared
	./build-clang-static
	./build-clang-shared
	./build-x86-default


OS: FC32-64
	Kernel Version: 5.6.0-0.rc7.git0.2.fc32.x86_64
	CPU info: Intel(R) Xeon(R) CPU E5-2699 v4 @ 2.20GHz
	GCC Version: gcc (GCC) 10.0.1 20200311 (Red Hat 10.0.1-0.9)
	Clang Version: 10.0.0 (Fedora 10.0.0-0.3.rc4.fc32)
	./build-gcc-static
	./build-gcc-shared
	./build-clang-static
	./build-clang-shared
	./build-x86-default


OS: WIN10-64
	Kernel Version: N/A
	CPU info: N/A
	GCC Version: N/A
	Clang Version: Clang 8.0.0
	x86_64-windows-clang


OS: UB1804-32
	Kernel Version: 4.15.0-20-generic
	CPU info: Intel(R) Xeon(R) CPU E5-2699 v4 @ 2.20GHz
	GCC Version: gcc (Ubuntu 7.5.0-3ubuntu1~18.04) 7.5.0
	Clang Version: 6.0.0-1ubuntu2 (tags/RELEASE_600/final)
	./build-gcc-static
	./build-gcc-shared
	./build-clang-static
	./build-clang-shared
	./build-x86-default


OS: FreeBSD1201-64
	Kernel Version: 12.1-RELEASE
	CPU info: Intel(R) Xeon(R) CPU E5-2699 v4 @ 2.20GHz (2194.97-MHz K8-class CPU)
	GCC Version: gcc (FreeBSD Ports Collection) 9.2.0
	Clang Version: 8.0.1 (tags/RELEASE_801/final 366581) (based on LLVM 8.0.1)
	./build-gcc-static
	./build-gcc-shared
	./build-clang-static
	./build-clang-shared
	./build-x86-default


OS: SUSE15-64
	Kernel Version: 4.12.14-lp150.12.82-default
	CPU info: Intel(R) Xeon(R) CPU E5-2699 v4 @ 2.20GHz
	GCC Version: gcc (SUSE Linux) 7.4.1 20190905 [gcc-7-branch revision 275407]
	Clang Version: 5.0.1 (tags/RELEASE_501/final 312548)
	./build-gcc-static
	./build-gcc-shared
	./build-clang-static
	./build-clang-shared
	./build-x86-default



*Meson Build Failed #1:
OS: CENTOS82-64
Target:./build-gcc-static
FAILED: drivers/a715181@@tmp_rte_pmd_qat@sta/crypto_qat_qat_sym_frame.c.o 
gcc -Idrivers/a715181@@tmp_rte_pmd_qat@sta -Idrivers -I../drivers -Idrivers/compress/qat -I../drivers/compress/qat -Idrivers/common/qat -I../drivers/common/qat -I../drivers/common/qat/qat_adf -Idrivers/crypto/qat -I../drivers/crypto/qat -Ilib/librte_compressdev -I../lib/librte_compressdev -I. -I../ -Iconfig -I../config -Ilib/librte_eal/include -I../lib/librte_eal/include -Ilib/librte_eal/linux/include -I../lib/librte_eal/linux/include -Ilib/librte_eal/x86/include -I../lib/librte_eal/x86/include -Ilib/librte_eal/common -I../lib/librte_eal/common -Ilib/librte_eal -I../lib/librte_eal -Ilib/librte_kvargs -I../lib/librte_kvargs -Ilib/librte_telemetry/../librte_metrics -I../lib/librte_telemetry/../librte_metrics -Ilib/librte_telemetry -I../lib/librte_telemetry -Ilib/librte_mbuf -I../lib/librte_mbuf -Ilib/librte_mempool -I../lib/librte_mempool -Ilib/librte_ring -I../lib/librte_ring -Idrivers/bus/pci -I../drivers/bus/pci -I../drivers/bus/pci/linux -Ilib/librte_pci -I../lib/librte_pci -Ilib/librte_cryptodev -I../lib/librte_cryptodev -fdiagnostics-color=always -pipe -D_FILE_OFFSET_BITS=64 -Wall -Winvalid-pch -Werror -O2 -g -include rte_config.h -Wextra -Wcast-qual -Wdeprecated -Wformat-nonliteral -Wformat-security -Wmissing-declarations -Wmissing-prototypes -Wnested-externs -Wold-style-definition -Wpointer-arith -Wsign-compare -Wstrict-prototypes -Wundef -Wwrite-strings -Wno-packed-not-aligned -Wno-missing-field-initializers -D_GNU_SOURCE -fPIC -march=native -mno-avx512f -DALLOW_EXPERIMENTAL_API -DALLOW_INTERNAL_API -Wno-format-truncation -DBUILD_QAT_SYM -DBUILD_QAT_ASYM -MD -MQ 'drivers/a715181@@tmp_rte_pmd_qat@sta/crypto_qat_qat_sym_frame.c.o' -MF 'drivers/a715181@@tmp_rte_pmd_qat@sta/crypto_qat_qat_sym_frame.c.o.d' -o 'drivers/a715181@@tmp_rte_pmd_qat@sta/crypto_qat_qat_sym_frame.c.o' -c ../drivers/crypto/qat/qat_sym_frame.c
../drivers/crypto/qat/qat_sym_frame.c: In function ‘qat_sym_get_qp’:
../drivers/crypto/qat/qat_sym_frame.c:25:7: error: implicit declaration of function ‘rte_cryptodev_get_qp_status’; did you mean ‘rte_cryptodev_get_sec_ctx’? [-Werror=implicit-function-declaration]
  if (!rte_cryptodev_get_qp_status(dev_id, qp_id))
       ^~~~~~~~~~~~~~~~~~~~~~~~~~~
       rte_cryptodev_get_sec_ctx
../drivers/crypto/qat/qat_sym_frame.c:25:7: error: nested extern declaration of ‘rte_cryptodev_get_qp_status’ [-Werror=nested-externs]
cc1: all warnings being treated as errors
[1805/2194] Compiling C object 'drivers/a715181@@tmp_rte_pmd_zlib@sta/compress_zlib_zlib_pmd_ops.c.o'.
[1806/2194] Compiling C object 'drivers/a715181@@tmp_rte_pmd_qat@sta/compress_qat_qat_comp.c.o'.
[1807/2194] Compiling C object 'drivers/a715181@@tmp_rte_pmd_zlib@sta/compress_zlib_zlib_pmd.c.o'.
[1808/2194] Compiling C object 'drivers/a715181@@tmp_rte_pmd_dpaa2_event@sta/event_dpaa2_dpaa2_hw_dpcon.c.o'.
[1809/2194] Compiling C object 'drivers/a715181@@tmp_rte_pmd_ifc@sta/vdpa_ifc_ifcvf_vdpa.c.o'.
[1810/2194] Compiling C object 'drivers/a715181@@tmp_rte_pmd_dpaa_event@sta/event_dpaa_dpaa_eventdev.c.o'.
[1811/2194] Compiling C object 'drivers/a715181@@tmp_rte_pmd_dpaa2_event@sta/event_dpaa2_dpaa2_eventdev.c.o'.
[1812/2194] Compiling C object 'drivers/a715181@@tmp_rte_pmd_qat@sta/crypto_qat_qat_asym.c.o'.
[1813/2194] Compiling C object 'drivers/a715181@@tmp_rte_pmd_dpaa2_event@sta/event_dpaa2_dpaa2_eventdev_selftest.c.o'.
[1814/2194] Compiling C object 'drivers/a715181@@tmp_rte_pmd_octeontx2_crypto@sta/crypto_octeontx2_otx2_cryptodev_ops.c.o'.
[1815/2194] Compiling C object 'drivers/a715181@@tmp_rte_pmd_octeontx_crypto@sta/crypto_octeontx_otx_cryptodev_ops.c.o'.
ninja: build stopped: subcommand failed




*Meson Build Failed #2:
OS: FC32-64
Target:./build-gcc-static
FAILED: drivers/a715181@@tmp_rte_pmd_qat@sta/crypto_qat_qat_sym_frame.c.o 
gcc -Idrivers/a715181@@tmp_rte_pmd_qat@sta -Idrivers -I../drivers -Idrivers/compress/qat -I../drivers/compress/qat -Idrivers/common/qat -I../drivers/common/qat -I../drivers/common/qat/qat_adf -Idrivers/crypto/qat -I../drivers/crypto/qat -Ilib/librte_compressdev -I../lib/librte_compressdev -I. -I../ -Iconfig -I../config -Ilib/librte_eal/include -I../lib/librte_eal/include -Ilib/librte_eal/linux/include -I../lib/librte_eal/linux/include -Ilib/librte_eal/x86/include -I../lib/librte_eal/x86/include -Ilib/librte_eal/common -I../lib/librte_eal/common -Ilib/librte_eal -I../lib/librte_eal -Ilib/librte_kvargs -I../lib/librte_kvargs -Ilib/librte_telemetry/../librte_metrics -I../lib/librte_telemetry/../librte_metrics -Ilib/librte_telemetry -I../lib/librte_telemetry -Ilib/librte_mbuf -I../lib/librte_mbuf -Ilib/librte_mempool -I../lib/librte_mempool -Ilib/librte_ring -I../lib/librte_ring -Idrivers/bus/pci -I../drivers/bus/pci -I../drivers/bus/pci/linux -Ilib/librte_pci -I../lib/librte_pci -Ilib/librte_cryptodev -I../lib/librte_cryptodev -fdiagnostics-color=always -pipe -D_FILE_OFFSET_BITS=64 -Wall -Winvalid-pch -Werror -O2 -g -include rte_config.h -Wextra -Wcast-qual -Wdeprecated -Wformat-nonliteral -Wformat-security -Wmissing-declarations -Wmissing-prototypes -Wnested-externs -Wold-style-definition -Wpointer-arith -Wsign-compare -Wstrict-prototypes -Wundef -Wwrite-strings -Wno-address-of-packed-member -Wno-packed-not-aligned -Wno-missing-field-initializers -Wno-zero-length-bounds -D_GNU_SOURCE -fPIC -march=native -DALLOW_EXPERIMENTAL_API -DALLOW_INTERNAL_API -Wno-format-truncation -DBUILD_QAT_SYM -DBUILD_QAT_ASYM -MD -MQ 'drivers/a715181@@tmp_rte_pmd_qat@sta/crypto_qat_qat_sym_frame.c.o' -MF 'drivers/a715181@@tmp_rte_pmd_qat@sta/crypto_qat_qat_sym_frame.c.o.d' -o 'drivers/a715181@@tmp_rte_pmd_qat@sta/crypto_qat_qat_sym_frame.c.o' -c ../drivers/crypto/qat/qat_sym_frame.c
../drivers/crypto/qat/qat_sym_frame.c: In function ‘qat_sym_get_qp’:
../drivers/crypto/qat/qat_sym_frame.c:25:7: error: implicit declaration of function ‘rte_cryptodev_get_qp_status’; did you mean ‘rte_cryptodev_get_sec_ctx’? [-Werror=implicit-function-declaration]
   25 |  if (!rte_cryptodev_get_qp_status(dev_id, qp_id))
      |       ^~~~~~~~~~~~~~~~~~~~~~~~~~~
      |       rte_cryptodev_get_sec_ctx
../drivers/crypto/qat/qat_sym_frame.c:25:7: error: nested extern declaration of ‘rte_cryptodev_get_qp_status’ [-Werror=nested-externs]
cc1: all warnings being treated as errors
[1802/2195] Compiling C object 'drivers/a715181@@tmp_rte_pmd_zlib@sta/compress_zlib_zlib_pmd_ops.c.o'.
[1803/2195] Compiling C object 'drivers/a715181@@tmp_rte_pmd_qat@sta/compress_qat_qat_comp_pmd.c.o'.
[1804/2195] Compiling C object 'drivers/a715181@@tmp_rte_pmd_qat@sta/crypto_qat_qat_sym_session.c.o'.
[1805/2195] Compiling C object 'drivers/a715181@@tmp_rte_pmd_qat@sta/compress_qat_qat_comp.c.o'.
[1806/2195] Compiling C object 'drivers/a715181@@tmp_rte_pmd_zlib@sta/compress_zlib_zlib_pmd.c.o'.
[1807/2195] Compiling C object 'drivers/a715181@@tmp_rte_pmd_ifc@sta/vdpa_ifc_ifcvf_vdpa.c.o'.
[1808/2195] Compiling C object 'drivers/a715181@@tmp_rte_pmd_qat@sta/crypto_qat_qat_asym.c.o'.
[1809/2195] Compiling C object 'drivers/a715181@@tmp_rte_pmd_octeontx2_crypto@sta/crypto_octeontx2_otx2_cryptodev_ops.c.o'.
[1810/2195] Compiling C object 'drivers/a715181@@tmp_rte_pmd_octeontx_crypto@sta/crypto_octeontx_otx_cryptodev_ops.c.o'.
ninja: build stopped: subcommand failed




*Meson Build Failed #3:
OS: UB2004-64
Target:./build-gcc-static
FAILED: drivers/a715181@@tmp_rte_pmd_qat@sta/crypto_qat_qat_sym_frame.c.o 
gcc -Idrivers/a715181@@tmp_rte_pmd_qat@sta -Idrivers -I../drivers -Idrivers/compress/qat -I../drivers/compress/qat -Idrivers/common/qat -I../drivers/common/qat -I../drivers/common/qat/qat_adf -Idrivers/crypto/qat -I../drivers/crypto/qat -Ilib/librte_compressdev -I../lib/librte_compressdev -I. -I../ -Iconfig -I../config -Ilib/librte_eal/include -I../lib/librte_eal/include -Ilib/librte_eal/linux/include -I../lib/librte_eal/linux/include -Ilib/librte_eal/x86/include -I../lib/librte_eal/x86/include -Ilib/librte_eal/common -I../lib/librte_eal/common -Ilib/librte_eal -I../lib/librte_eal -Ilib/librte_kvargs -I../lib/librte_kvargs -Ilib/librte_telemetry/../librte_metrics -I../lib/librte_telemetry/../librte_metrics -Ilib/librte_telemetry -I../lib/librte_telemetry -Ilib/librte_mbuf -I../lib/librte_mbuf -Ilib/librte_mempool -I../lib/librte_mempool -Ilib/librte_ring -I../lib/librte_ring -Idrivers/bus/pci -I../drivers/bus/pci -I../drivers/bus/pci/linux -Ilib/librte_pci -I../lib/librte_pci -Ilib/librte_cryptodev -I../lib/librte_cryptodev -fdiagnostics-color=always -pipe -D_FILE_OFFSET_BITS=64 -Wall -Winvalid-pch -Werror -O2 -g -include rte_config.h -Wextra -Wcast-qual -Wdeprecated -Wformat-nonliteral -Wformat-security -Wmissing-declarations -Wmissing-prototypes -Wnested-externs -Wold-style-definition -Wpointer-arith -Wsign-compare -Wstrict-prototypes -Wundef -Wwrite-strings -Wno-address-of-packed-member -Wno-packed-not-aligned -Wno-missing-field-initializers -D_GNU_SOURCE -fPIC -march=native -DALLOW_EXPERIMENTAL_API -DALLOW_INTERNAL_API -Wno-format-truncation -DBUILD_QAT_SYM -DBUILD_QAT_ASYM -MD -MQ 'drivers/a715181@@tmp_rte_pmd_qat@sta/crypto_qat_qat_sym_frame.c.o' -MF 'drivers/a715181@@tmp_rte_pmd_qat@sta/crypto_qat_qat_sym_frame.c.o.d' -o 'drivers/a715181@@tmp_rte_pmd_qat@sta/crypto_qat_qat_sym_frame.c.o' -c ../drivers/crypto/qat/qat_sym_frame.c
../drivers/crypto/qat/qat_sym_frame.c: In function ‘qat_sym_get_qp’:
../drivers/crypto/qat/qat_sym_frame.c:25:7: error: implicit declaration of function ‘rte_cryptodev_get_qp_status’; did you mean ‘rte_cryptodev_get_sec_ctx’? [-Werror=implicit-function-declaration]
   25 |  if (!rte_cryptodev_get_qp_status(dev_id, qp_id))
      |       ^~~~~~~~~~~~~~~~~~~~~~~~~~~
      |       rte_cryptodev_get_sec_ctx
../drivers/crypto/qat/qat_sym_frame.c:25:7: error: nested extern declaration of ‘rte_cryptodev_get_qp_status’ [-Werror=nested-externs]
cc1: all warnings being treated as errors
[1806/2186] Generating rte_pmd_dpaa2_event_def with a custom command.
[1807/2186] Compiling C object 'drivers/a715181@@tmp_rte_pmd_qat@sta/crypto_qat_qat_sym_session.c.o'.
[1808/2186] Compiling C object 'drivers/a715181@@tmp_rte_pmd_ifc@sta/vdpa_ifc_ifcvf_vdpa.c.o'.
[1809/2186] Compiling C object 'drivers/a715181@@tmp_rte_pmd_dpaa_event@sta/event_dpaa_dpaa_eventdev.c.o'.
[1810/2186] Generating symbol file 'drivers/a715181@@rte_pmd_dpaa_sec@sha/librte_pmd_dpaa_sec.so.20.0.3.symbols'.
[1811/2186] Compiling C object 'drivers/a715181@@tmp_rte_pmd_zlib@sta/compress_zlib_zlib_pmd.c.o'.
[1812/2186] Compiling C object 'drivers/a715181@@tmp_rte_pmd_dpaa2_event@sta/event_dpaa2_dpaa2_hw_dpcon.c.o'.
[1813/2186] Compiling C object 'drivers/a715181@@tmp_rte_pmd_dpaa2_event@sta/event_dpaa2_dpaa2_eventdev_selftest.c.o'.
[1814/2186] Compiling C object 'drivers/a715181@@tmp_rte_pmd_qat@sta/crypto_qat_qat_asym.c.o'.
[1815/2186] Compiling C object 'drivers/a715181@@tmp_rte_pmd_dpaa2_event@sta/event_dpaa2_dpaa2_eventdev.c.o'.
[1816/2186] Compiling C object 'drivers/a715181@@tmp_rte_pmd_octeontx_crypto@sta/crypto_octeontx_otx_cryptodev_ops.c.o'.
ninja: build stopped: subcommand failed



*Makefile Build Failed #1:
OS: CENTOS77-64
Target: x86_64-native-linuxapp-gcc
  CC init.o
/root/CENTOS77-64_K3.10.0_GCC4.8.5/x86_64-native-linuxapp-gcc/c6768c00774d4a6685fb166b5322995d/dpdk/x86_64-native-linuxapp-gcc/lib/librte_pmd_qat.a(qat_sym_frame.o): In function `qat_sym_get_qp':
qat_sym_frame.c:(.text.experimental+0x16): undefined reference to `rte_cryptodev_get_qp_status'
collect2: error: ld returned 1 exit status
make[5]: *** [testacl] Error 1
make[4]: *** [test-acl] Error 2
make[4]: *** Waiting for unfinished jobs....
  CC parameters.o
  CC test_byteorder.o
--
  CC runtime.o
/root/CENTOS77-64_K3.10.0_GCC4.8.5/x86_64-native-linuxapp-gcc/c6768c00774d4a6685fb166b5322995d/dpdk/x86_64-native-linuxapp-gcc/lib/librte_pmd_qat.a(qat_sym_frame.o): In function `qat_sym_get_qp':
qat_sym_frame.c:(.text.experimental+0x16): undefined reference to `rte_cryptodev_get_qp_status'
collect2: error: ld returned 1 exit status
make[5]: *** [testsad] Error 1
make[4]: *** [test-sad] Error 2
/root/CENTOS77-64_K3.10.0_GCC4.8.5/x86_64-native-linuxapp-gcc/c6768c00774d4a6685fb166b5322995d/dpdk/x86_64-native-linuxapp-gcc/lib/librte_pmd_qat.a(qat_sym_frame.o): In function `qat_sym_get_qp':
qat_sym_frame.c:(.text.experimental+0x16): undefined reference to `rte_cryptodev_get_qp_status'
collect2: error: ld returned 1 exit status
make[5]: *** [cmdline_test] Error 1
make[4]: *** [test-cmdline] Error 2
  CC pipeline_stub.o
  CC test_atomic.o
/root/CENTOS77-64_K3.10.0_GCC4.8.5/x86_64-native-linuxapp-gcc/c6768c00774d4a6685fb166b5322995d/dpdk/x86_64-native-linuxapp-gcc/lib/librte_pmd_qat.a(qat_sym_frame.o): In function `qat_sym_get_qp':
qat_sym_frame.c:(.text.experimental+0x16): undefined reference to `rte_cryptodev_get_qp_status'
collect2: error: ld returned 1 exit status
make[5]: *** [dpdk-procinfo] Error 1
make[4]: *** [proc-info] Error 2
  CC test_barrier.o
  CC test_malloc.o
/root/CENTOS77-64_K3.10.0_GCC4.8.5/x86_64-native-linuxapp-gcc/c6768c00774d4a6685fb166b5322995d/dpdk/x86_64-native-linuxapp-gcc/lib/librte_pmd_qat.a(qat_sym_frame.o): In function `qat_sym_get_qp':
qat_sym_frame.c:(.text.experimental+0x16): undefined reference to `rte_cryptodev_get_qp_status'
collect2: error: ld returned 1 exit status
make[5]: *** [testfib] Error 1
make[4]: *** [test-fib] Error 2
  CC pipeline_hash.o
/root/CENTOS77-64_K3.10.0_GCC4.8.5/x86_64-native-linuxapp-gcc/c6768c00774d4a6685fb166b5322995d/dpdk/x86_64-native-linuxapp-gcc/lib/librte_pmd_qat.a(qat_sym_frame.o): In function `qat_sym_get_qp':
qat_sym_frame.c:(.text.experimental+0x16): undefined reference to `rte_cryptodev_get_qp_status'
collect2: error: ld returned 1 exit status
make[5]: *** [dpdk-pdump] Error 1
  CC test_cycles.o
  CC cmdline.o
make[4]: *** [pdump] Error 2
  CC pipeline_lpm.o
  CC cmdline_flow.o
  CC cmdline_mtr.o
--
  CC test_fbarray.o
/root/CENTOS77-64_K3.10.0_GCC4.8.5/x86_64-native-linuxapp-gcc/c6768c00774d4a6685fb166b5322995d/dpdk/x86_64-native-linuxapp-gcc/lib/librte_pmd_qat.a(qat_sym_frame.o): In function `qat_sym_get_qp':
qat_sym_frame.c:(.text.experimental+0x16): undefined reference to `rte_cryptodev_get_qp_status'
collect2: error: ld returned 1 exit status
make[5]: *** [testpipeline] Error 1
make[4]: *** [test-pipeline] Error 2
  CC noisy_vnf.o
  CC test_external_mem.o
  CC bpf_cmd.o
--
  CC test_table_tables.o
/root/CENTOS77-64_K3.10.0_GCC4.8.5/x86_64-native-linuxapp-gcc/c6768c00774d4a6685fb166b5322995d/dpdk/x86_64-native-linuxapp-gcc/lib/librte_pmd_qat.a(qat_sym_frame.o): In function `qat_sym_get_qp':
qat_sym_frame.c:(.text.experimental+0x16): undefined reference to `rte_cryptodev_get_qp_status'
collect2: error: ld returned 1 exit status
make[5]: *** [testbbdev] Error 1
make[4]: *** [test-bbdev] Error 2
  LD testpmd
  CC test_table_ports.o
  CC test_table_combined.o
--
  CC test_timer.o
/root/CENTOS77-64_K3.10.0_GCC4.8.5/x86_64-native-linuxapp-gcc/c6768c00774d4a6685fb166b5322995d/dpdk/x86_64-native-linuxapp-gcc/lib/librte_pmd_qat.a(qat_sym_frame.o): In function `qat_sym_get_qp':
qat_sym_frame.c:(.text.experimental+0x16): undefined reference to `rte_cryptodev_get_qp_status'
collect2: error: ld returned 1 exit status
make[5]: *** [testpmd] Error 1
make[4]: *** [test-pmd] Error 2
  CC test_timer_perf.o
  CC test_timer_racecond.o
  CC test_timer_secondary.o
--
  LD test
/root/CENTOS77-64_K3.10.0_GCC4.8.5/x86_64-native-linuxapp-gcc/c6768c00774d4a6685fb166b5322995d/dpdk/x86_64-native-linuxapp-gcc/lib/librte_pmd_qat.a(qat_sym_frame.o): In function `qat_sym_get_qp':
qat_sym_frame.c:(.text.experimental+0x16): undefined reference to `rte_cryptodev_get_qp_status'
collect2: error: ld returned 1 exit status
make[5]: *** [test] Error 1
make[4]: *** [test] Error 2
make[3]: *** [app] Error 2
make[2]: *** [all] Error 2
make[1]: *** [pre_install] Error 2
make: *** [install] Error 2


*Makefile Build Failed #2:
OS: CENTOS82-64
Target: x86_64-native-linuxapp-gcc
  CC resource.o
/root/CENTOS82-64_K4.18.0_GCC8.3.1/x86_64-native-linuxapp-gcc/c6768c00774d4a6685fb166b5322995d/dpdk/x86_64-native-linuxapp-gcc/lib/librte_pmd_qat.a(qat_sym_frame.o): In function `qat_sym_get_qp':
qat_sym_frame.c:(.text.experimental+0x16): undefined reference to `rte_cryptodev_get_qp_status'
collect2: error: ld returned 1 exit status
make[5]: *** [/root/CENTOS82-64_K4.18.0_GCC8.3.1/x86_64-native-linuxapp-gcc/c6768c00774d4a6685fb166b5322995d/dpdk/mk/rte.app.mk:454: cmdline_test] Error 1
make[4]: *** [/root/CENTOS82-64_K4.18.0_GCC8.3.1/x86_64-native-linuxapp-gcc/c6768c00774d4a6685fb166b5322995d/dpdk/mk/rte.subdir.mk:37: test-cmdline] Error 2
make[4]: *** Waiting for unfinished jobs....
  CC test_resource.o
  CC test_prefetch.o
/root/CENTOS82-64_K4.18.0_GCC8.3.1/x86_64-native-linuxapp-gcc/c6768c00774d4a6685fb166b5322995d/dpdk/x86_64-native-linuxapp-gcc/lib/librte_pmd_qat.a(qat_sym_frame.o): In function `qat_sym_get_qp':
qat_sym_frame.c:(.text.experimental+0x16): undefined reference to `rte_cryptodev_get_qp_status'
collect2: error: ld returned 1 exit status
make[5]: *** [/root/CENTOS82-64_K4.18.0_GCC8.3.1/x86_64-native-linuxapp-gcc/c6768c00774d4a6685fb166b5322995d/dpdk/mk/rte.app.mk:454: testacl] Error 1
make[4]: *** [/root/CENTOS82-64_K4.18.0_GCC8.3.1/x86_64-native-linuxapp-gcc/c6768c00774d4a6685fb166b5322995d/dpdk/mk/rte.subdir.mk:37: test-acl] Error 2
  CC runtime.o
/root/CENTOS82-64_K4.18.0_GCC8.3.1/x86_64-native-linuxapp-gcc/c6768c00774d4a6685fb166b5322995d/dpdk/x86_64-native-linuxapp-gcc/lib/librte_pmd_qat.a(qat_sym_frame.o): In function `qat_sym_get_qp':
qat_sym_frame.c:(.text.experimental+0x16): undefined reference to `rte_cryptodev_get_qp_status'
collect2: error: ld returned 1 exit status
  CC test_byteorder.o
make[5]: *** [/root/CENTOS82-64_K4.18.0_GCC8.3.1/x86_64-native-linuxapp-gcc/c6768c00774d4a6685fb166b5322995d/dpdk/mk/rte.app.mk:454: testsad] Error 1
make[4]: *** [/root/CENTOS82-64_K4.18.0_GCC8.3.1/x86_64-native-linuxapp-gcc/c6768c00774d4a6685fb166b5322995d/dpdk/mk/rte.subdir.mk:37: test-sad] Error 2
  CC test_per_lcore.o
  CC pipeline_stub.o
/root/CENTOS82-64_K4.18.0_GCC8.3.1/x86_64-native-linuxapp-gcc/c6768c00774d4a6685fb166b5322995d/dpdk/x86_64-native-linuxapp-gcc/lib/librte_pmd_qat.a(qat_sym_frame.o): In function `qat_sym_get_qp':
qat_sym_frame.c:(.text.experimental+0x16): undefined reference to `rte_cryptodev_get_qp_status'
collect2: error: ld returned 1 exit status
make[5]: *** [/root/CENTOS82-64_K4.18.0_GCC8.3.1/x86_64-native-linuxapp-gcc/c6768c00774d4a6685fb166b5322995d/dpdk/mk/rte.app.mk:454: dpdk-procinfo] Error 1
make[4]: *** [/root/CENTOS82-64_K4.18.0_GCC8.3.1/x86_64-native-linuxapp-gcc/c6768c00774d4a6685fb166b5322995d/dpdk/mk/rte.subdir.mk:37: proc-info] Error 2
  CC test_atomic.o
  CC pipeline_hash.o
  CC pipeline_lpm.o
  CC test_barrier.o
/root/CENTOS82-64_K4.18.0_GCC8.3.1/x86_64-native-linuxapp-gcc/c6768c00774d4a6685fb166b5322995d/dpdk/x86_64-native-linuxapp-gcc/lib/librte_pmd_qat.a(qat_sym_frame.o): In function `qat_sym_get_qp':
qat_sym_frame.c:(.text.experimental+0x16): undefined reference to `rte_cryptodev_get_qp_status'
collect2: error: ld returned 1 exit status
make[5]: *** [/root/CENTOS82-64_K4.18.0_GCC8.3.1/x86_64-native-linuxapp-gcc/c6768c00774d4a6685fb166b5322995d/dpdk/mk/rte.app.mk:454: dpdk-pdump] Error 1
make[4]: *** [/root/CENTOS82-64_K4.18.0_GCC8.3.1/x86_64-native-linuxapp-gcc/c6768c00774d4a6685fb166b5322995d/dpdk/mk/rte.subdir.mk:37: pdump] Error 2
  CC test_malloc.o
  CC test_cycles.o
  CC pipeline_lpm_ipv6.o
  CC parameters.o
/root/CENTOS82-64_K4.18.0_GCC8.3.1/x86_64-native-linuxapp-gcc/c6768c00774d4a6685fb166b5322995d/dpdk/x86_64-native-linuxapp-gcc/lib/librte_pmd_qat.a(qat_sym_frame.o): In function `qat_sym_get_qp':
qat_sym_frame.c:(.text.experimental+0x16): undefined reference to `rte_cryptodev_get_qp_status'
collect2: error: ld returned 1 exit status
make[5]: *** [/root/CENTOS82-64_K4.18.0_GCC8.3.1/x86_64-native-linuxapp-gcc/c6768c00774d4a6685fb166b5322995d/dpdk/mk/rte.app.mk:454: testfib] Error 1
make[4]: *** [/root/CENTOS82-64_K4.18.0_GCC8.3.1/x86_64-native-linuxapp-gcc/c6768c00774d4a6685fb166b5322995d/dpdk/mk/rte.subdir.mk:37: test-fib] Error 2
  CC cmdline.o
  CC pipeline_acl.o
  CC test_mcslock.o
--
  CC test_ring_hts_stress.o
/root/CENTOS82-64_K4.18.0_GCC8.3.1/x86_64-native-linuxapp-gcc/c6768c00774d4a6685fb166b5322995d/dpdk/x86_64-native-linuxapp-gcc/lib/librte_pmd_qat.a(qat_sym_frame.o): In function `qat_sym_get_qp':
qat_sym_frame.c:(.text.experimental+0x16): undefined reference to `rte_cryptodev_get_qp_status'
collect2: error: ld returned 1 exit status
make[5]: *** [/root/CENTOS82-64_K4.18.0_GCC8.3.1/x86_64-native-linuxapp-gcc/c6768c00774d4a6685fb166b5322995d/dpdk/mk/rte.app.mk:454: testpipeline] Error 1
make[4]: *** [/root/CENTOS82-64_K4.18.0_GCC8.3.1/x86_64-native-linuxapp-gcc/c6768c00774d4a6685fb166b5322995d/dpdk/mk/rte.subdir.mk:37: test-pipeline] Error 2
  CC test_ring_perf.o
  CC macswap.o
  CC test_ring_peek_stress.o
--
  CC test_timer.o
/root/CENTOS82-64_K4.18.0_GCC8.3.1/x86_64-native-linuxapp-gcc/c6768c00774d4a6685fb166b5322995d/dpdk/x86_64-native-linuxapp-gcc/lib/librte_pmd_qat.a(qat_sym_frame.o): In function `qat_sym_get_qp':
qat_sym_frame.c:(.text.experimental+0x16): undefined reference to `rte_cryptodev_get_qp_status'
collect2: error: ld returned 1 exit status
make[5]: *** [/root/CENTOS82-64_K4.18.0_GCC8.3.1/x86_64-native-linuxapp-gcc/c6768c00774d4a6685fb166b5322995d/dpdk/mk/rte.app.mk:454: testbbdev] Error 1
make[4]: *** [/root/CENTOS82-64_K4.18.0_GCC8.3.1/x86_64-native-linuxapp-gcc/c6768c00774d4a6685fb166b5322995d/dpdk/mk/rte.subdir.mk:37: test-bbdev] Error 2
  CC test_timer_perf.o
  CC test_timer_racecond.o
  CC test_timer_secondary.o
--
  CC test_trace.o
/root/CENTOS82-64_K4.18.0_GCC8.3.1/x86_64-native-linuxapp-gcc/c6768c00774d4a6685fb166b5322995d/dpdk/x86_64-native-linuxapp-gcc/lib/librte_pmd_qat.a(qat_sym_frame.o): In function `qat_sym_get_qp':
qat_sym_frame.c:(.text.experimental+0x16): undefined reference to `rte_cryptodev_get_qp_status'
collect2: error: ld returned 1 exit status
make[5]: *** [/root/CENTOS82-64_K4.18.0_GCC8.3.1/x86_64-native-linuxapp-gcc/c6768c00774d4a6685fb166b5322995d/dpdk/mk/rte.app.mk:454: testpmd] Error 1
make[4]: *** [/root/CENTOS82-64_K4.18.0_GCC8.3.1/x86_64-native-linuxapp-gcc/c6768c00774d4a6685fb166b5322995d/dpdk/mk/rte.subdir.mk:37: test-pmd] Error 2
  CC test_service_cores.o
  CC sample_packet_forward.o
  CC test_bitratestats.o
--
  LD test
/root/CENTOS82-64_K4.18.0_GCC8.3.1/x86_64-native-linuxapp-gcc/c6768c00774d4a6685fb166b5322995d/dpdk/x86_64-native-linuxapp-gcc/lib/librte_pmd_qat.a(qat_sym_frame.o): In function `qat_sym_get_qp':
qat_sym_frame.c:(.text.experimental+0x16): undefined reference to `rte_cryptodev_get_qp_status'
collect2: error: ld returned 1 exit status
make[5]: *** [/root/CENTOS82-64_K4.18.0_GCC8.3.1/x86_64-native-linuxapp-gcc/c6768c00774d4a6685fb166b5322995d/dpdk/mk/rte.app.mk:454: test] Error 1
make[4]: *** [/root/CENTOS82-64_K4.18.0_GCC8.3.1/x86_64-native-linuxapp-gcc/c6768c00774d4a6685fb166b5322995d/dpdk/mk/rte.subdir.mk:37: test] Error 2
make[3]: *** [/root/CENTOS82-64_K4.18.0_GCC8.3.1/x86_64-native-linuxapp-gcc/c6768c00774d4a6685fb166b5322995d/dpdk/mk/rte.sdkbuild.mk:53: app] Error 2
make[2]: *** [/root/CENTOS82-64_K4.18.0_GCC8.3.1/x86_64-native-linuxapp-gcc/c6768c00774d4a6685fb166b5322995d/dpdk/mk/rte.sdkroot.mk:99: all] Error 2
make[1]: *** [/root/CENTOS82-64_K4.18.0_GCC8.3.1/x86_64-native-linuxapp-gcc/c6768c00774d4a6685fb166b5322995d/dpdk/mk/rte.sdkinstall.mk:61: pre_install] Error 2
make: *** [/root/CENTOS82-64_K4.18.0_GCC8.3.1/x86_64-native-linuxapp-gcc/c6768c00774d4a6685fb166b5322995d/dpdk/mk/rte.sdkroot.mk:77: install] Error 2


*Makefile Build Failed #3:
OS: CENTOS82-64
Target: x86_64-native-linuxapp-clang
qat_sym_frame.c:(.text.experimental+0xe): undefined reference to `rte_cryptodev_get_qp_status'
/root/CENTOS82-64_K4.18.0_Clang7.0.1/x86_64-native-linuxapp-clang/c6768c00774d4a6685fb166b5322995d/dpdk/x86_64-native-linuxapp-clang/lib/librte_pmd_qat.a(qat_sym_frame.o): In function `qat_sym_get_qp':
qat_sym_frame.c:(.text.experimental+0xe): undefined reference to `rte_cryptodev_get_qp_status'
clang-9: error: linker command failed with exit code 1 (use -v to see invocation)
make[5]: *** [/root/CENTOS82-64_K4.18.0_Clang7.0.1/x86_64-native-linuxapp-clang/c6768c00774d4a6685fb166b5322995d/dpdk/mk/rte.app.mk:454: cmdline_test] Error 1
make[4]: *** [/root/CENTOS82-64_K4.18.0_Clang7.0.1/x86_64-native-linuxapp-clang/c6768c00774d4a6685fb166b5322995d/dpdk/mk/rte.subdir.mk:37: test-cmdline] Error 2
make[4]: *** Waiting for unfinished jobs....
  CC parameters.o
clang-9: error: linker command failed with exit code 1 (use -v to see invocation)
/root/CENTOS82-64_K4.18.0_Clang7.0.1/x86_64-native-linuxapp-clang/c6768c00774d4a6685fb166b5322995d/dpdk/x86_64-native-linuxapp-clang/lib/librte_pmd_qat.a(qat_sym_frame.o): In function `qat_sym_get_qp':
qat_sym_frame.c:(.text.experimental+0xe): undefined reference to `rte_cryptodev_get_qp_status'
make[5]: *** [/root/CENTOS82-64_K4.18.0_Clang7.0.1/x86_64-native-linuxapp-clang/c6768c00774d4a6685fb166b5322995d/dpdk/mk/rte.app.mk:454: testacl] Error 1
make[4]: *** [/root/CENTOS82-64_K4.18.0_Clang7.0.1/x86_64-native-linuxapp-clang/c6768c00774d4a6685fb166b5322995d/dpdk/mk/rte.subdir.mk:37: test-acl] Error 2
  CC init.o
/root/CENTOS82-64_K4.18.0_Clang7.0.1/x86_64-native-linuxapp-clang/c6768c00774d4a6685fb166b5322995d/dpdk/x86_64-native-linuxapp-clang/lib/librte_pmd_qat.a(qat_sym_frame.o): In function `qat_sym_get_qp':
qat_sym_frame.c:(.text.experimental+0xe): undefined reference to `rte_cryptodev_get_qp_status'
/root/CENTOS82-64_K4.18.0_Clang7.0.1/x86_64-native-linuxapp-clang/c6768c00774d4a6685fb166b5322995d/dpdk/x86_64-native-linuxapp-clang/lib/librte_pmd_qat.a(qat_sym_frame.o): In function `qat_sym_get_qp':
qat_sym_frame.c:(.text.experimental+0xe): undefined reference to `rte_cryptodev_get_qp_status'
  CC resource.o
clang-9: error: linker command failed with exit code 1 (use -v to see invocation)
make[5]: *** [/root/CENTOS82-64_K4.18.0_Clang7.0.1/x86_64-native-linuxapp-clang/c6768c00774d4a6685fb166b5322995d/dpdk/mk/rte.app.mk:454: testsad] Error 1
make[4]: *** [/root/CENTOS82-64_K4.18.0_Clang7.0.1/x86_64-native-linuxapp-clang/c6768c00774d4a6685fb166b5322995d/dpdk/mk/rte.subdir.mk:37: test-sad] Error 2
  CC runtime.o
clang-9: error: linker command failed with exit code 1 (use -v to see invocation)
make[5]: *** [/root/CENTOS82-64_K4.18.0_Clang7.0.1/x86_64-native-linuxapp-clang/c6768c00774d4a6685fb166b5322995d/dpdk/mk/rte.app.mk:454: dpdk-procinfo] Error 1
make[4]: *** [/root/CENTOS82-64_K4.18.0_Clang7.0.1/x86_64-native-linuxapp-clang/c6768c00774d4a6685fb166b5322995d/dpdk/mk/rte.subdir.mk:37: proc-info] Error 2
  CC pipeline_stub.o
clang-9: error: linker command failed with exit code 1 (use -v to see invocation)
make[5]: *** [/root/CENTOS82-64_K4.18.0_Clang7.0.1/x86_64-native-linuxapp-clang/c6768c00774d4a6685fb166b5322995d/dpdk/mk/rte.app.mk:454: dpdk-pdump] Error 1
make[4]: *** [/root/CENTOS82-64_K4.18.0_Clang7.0.1/x86_64-native-linuxapp-clang/c6768c00774d4a6685fb166b5322995d/dpdk/mk/rte.subdir.mk:37: pdump] Error 2
  CC pipeline_hash.o
  LD testfib
  CC test_bbdev_perf.o
--
qat_sym_frame.c:(.text.experimental+0xe): undefined reference to `rte_cryptodev_get_qp_status'
  CC cmdline.o
  CC test_prefetch.o
clang-9: error: linker command failed with exit code 1 (use -v to see invocation)
make[5]: *** [/root/CENTOS82-64_K4.18.0_Clang7.0.1/x86_64-native-linuxapp-clang/c6768c00774d4a6685fb166b5322995d/dpdk/mk/rte.app.mk:454: testfib] Error 1
make[4]: *** [/root/CENTOS82-64_K4.18.0_Clang7.0.1/x86_64-native-linuxapp-clang/c6768c00774d4a6685fb166b5322995d/dpdk/mk/rte.subdir.mk:37: test-fib] Error 2
  CC test_byteorder.o
  CC pipeline_lpm_ipv6.o
  CC test_per_lcore.o
--
qat_sym_frame.c:(.text.experimental+0xe): undefined reference to `rte_cryptodev_get_qp_status'
  CC test_ticketlock.o
  CC macswap.o
clang-9: error: linker command failed with exit code 1 (use -v to see invocation)
make[5]: *** [/root/CENTOS82-64_K4.18.0_Clang7.0.1/x86_64-native-linuxapp-clang/c6768c00774d4a6685fb166b5322995d/dpdk/mk/rte.app.mk:454: testpipeline] Error 1
make[4]: *** [/root/CENTOS82-64_K4.18.0_Clang7.0.1/x86_64-native-linuxapp-clang/c6768c00774d4a6685fb166b5322995d/dpdk/mk/rte.subdir.mk:37: test-pipeline] Error 2
  CC test_memory.o
  CC flowgen.o
  CC test_memzone.o
--
  CC test_flow_classify.o
/root/CENTOS82-64_K4.18.0_Clang7.0.1/x86_64-native-linuxapp-clang/c6768c00774d4a6685fb166b5322995d/dpdk/x86_64-native-linuxapp-clang/lib/librte_pmd_qat.a(qat_sym_frame.o): In function `qat_sym_get_qp':
qat_sym_frame.c:(.text.experimental+0xe): undefined reference to `rte_cryptodev_get_qp_status'
clang-9: error: linker command failed with exit code 1 (use -v to see invocation)
make[5]: *** [/root/CENTOS82-64_K4.18.0_Clang7.0.1/x86_64-native-linuxapp-clang/c6768c00774d4a6685fb166b5322995d/dpdk/mk/rte.app.mk:454: testbbdev] Error 1
make[4]: *** [/root/CENTOS82-64_K4.18.0_Clang7.0.1/x86_64-native-linuxapp-clang/c6768c00774d4a6685fb166b5322995d/dpdk/mk/rte.subdir.mk:37: test-bbdev] Error 2
  CC test_rwlock.o
  LD testpmd
  CC test_stack.o
--
  CC test_timer_perf.o
/root/CENTOS82-64_K4.18.0_Clang7.0.1/x86_64-native-linuxapp-clang/c6768c00774d4a6685fb166b5322995d/dpdk/x86_64-native-linuxapp-clang/lib/librte_pmd_qat.a(qat_sym_frame.o): In function `qat_sym_get_qp':
qat_sym_frame.c:(.text.experimental+0xe): undefined reference to `rte_cryptodev_get_qp_status'
clang-9: error: linker command failed with exit code 1 (use -v to see invocation)
make[5]: *** [/root/CENTOS82-64_K4.18.0_Clang7.0.1/x86_64-native-linuxapp-clang/c6768c00774d4a6685fb166b5322995d/dpdk/mk/rte.app.mk:454: testpmd] Error 1
make[4]: *** [/root/CENTOS82-64_K4.18.0_Clang7.0.1/x86_64-native-linuxapp-clang/c6768c00774d4a6685fb166b5322995d/dpdk/mk/rte.subdir.mk:37: test-pmd] Error 2
  CC test_timer_racecond.o
  CC test_timer_secondary.o
  CC test_mempool.o
--
  LD test
/root/CENTOS82-64_K4.18.0_Clang7.0.1/x86_64-native-linuxapp-clang/c6768c00774d4a6685fb166b5322995d/dpdk/x86_64-native-linuxapp-clang/lib/librte_pmd_qat.a(qat_sym_frame.o): In function `qat_sym_get_qp':
qat_sym_frame.c:(.text.experimental+0xe): undefined reference to `rte_cryptodev_get_qp_status'
clang-9: error: linker command failed with exit code 1 (use -v to see invocation)
make[5]: *** [/root/CENTOS82-64_K4.18.0_Clang7.0.1/x86_64-native-linuxapp-clang/c6768c00774d4a6685fb166b5322995d/dpdk/mk/rte.app.mk:454: test] Error 1
make[4]: *** [/root/CENTOS82-64_K4.18.0_Clang7.0.1/x86_64-native-linuxapp-clang/c6768c00774d4a6685fb166b5322995d/dpdk/mk/rte.subdir.mk:37: test] Error 2
make[3]: *** [/root/CENTOS82-64_K4.18.0_Clang7.0.1/x86_64-native-linuxapp-clang/c6768c00774d4a6685fb166b5322995d/dpdk/mk/rte.sdkbuild.mk:53: app] Error 2
make[2]: *** [/root/CENTOS82-64_K4.18.0_Clang7.0.1/x86_64-native-linuxapp-clang/c6768c00774d4a6685fb166b5322995d/dpdk/mk/rte.sdkroot.mk:99: all] Error 2
make[1]: *** [/root/CENTOS82-64_K4.18.0_Clang7.0.1/x86_64-native-linuxapp-clang/c6768c00774d4a6685fb166b5322995d/dpdk/mk/rte.sdkinstall.mk:61: pre_install] Error 2
make: *** [/root/CENTOS82-64_K4.18.0_Clang7.0.1/x86_64-native-linuxapp-clang/c6768c00774d4a6685fb166b5322995d/dpdk/mk/rte.sdkroot.mk:77: install] Error 2


*Makefile Build Failed #4:
OS: CENTOS82-64
Target: x86_64-native-linuxapp-icc
qat_sym_frame.c:(.text.experimental+0x16): undefined reference to `rte_cryptodev_get_qp_status'
/root/CENTOS82-64_K4.18.0_ICC19.1.1/x86_64-native-linuxapp-icc/c6768c00774d4a6685fb166b5322995d/dpdk/x86_64-native-linuxapp-icc/lib/librte_pmd_qat.a(qat_sym_frame.o): In function `qat_sym_get_qp':
qat_sym_frame.c:(.text.experimental+0x16): undefined reference to `rte_cryptodev_get_qp_status'
make[5]: *** [/root/CENTOS82-64_K4.18.0_ICC19.1.1/x86_64-native-linuxapp-icc/c6768c00774d4a6685fb166b5322995d/dpdk/mk/rte.app.mk:454: testsad] Error 1
make[4]: *** [/root/CENTOS82-64_K4.18.0_ICC19.1.1/x86_64-native-linuxapp-icc/c6768c00774d4a6685fb166b5322995d/dpdk/mk/rte.subdir.mk:35: test-sad] Error 2
make[4]: *** Waiting for unfinished jobs....
  CC test_prefetch.o
/root/CENTOS82-64_K4.18.0_ICC19.1.1/x86_64-native-linuxapp-icc/c6768c00774d4a6685fb166b5322995d/dpdk/x86_64-native-linuxapp-icc/lib/librte_pmd_qat.a(qat_sym_frame.o): In function `qat_sym_get_qp':
qat_sym_frame.c:(.text.experimental+0x16): undefined reference to `rte_cryptodev_get_qp_status'
make[5]: *** [/root/CENTOS82-64_K4.18.0_ICC19.1.1/x86_64-native-linuxapp-icc/c6768c00774d4a6685fb166b5322995d/dpdk/mk/rte.app.mk:454: testacl] Error 1
make[4]: *** [/root/CENTOS82-64_K4.18.0_ICC19.1.1/x86_64-native-linuxapp-icc/c6768c00774d4a6685fb166b5322995d/dpdk/mk/rte.subdir.mk:35: test-acl] Error 2
  CC test_byteorder.o
/root/CENTOS82-64_K4.18.0_ICC19.1.1/x86_64-native-linuxapp-icc/c6768c00774d4a6685fb166b5322995d/dpdk/x86_64-native-linuxapp-icc/lib/librte_pmd_qat.a(qat_sym_frame.o): In function `qat_sym_get_qp':
qat_sym_frame.c:(.text.experimental+0x16): undefined reference to `rte_cryptodev_get_qp_status'
  CC test_per_lcore.o
make[5]: *** [/root/CENTOS82-64_K4.18.0_ICC19.1.1/x86_64-native-linuxapp-icc/c6768c00774d4a6685fb166b5322995d/dpdk/mk/rte.app.mk:454: dpdk-procinfo] Error 1
make[4]: *** [/root/CENTOS82-64_K4.18.0_ICC19.1.1/x86_64-native-linuxapp-icc/c6768c00774d4a6685fb166b5322995d/dpdk/mk/rte.subdir.mk:35: proc-info] Error 2
  CC test_atomic.o
make[5]: *** [/root/CENTOS82-64_K4.18.0_ICC19.1.1/x86_64-native-linuxapp-icc/c6768c00774d4a6685fb166b5322995d/dpdk/mk/rte.app.mk:454: cmdline_test] Error 1
make[4]: *** [/root/CENTOS82-64_K4.18.0_ICC19.1.1/x86_64-native-linuxapp-icc/c6768c00774d4a6685fb166b5322995d/dpdk/mk/rte.subdir.mk:35: test-cmdline] Error 2
  CC pipeline_stub.o
  CC test_barrier.o
  CC pipeline_hash.o
--
/root/CENTOS82-64_K4.18.0_ICC19.1.1/x86_64-native-linuxapp-icc/c6768c00774d4a6685fb166b5322995d/dpdk/x86_64-native-linuxapp-icc/lib/librte_pmd_qat.a(qat_sym_frame.o): In function `qat_sym_get_qp':
qat_sym_frame.c:(.text.experimental+0x16): undefined reference to `rte_cryptodev_get_qp_status'
  CC pipeline_lpm.o
make[5]: *** [/root/CENTOS82-64_K4.18.0_ICC19.1.1/x86_64-native-linuxapp-icc/c6768c00774d4a6685fb166b5322995d/dpdk/mk/rte.app.mk:454: testfib] Error 1
make[4]: *** [/root/CENTOS82-64_K4.18.0_ICC19.1.1/x86_64-native-linuxapp-icc/c6768c00774d4a6685fb166b5322995d/dpdk/mk/rte.subdir.mk:35: test-fib] Error 2
  CC test_mcslock.o
  CC pipeline_lpm_ipv6.o
  CC test_spinlock.o
--
  CC test_ring_mpmc_stress.o
  CC test_ring_hts_stress.o
  CC cmdline_tm.o
make[5]: *** [/root/CENTOS82-64_K4.18.0_ICC19.1.1/x86_64-native-linuxapp-icc/c6768c00774d4a6685fb166b5322995d/dpdk/mk/rte.app.mk:454: dpdk-pdump] Error 1
make[4]: *** [/root/CENTOS82-64_K4.18.0_ICC19.1.1/x86_64-native-linuxapp-icc/c6768c00774d4a6685fb166b5322995d/dpdk/mk/rte.subdir.mk:35: pdump] Error 2
  CC test_bbdev_vector.o
/root/CENTOS82-64_K4.18.0_ICC19.1.1/x86_64-native-linuxapp-icc/c6768c00774d4a6685fb166b5322995d/dpdk/x86_64-native-linuxapp-icc/lib/librte_pmd_qat.a(qat_sym_frame.o): In function `qat_sym_get_qp':
qat_sym_frame.c:(.text.experimental+0x16): undefined reference to `rte_cryptodev_get_qp_status'
  CC config.o
make[5]: *** [/root/CENTOS82-64_K4.18.0_ICC19.1.1/x86_64-native-linuxapp-icc/c6768c00774d4a6685fb166b5322995d/dpdk/mk/rte.app.mk:454: testpipeline] Error 1
make[4]: *** [/root/CENTOS82-64_K4.18.0_ICC19.1.1/x86_64-native-linuxapp-icc/c6768c00774d4a6685fb166b5322995d/dpdk/mk/rte.subdir.mk:35: test-pipeline] Error 2
  CC iofwd.o
  CC test_ring_perf.o
  CC test_ring_peek_stress.o
--
  CC test_mbuf.o
/root/CENTOS82-64_K4.18.0_ICC19.1.1/x86_64-native-linuxapp-icc/c6768c00774d4a6685fb166b5322995d/dpdk/x86_64-native-linuxapp-icc/lib/librte_pmd_qat.a(qat_sym_frame.o): In function `qat_sym_get_qp':
qat_sym_frame.c:(.text.experimental+0x16): undefined reference to `rte_cryptodev_get_qp_status'
make[5]: *** [/root/CENTOS82-64_K4.18.0_ICC19.1.1/x86_64-native-linuxapp-icc/c6768c00774d4a6685fb166b5322995d/dpdk/mk/rte.app.mk:454: testpmd] Error 1
make[4]: *** [/root/CENTOS82-64_K4.18.0_ICC19.1.1/x86_64-native-linuxapp-icc/c6768c00774d4a6685fb166b5322995d/dpdk/mk/rte.subdir.mk:35: test-pmd] Error 2
  CC test_logs.o
  CC test_memcpy.o
  CC test_memcpy_perf.o
--
  CC test_fib6_perf.o
/root/CENTOS82-64_K4.18.0_ICC19.1.1/x86_64-native-linuxapp-icc/c6768c00774d4a6685fb166b5322995d/dpdk/x86_64-native-linuxapp-icc/lib/librte_pmd_qat.a(qat_sym_frame.o): In function `qat_sym_get_qp':
qat_sym_frame.c:(.text.experimental+0x16): undefined reference to `rte_cryptodev_get_qp_status'
make[5]: *** [/root/CENTOS82-64_K4.18.0_ICC19.1.1/x86_64-native-linuxapp-icc/c6768c00774d4a6685fb166b5322995d/dpdk/mk/rte.app.mk:454: testbbdev] Error 1
make[4]: *** [/root/CENTOS82-64_K4.18.0_ICC19.1.1/x86_64-native-linuxapp-icc/c6768c00774d4a6685fb166b5322995d/dpdk/mk/rte.subdir.mk:35: test-bbdev] Error 2
  CC test_lpm.o
  CC test_lpm_perf.o
  CC test_lpm6.o
--
  LD test
/root/CENTOS82-64_K4.18.0_ICC19.1.1/x86_64-native-linuxapp-icc/c6768c00774d4a6685fb166b5322995d/dpdk/x86_64-native-linuxapp-icc/lib/librte_pmd_qat.a(qat_sym_frame.o): In function `qat_sym_get_qp':
qat_sym_frame.c:(.text.experimental+0x16): undefined reference to `rte_cryptodev_get_qp_status'
make[5]: *** [/root/CENTOS82-64_K4.18.0_ICC19.1.1/x86_64-native-linuxapp-icc/c6768c00774d4a6685fb166b5322995d/dpdk/mk/rte.app.mk:454: test] Error 1
make[4]: *** [/root/CENTOS82-64_K4.18.0_ICC19.1.1/x86_64-native-linuxapp-icc/c6768c00774d4a6685fb166b5322995d/dpdk/mk/rte.subdir.mk:35: test] Error 2
make[3]: *** [/root/CENTOS82-64_K4.18.0_ICC19.1.1/x86_64-native-linuxapp-icc/c6768c00774d4a6685fb166b5322995d/dpdk/mk/rte.sdkbuild.mk:53: app] Error 2
make[2]: *** [/root/CENTOS82-64_K4.18.0_ICC19.1.1/x86_64-native-linuxapp-icc/c6768c00774d4a6685fb166b5322995d/dpdk/mk/rte.sdkroot.mk:99: all] Error 2
make[1]: *** [/root/CENTOS82-64_K4.18.0_ICC19.1.1/x86_64-native-linuxapp-icc/c6768c00774d4a6685fb166b5322995d/dpdk/mk/rte.sdkinstall.mk:61: pre_install] Error 2
make: *** [/root/CENTOS82-64_K4.18.0_ICC19.1.1/x86_64-native-linuxapp-icc/c6768c00774d4a6685fb166b5322995d/dpdk/mk/rte.sdkroot.mk:77: install] Error 2


*Makefile Build Failed #5:
OS: CENTOS82-64
Target: x86_64-native-linuxapp-gcc+shared
  LD otx_zip_pmd.o
qat_sym_frame.o: In function `qat_sym_get_qp':
qat_sym_frame.c:(.text.experimental+0x16): undefined reference to `rte_cryptodev_get_qp_status'
collect2: error: ld returned 1 exit status
  INSTALL-LIB librte_pmd_bbdev_fpga_5gnr_fec.so.1
make[5]: *** [/root/CENTOS82-64_K4.18.0_GCC8.3.1/x86_64-native-linuxapp-gcc+shared/c6768c00774d4a6685fb166b5322995d/dpdk/mk/rte.lib.mk:100: librte_pmd_qat.so.20.0.3] Error 1
make[4]: *** [/root/CENTOS82-64_K4.18.0_GCC8.3.1/x86_64-native-linuxapp-gcc+shared/c6768c00774d4a6685fb166b5322995d/dpdk/mk/rte.subdir.mk:35: common/qat] Error 2
make[4]: *** Waiting for unfinished jobs....
  CC otx2_cryptodev.o
== Build drivers/net/axgbe
--
  CC medford2_nic.o
  LD librte_pmd_sfc_efx.so.20.0.3
  INSTALL-LIB librte_pmd_sfc_efx.so.20.0.3
make[3]: *** [/root/CENTOS82-64_K4.18.0_GCC8.3.1/x86_64-native-linuxapp-gcc+shared/c6768c00774d4a6685fb166b5322995d/dpdk/mk/rte.sdkbuild.mk:51: drivers] Error 2
make[2]: *** [/root/CENTOS82-64_K4.18.0_GCC8.3.1/x86_64-native-linuxapp-gcc+shared/c6768c00774d4a6685fb166b5322995d/dpdk/mk/rte.sdkroot.mk:99: all] Error 2
make[1]: *** [/root/CENTOS82-64_K4.18.0_GCC8.3.1/x86_64-native-linuxapp-gcc+shared/c6768c00774d4a6685fb166b5322995d/dpdk/mk/rte.sdkinstall.mk:61: pre_install] Error 2
make: *** [/root/CENTOS82-64_K4.18.0_GCC8.3.1/x86_64-native-linuxapp-gcc+shared/c6768c00774d4a6685fb166b5322995d/dpdk/mk/rte.sdkroot.mk:77: install] Error 2


*Makefile Build Failed #6:
OS: CENTOS82-64
Target: x86_64-native-linuxapp-gcc+debug
  LD cmdline_test
/root/CENTOS82-64_K4.18.0_GCC8.3.1/x86_64-native-linuxapp-gcc+debug/c6768c00774d4a6685fb166b5322995d/dpdk/x86_64-native-linuxapp-gcc/lib/librte_pmd_qat.a(qat_sym_frame.o): In function `qat_sym_get_qp':
qat_sym_frame.c:(.text.experimental+0x16): undefined reference to `rte_cryptodev_get_qp_status'
collect2: error: ld returned 1 exit status
make[5]: *** [/root/CENTOS82-64_K4.18.0_GCC8.3.1/x86_64-native-linuxapp-gcc+debug/c6768c00774d4a6685fb166b5322995d/dpdk/mk/rte.app.mk:454: dpdk-procinfo] Error 1
make[4]: *** [/root/CENTOS82-64_K4.18.0_GCC8.3.1/x86_64-native-linuxapp-gcc+debug/c6768c00774d4a6685fb166b5322995d/dpdk/mk/rte.subdir.mk:35: proc-info] Error 2
make[4]: *** Waiting for unfinished jobs....
  CC test.o
  LD testsad
  CC init.o
/root/CENTOS82-64_K4.18.0_GCC8.3.1/x86_64-native-linuxapp-gcc+debug/c6768c00774d4a6685fb166b5322995d/dpdk/x86_64-native-linuxapp-gcc/lib/librte_pmd_qat.a(qat_sym_frame.o): In function `qat_sym_get_qp':
qat_sym_frame.c:(.text.experimental+0x16): undefined reference to `rte_cryptodev_get_qp_status'
collect2: error: ld returned 1 exit status
make[5]: *** [/root/CENTOS82-64_K4.18.0_GCC8.3.1/x86_64-native-linuxapp-gcc+debug/c6768c00774d4a6685fb166b5322995d/dpdk/mk/rte.app.mk:454: dpdk-pdump] Error 1
make[4]: *** [/root/CENTOS82-64_K4.18.0_GCC8.3.1/x86_64-native-linuxapp-gcc+debug/c6768c00774d4a6685fb166b5322995d/dpdk/mk/rte.subdir.mk:35: pdump] Error 2
  CC runtime.o
  CC pipeline_stub.o
/root/CENTOS82-64_K4.18.0_GCC8.3.1/x86_64-native-linuxapp-gcc+debug/c6768c00774d4a6685fb166b5322995d/dpdk/x86_64-native-linuxapp-gcc/lib/librte_pmd_qat.a(qat_sym_frame.o): In function `qat_sym_get_qp':
qat_sym_frame.c:(.text.experimental+0x16): undefined reference to `rte_cryptodev_get_qp_status'
collect2: error: ld returned 1 exit status
make[5]: *** [/root/CENTOS82-64_K4.18.0_GCC8.3.1/x86_64-native-linuxapp-gcc+debug/c6768c00774d4a6685fb166b5322995d/dpdk/mk/rte.app.mk:454: cmdline_test] Error 1
/root/CENTOS82-64_K4.18.0_GCC8.3.1/x86_64-native-linuxapp-gccmake[4]: *** [/root/CENTOS82-64_K4.18.0_GCC8.3.1/x86_64-native-linuxapp-gcc+debug/c6768c00774d4a6685fb166b5322995d/dpdk/mk/rte.subdir.mk:35: test-cmdline] Error 2
+debug/c6768c00774d4a6685fb166b5322995d/dpdk/x86_64-native-linuxapp-gcc/lib/librte_pmd_qat.a(qat_sym_frame.o): In function `qat_sym_get_qp':
qat_sym_frame.c:(.text.experimental+0x16): undefined reference to `rte_cryptodev_get_qp_status'
collect2: error: ld returned 1 exit status
  CC pipeline_hash.o
make[5]: *** [/root/CENTOS82-64_K4.18.0_GCC8.3.1/x86_64-native-linuxapp-gcc+debug/c6768c00774d4a6685fb166b5322995d/dpdk/mk/rte.app.mk:454: testacl] Error 1
  CC resource.o
make[4]: *** [/root/CENTOS82-64_K4.18.0_GCC8.3.1/x86_64-native-linuxapp-gcc+debug/c6768c00774d4a6685fb166b5322995d/dpdk/mk/rte.subdir.mk:35: test-acl] Error 2
  CC pipeline_lpm.o
  CC test_bbdev_perf.o
/root/CENTOS82-64_K4.18.0_GCC8.3.1/x86_64-native-linuxapp-gcc+debug/c6768c00774d4a6685fb166b5322995d/dpdk/x86_64-native-linuxapp-gcc/lib/librte_pmd_qat.a(qat_sym_frame.o): In function `qat_sym_get_qp':
qat_sym_frame.c:(.text.experimental+0x16): undefined reference to `rte_cryptodev_get_qp_status'
collect2: error: ld returned 1 exit status
make[5]: *** [/root/CENTOS82-64_K4.18.0_GCC8.3.1/x86_64-native-linuxapp-gcc+debug/c6768c00774d4a6685fb166b5322995d/dpdk/mk/rte.app.mk:454: testsad] Error 1
  LD testfib
make[4]: *** [/root/CENTOS82-64_K4.18.0_GCC8.3.1/x86_64-native-linuxapp-gcc+debug/c6768c00774d4a6685fb166b5322995d/dpdk/mk/rte.subdir.mk:35: test-sad] Error 2
  CC parameters.o
  CC test_bbdev_vector.o
  CC pipeline_lpm_ipv6.o
--
  CC cmdline_flow.o
/root/CENTOS82-64_K4.18.0_GCC8.3.1/x86_64-native-linuxapp-gcc+debug/c6768c00774d4a6685fb166b5322995d/dpdk/x86_64-native-linuxapp-gcc/lib/librte_pmd_qat.a(qat_sym_frame.o): In function `qat_sym_get_qp':
qat_sym_frame.c:(.text.experimental+0x16): undefined reference to `rte_cryptodev_get_qp_status'
collect2: error: ld returned 1 exit status
make[5]: *** [/root/CENTOS82-64_K4.18.0_GCC8.3.1/x86_64-native-linuxapp-gcc+debug/c6768c00774d4a6685fb166b5322995d/dpdk/mk/rte.app.mk:454: testfib] Error 1
make[4]: *** [/root/CENTOS82-64_K4.18.0_GCC8.3.1/x86_64-native-linuxapp-gcc+debug/c6768c00774d4a6685fb166b5322995d/dpdk/mk/rte.subdir.mk:35: test-fib] Error 2
  CC cmdline_mtr.o
  CC test_cycles.o
  CC test_mcslock.o
--
  CC test_fbarray.o
/root/CENTOS82-64_K4.18.0_GCC8.3.1/x86_64-native-linuxapp-gcc+debug/c6768c00774d4a6685fb166b5322995d/dpdk/x86_64-native-linuxapp-gcc/lib/librte_pmd_qat.a(qat_sym_frame.o): In function `qat_sym_get_qp':
qat_sym_frame.c:(.text.experimental+0x16): undefined reference to `rte_cryptodev_get_qp_status'
collect2: error: ld returned 1 exit status
make[5]: *** [/root/CENTOS82-64_K4.18.0_GCC8.3.1/x86_64-native-linuxapp-gcc+debug/c6768c00774d4a6685fb166b5322995d/dpdk/mk/rte.app.mk:454: testpipeline] Error 1
make[4]: *** [/root/CENTOS82-64_K4.18.0_GCC8.3.1/x86_64-native-linuxapp-gcc+debug/c6768c00774d4a6685fb166b5322995d/dpdk/mk/rte.subdir.mk:35: test-pipeline] Error 2
  CC test_external_mem.o
  CC test_rand_perf.o
  CC test_ring.o
--
  CC test_table_tables.o
/root/CENTOS82-64_K4.18.0_GCC8.3.1/x86_64-native-linuxapp-gcc+debug/c6768c00774d4a6685fb166b5322995d/dpdk/x86_64-native-linuxapp-gcc/lib/librte_pmd_qat.a(qat_sym_frame.o): In function `qat_sym_get_qp':
qat_sym_frame.c:(.text.experimental+0x16): undefined reference to `rte_cryptodev_get_qp_status'
collect2: error: ld returned 1 exit status
make[5]: *** [/root/CENTOS82-64_K4.18.0_GCC8.3.1/x86_64-native-linuxapp-gcc+debug/c6768c00774d4a6685fb166b5322995d/dpdk/mk/rte.app.mk:454: testbbdev] Error 1
make[4]: *** [/root/CENTOS82-64_K4.18.0_GCC8.3.1/x86_64-native-linuxapp-gcc+debug/c6768c00774d4a6685fb166b5322995d/dpdk/mk/rte.subdir.mk:35: test-bbdev] Error 2
  CC test_table_ports.o
  CC test_table_combined.o
  CC test_table_acl.o
--
  CC test_efd.o
/root/CENTOS82-64_K4.18.0_GCC8.3.1/x86_64-native-linuxapp-gcc+debug/c6768c00774d4a6685fb166b5322995d/dpdk/x86_64-native-linuxapp-gcc/lib/librte_pmd_qat.a(qat_sym_frame.o): In function `qat_sym_get_qp':
qat_sym_frame.c:(.text.experimental+0x16): undefined reference to `rte_cryptodev_get_qp_status'
collect2: error: ld returned 1 exit status
make[5]: *** [/root/CENTOS82-64_K4.18.0_GCC8.3.1/x86_64-native-linuxapp-gcc+debug/c6768c00774d4a6685fb166b5322995d/dpdk/mk/rte.app.mk:454: testpmd] Error 1
make[4]: *** [/root/CENTOS82-64_K4.18.0_GCC8.3.1/x86_64-native-linuxapp-gcc+debug/c6768c00774d4a6685fb166b5322995d/dpdk/mk/rte.subdir.mk:35: test-pmd] Error 2
  CC test_efd_perf.o
  CC test_hash.o
  CC test_thash.o
--
  LD test
/root/CENTOS82-64_K4.18.0_GCC8.3.1/x86_64-native-linuxapp-gcc+debug/c6768c00774d4a6685fb166b5322995d/dpdk/x86_64-native-linuxapp-gcc/lib/librte_pmd_qat.a(qat_sym_frame.o): In function `qat_sym_get_qp':
qat_sym_frame.c:(.text.experimental+0x16): undefined reference to `rte_cryptodev_get_qp_status'
collect2: error: ld returned 1 exit status
make[5]: *** [/root/CENTOS82-64_K4.18.0_GCC8.3.1/x86_64-native-linuxapp-gcc+debug/c6768c00774d4a6685fb166b5322995d/dpdk/mk/rte.app.mk:454: test] Error 1
make[4]: *** [/root/CENTOS82-64_K4.18.0_GCC8.3.1/x86_64-native-linuxapp-gcc+debug/c6768c00774d4a6685fb166b5322995d/dpdk/mk/rte.subdir.mk:35: test] Error 2
make[3]: *** [/root/CENTOS82-64_K4.18.0_GCC8.3.1/x86_64-native-linuxapp-gcc+debug/c6768c00774d4a6685fb166b5322995d/dpdk/mk/rte.sdkbuild.mk:53: app] Error 2
make[2]: *** [/root/CENTOS82-64_K4.18.0_GCC8.3.1/x86_64-native-linuxapp-gcc+debug/c6768c00774d4a6685fb166b5322995d/dpdk/mk/rte.sdkroot.mk:99: all] Error 2
make[1]: *** [/root/CENTOS82-64_K4.18.0_GCC8.3.1/x86_64-native-linuxapp-gcc+debug/c6768c00774d4a6685fb166b5322995d/dpdk/mk/rte.sdkinstall.mk:61: pre_install] Error 2
make: *** [/root/CENTOS82-64_K4.18.0_GCC8.3.1/x86_64-native-linuxapp-gcc+debug/c6768c00774d4a6685fb166b5322995d/dpdk/mk/rte.sdkroot.mk:77: install] Error 2


*Makefile Build Failed #7:
OS: FC32-64
Target: x86_64-native-linuxapp-gcc
  CC test_per_lcore.o
/usr/bin/ld: /root/FC32-64_K5.6.0_GCC10.0.1/x86_64-native-linuxapp-gcc/c6768c00774d4a6685fb166b5322995d/dpdk/x86_64-native-linuxapp-gcc/lib/librte_pmd_qat.a(qat_sym_frame.o): in function `qat_sym_get_qp':
qat_sym_frame.c:(.text.experimental+0x14): undefined reference to `rte_cryptodev_get_qp_status'
collect2: error: ld returned 1 exit status
make[5]: *** [/root/FC32-64_K5.6.0_GCC10.0.1/x86_64-native-linuxapp-gcc/c6768c00774d4a6685fb166b5322995d/dpdk/mk/rte.app.mk:454: cmdline_test] Error 1
make[4]: *** [/root/FC32-64_K5.6.0_GCC10.0.1/x86_64-native-linuxapp-gcc/c6768c00774d4a6685fb166b5322995d/dpdk/mk/rte.subdir.mk:37: test-cmdline] Error 2
make[4]: *** Waiting for unfinished jobs....
  CC pipeline_stub.o
  CC test_atomic.o
/usr/bin/ld: /root/FC32-64_K5.6.0_GCC10.0.1/x86_64-native-linuxapp-gcc/c6768c00774d4a6685fb166b5322995d/dpdk/x86_64-native-linuxapp-gcc/lib/librte_pmd_qat.a(qat_sym_frame.o): in function `qat_sym_get_qp':
qat_sym_frame.c:(.text.experimental+0x14): undefined reference to `rte_cryptodev_get_qp_status'
collect2: error: ld returned 1 exit status
collect2: error: ld returned 1 exit status
make[5]: *** [/root/FC32-64_K5.6.0_GCC10.0.1/x86_64-native-linuxapp-gcc/c6768c00774d4a6685fb166b5322995d/dpdk/mk/rte.app.mk:454: testacl] Error 1
make[5]: *** [/root/FC32-64_K5.6.0_GCC10.0.1/x86_64-native-linuxapp-gcc/c6768c00774d4a6685fb166b5322995d/dpdk/mk/rte.app.mk:454: testsad] Error 1
make[4]: *** [/root/FC32-64_K5.6.0_GCC10.0.1/x86_64-native-linuxapp-gcc/c6768c00774d4a6685fb166b5322995d/dpdk/mk/rte.subdir.mk:37: test-acl] Error 2
make[4]: *** [/root/FC32-64_K5.6.0_GCC10.0.1/x86_64-native-linuxapp-gcc/c6768c00774d4a6685fb166b5322995d/dpdk/mk/rte.subdir.mk:37: test-sad] Error 2
  CC parameters.o
  CC test_bbdev_vector.o
collect2: error: ld returned 1 exit status
make[5]: *** [/root/FC32-64_K5.6.0_GCC10.0.1/x86_64-native-linuxapp-gcc/c6768c00774d4a6685fb166b5322995d/dpdk/mk/rte.app.mk:454: dpdk-procinfo] Error 1
make[4]: *** [/root/FC32-64_K5.6.0_GCC10.0.1/x86_64-native-linuxapp-gcc/c6768c00774d4a6685fb166b5322995d/dpdk/mk/rte.subdir.mk:37: proc-info] Error 2
  CC cmdline.o
  CC test_barrier.o
collect2: error: ld returned 1 exit status
make[5]: *** [/root/FC32-64_K5.6.0_GCC10.0.1/x86_64-native-linuxapp-gcc/c6768c00774d4a6685fb166b5322995d/dpdk/mk/rte.app.mk:454: dpdk-pdump] Error 1
make[4]: *** [/root/FC32-64_K5.6.0_GCC10.0.1/x86_64-native-linuxapp-gcc/c6768c00774d4a6685fb166b5322995d/dpdk/mk/rte.subdir.mk:37: pdump] Error 2
  CC test_malloc.o
  CC pipeline_hash.o
/usr/bin/ld: /root/FC32-64_K5.6.0_GCC10.0.1/x86_64-native-linuxapp-gcc/c6768c00774d4a6685fb166b5322995d/dpdk/x86_64-native-linuxapp-gcc/lib/librte_pmd_qat.a(qat_sym_frame.o): in function `qat_sym_get_qp':
--
  CC pipeline_lpm.o
  CC test_cycles.o
  CC test_mcslock.o
collect2: error: ld returned 1 exit status
make[5]: *** [/root/FC32-64_K5.6.0_GCC10.0.1/x86_64-native-linuxapp-gcc/c6768c00774d4a6685fb166b5322995d/dpdk/mk/rte.app.mk:454: testfib] Error 1
make[4]: *** [/root/FC32-64_K5.6.0_GCC10.0.1/x86_64-native-linuxapp-gcc/c6768c00774d4a6685fb166b5322995d/dpdk/mk/rte.subdir.mk:37: test-fib] Error 2
  CC test_spinlock.o
  CC test_ticketlock.o
  CC test_memory.o
--
/usr/bin/ld: /root/FC32-64_K5.6.0_GCC10.0.1/x86_64-native-linuxapp-gcc/c6768c00774d4a6685fb166b5322995d/dpdk/x86_64-native-linuxapp-gcc/lib/librte_pmd_qat.a(qat_sym_frame.o): in function `qat_sym_get_qp':
qat_sym_frame.c:(.text.experimental+0x14): undefined reference to `rte_cryptodev_get_qp_status'
  CC test_ring_rts_stress.o
collect2: error: ld returned 1 exit status
make[5]: *** [/root/FC32-64_K5.6.0_GCC10.0.1/x86_64-native-linuxapp-gcc/c6768c00774d4a6685fb166b5322995d/dpdk/mk/rte.app.mk:454: testpipeline] Error 1
make[4]: *** [/root/FC32-64_K5.6.0_GCC10.0.1/x86_64-native-linuxapp-gcc/c6768c00774d4a6685fb166b5322995d/dpdk/mk/rte.subdir.mk:37: test-pipeline] Error 2
  CC test_ring_stress.o
  CC test_pmd_perf.o
  CC macswap.o
--
  CC test_mbuf.o
  CC test_logs.o
  CC test_memcpy.o
collect2: error: ld returned 1 exit status
make[5]: *** [/root/FC32-64_K5.6.0_GCC10.0.1/x86_64-native-linuxapp-gcc/c6768c00774d4a6685fb166b5322995d/dpdk/mk/rte.app.mk:454: testbbdev] Error 1
make[4]: *** [/root/FC32-64_K5.6.0_GCC10.0.1/x86_64-native-linuxapp-gcc/c6768c00774d4a6685fb166b5322995d/dpdk/mk/rte.subdir.mk:37: test-bbdev] Error 2
  CC test_memcpy_perf.o
  CC test_member.o
  CC test_member_perf.o
--
  CC test_rib6.o
  CC test_fib.o
  CC test_fib6.o
collect2: error: ld returned 1 exit status
make[5]: *** [/root/FC32-64_K5.6.0_GCC10.0.1/x86_64-native-linuxapp-gcc/c6768c00774d4a6685fb166b5322995d/dpdk/mk/rte.app.mk:454: testpmd] Error 1
make[4]: *** [/root/FC32-64_K5.6.0_GCC10.0.1/x86_64-native-linuxapp-gcc/c6768c00774d4a6685fb166b5322995d/dpdk/mk/rte.subdir.mk:37: test-pmd] Error 2
  CC test_fib_perf.o
  CC test_fib6_perf.o
  CC test_lpm.o
--
  LD test
/usr/bin/ld: /root/FC32-64_K5.6.0_GCC10.0.1/x86_64-native-linuxapp-gcc/c6768c00774d4a6685fb166b5322995d/dpdk/x86_64-native-linuxapp-gcc/lib/librte_pmd_qat.a(qat_sym_frame.o): in function `qat_sym_get_qp':
qat_sym_frame.c:(.text.experimental+0x14): undefined reference to `rte_cryptodev_get_qp_status'
collect2: error: ld returned 1 exit status
make[5]: *** [/root/FC32-64_K5.6.0_GCC10.0.1/x86_64-native-linuxapp-gcc/c6768c00774d4a6685fb166b5322995d/dpdk/mk/rte.app.mk:454: test] Error 1
make[4]: *** [/root/FC32-64_K5.6.0_GCC10.0.1/x86_64-native-linuxapp-gcc/c6768c00774d4a6685fb166b5322995d/dpdk/mk/rte.subdir.mk:37: test] Error 2
make[3]: *** [/root/FC32-64_K5.6.0_GCC10.0.1/x86_64-native-linuxapp-gcc/c6768c00774d4a6685fb166b5322995d/dpdk/mk/rte.sdkbuild.mk:53: app] Error 2
make[2]: *** [/root/FC32-64_K5.6.0_GCC10.0.1/x86_64-native-linuxapp-gcc/c6768c00774d4a6685fb166b5322995d/dpdk/mk/rte.sdkroot.mk:99: all] Error 2
make[1]: *** [/root/FC32-64_K5.6.0_GCC10.0.1/x86_64-native-linuxapp-gcc/c6768c00774d4a6685fb166b5322995d/dpdk/mk/rte.sdkinstall.mk:61: pre_install] Error 2
make: *** [/root/FC32-64_K5.6.0_GCC10.0.1/x86_64-native-linuxapp-gcc/c6768c00774d4a6685fb166b5322995d/dpdk/mk/rte.sdkroot.mk:77: install] Error 2


*Makefile Build Failed #8:
OS: FC32-64
Target: x86_64-native-linuxapp-clang
/usr/bin/ld: /root/FC32-64_K5.6.0_Clang10.0.0/x86_64-native-linuxapp-clang/c6768c00774d4a6685fb166b5322995d/dpdk/x86_64-native-linuxapp-clang/lib/librte_pmd_qat.a(qat_sym_frame.o): in function `qat_sym_get_qp':
qat_sym_frame.c:(.text.experimental+0xe): undefined reference to `rte_cryptodev_get_qp_status'
  LD dpdk-pdump
clang-10: error: linker command failed with exit code 1 (use -v to see invocation)
make[5]: *** [/root/FC32-64_K5.6.0_Clang10.0.0/x86_64-native-linuxapp-clang/c6768c00774d4a6685fb166b5322995d/dpdk/mk/rte.app.mk:454: cmdline_test] Error 1
make[4]: *** [/root/FC32-64_K5.6.0_Clang10.0.0/x86_64-native-linuxapp-clang/c6768c00774d4a6685fb166b5322995d/dpdk/mk/rte.subdir.mk:37: test-cmdline] Error 2
make[4]: *** Waiting for unfinished jobs....
  CC resource.o
/usr/bin/ld: /root/FC32-64_K5.6.0_Clang10.0.0/x86_64-native-linuxapp-clang/c6768c00774d4a6685fb166b5322995d/dpdk/x86_64-native-linuxapp-clang/lib/librte_pmd_qat.a(qat_sym_frame.o): in function `qat_sym_get_qp':
--
qat_sym_frame.c:(.text.experimental+0xe): undefined reference to `rte_cryptodev_get_qp_status'
  CC init.o
  CC test_bbdev_perf.o
clang-10: error: linker command failed with exit code 1 (use -v to see invocation)
make[5]: *** [/root/FC32-64_K5.6.0_Clang10.0.0/x86_64-native-linuxapp-clang/c6768c00774d4a6685fb166b5322995d/dpdk/mk/rte.app.mk:454: dpdk-procinfo] Error 1
make[4]: *** [/root/FC32-64_K5.6.0_Clang10.0.0/x86_64-native-linuxapp-clang/c6768c00774d4a6685fb166b5322995d/dpdk/mk/rte.subdir.mk:37: proc-info] Error 2
  CC parameters.o
clang-10: error: linker command failed with exit code 1 (use -v to see invocation)
make[5]: *** [/root/FC32-64_K5.6.0_Clang10.0.0/x86_64-native-linuxapp-clang/c6768c00774d4a6685fb166b5322995d/dpdk/mk/rte.app.mk:454: testsad] Error 1
make[4]: *** [/root/FC32-64_K5.6.0_Clang10.0.0/x86_64-native-linuxapp-clang/c6768c00774d4a6685fb166b5322995d/dpdk/mk/rte.subdir.mk:37: test-sad] Error 2
  CC cmdline.o
  CC test_resource.o
/usr/bin/ld: /root/FC32-64_K5.6.0_Clang10.0.0/x86_64-native-linuxapp-clang/c6768c00774d4a6685fb166b5322995d/dpdk/x86_64-native-linuxapp-clang/lib/librte_pmd_qat.a(qat_sym_frame.o): in function `qat_sym_get_qp':
qat_sym_frame.c:(.text.experimental+0xe): undefined reference to `rte_cryptodev_get_qp_status'
  CC test_prefetch.o
  CC test_byteorder.o
clang-10: error: linker command failed with exit code 1 (use -v to see invocation)
make[5]: *** [/root/FC32-64_K5.6.0_Clang10.0.0/x86_64-native-linuxapp-clang/c6768c00774d4a6685fb166b5322995d/dpdk/mk/rte.app.mk:454: testacl] Error 1
make[4]: *** [/root/FC32-64_K5.6.0_Clang10.0.0/x86_64-native-linuxapp-clang/c6768c00774d4a6685fb166b5322995d/dpdk/mk/rte.subdir.mk:37: test-acl] Error 2
  CC runtime.o
  LD testfib
  CC pipeline_stub.o
--
qat_sym_frame.c:(.text.experimental+0xe): undefined reference to `rte_cryptodev_get_qp_status'
  CC test_per_lcore.o
  CC test_atomic.o
clang-10: error: linker command failed with exit code 1 (use -v to see invocation)
make[5]: *** [/root/FC32-64_K5.6.0_Clang10.0.0/x86_64-native-linuxapp-clang/c6768c00774d4a6685fb166b5322995d/dpdk/mk/rte.app.mk:454: dpdk-pdump] Error 1
make[4]: *** [/root/FC32-64_K5.6.0_Clang10.0.0/x86_64-native-linuxapp-clang/c6768c00774d4a6685fb166b5322995d/dpdk/mk/rte.subdir.mk:37: pdump] Error 2
  CC test_barrier.o
/usr/bin/ld: /root/FC32-64_K5.6.0_Clang10.0.0/x86_64-native-linuxapp-clang/c6768c00774d4a6685fb166b5322995d/dpdk/x86_64-native-linuxapp-clang/lib/librte_pmd_qat.a(qat_sym_frame.o): in function `qat_sym_get_qp':
qat_sym_frame.c:(.text.experimental+0xe): undefined reference to `rte_cryptodev_get_qp_status'
clang-10: error: linker command failed with exit code 1 (use -v to see invocation)
make[5]: *** [/root/FC32-64_K5.6.0_Clang10.0.0/x86_64-native-linuxapp-clang/c6768c00774d4a6685fb166b5322995d/dpdk/mk/rte.app.mk:454: testfib] Error 1
make[4]: *** [/root/FC32-64_K5.6.0_Clang10.0.0/x86_64-native-linuxapp-clang/c6768c00774d4a6685fb166b5322995d/dpdk/mk/rte.subdir.mk:37: test-fib] Error 2
  CC cmdline_flow.o
  CC cmdline_mtr.o
  CC test_malloc.o
--
/usr/bin/ld: /root/FC32-64_K5.6.0_Clang10.0.0/x86_64-native-linuxapp-clang/c6768c00774d4a6685fb166b5322995d/dpdk/x86_64-native-linuxapp-clang/lib/librte_pmd_qat.a(qat_sym_frame.o): in function `qat_sym_get_qp':
qat_sym_frame.c:(.text.experimental+0xe): undefined reference to `rte_cryptodev_get_qp_status'
  CC test_bitmap.o
clang-10: error: linker command failed with exit code 1 (use -v to see invocation)
make[5]: *** [/root/FC32-64_K5.6.0_Clang10.0.0/x86_64-native-linuxapp-clang/c6768c00774d4a6685fb166b5322995d/dpdk/mk/rte.app.mk:454: testpipeline] Error 1
make[4]: *** [/root/FC32-64_K5.6.0_Clang10.0.0/x86_64-native-linuxapp-clang/c6768c00774d4a6685fb166b5322995d/dpdk/mk/rte.subdir.mk:37: test-pipeline] Error 2
  CC test_reciprocal_division.o
  CC test_reciprocal_division_perf.o
  CC flowgen.o
--
qat_sym_frame.c:(.text.experimental+0xe): undefined reference to `rte_cryptodev_get_qp_status'
  CC test_ring_peek_stress.o
  CC test_ring_rts_stress.o
clang-10: error: linker command failed with exit code 1 (use -v to see invocation)
make[5]: *** [/root/FC32-64_K5.6.0_Clang10.0.0/x86_64-native-linuxapp-clang/c6768c00774d4a6685fb166b5322995d/dpdk/mk/rte.app.mk:454: testbbdev] Error 1
make[4]: *** [/root/FC32-64_K5.6.0_Clang10.0.0/x86_64-native-linuxapp-clang/c6768c00774d4a6685fb166b5322995d/dpdk/mk/rte.subdir.mk:37: test-bbdev] Error 2
  CC test_ring_stress.o
  CC test_pmd_perf.o
  CC test_table.o
--
  CC test_mempool.o
  CC test_mempool_perf.o
  CC test_mbuf.o
clang-10: error: linker command failed with exit code 1 (use -v to see invocation)
make[5]: *** [/root/FC32-64_K5.6.0_Clang10.0.0/x86_64-native-linuxapp-clang/c6768c00774d4a6685fb166b5322995d/dpdk/mk/rte.app.mk:454: testpmd] Error 1
make[4]: *** [/root/FC32-64_K5.6.0_Clang10.0.0/x86_64-native-linuxapp-clang/c6768c00774d4a6685fb166b5322995d/dpdk/mk/rte.subdir.mk:37: test-pmd] Error 2
  CC test_logs.o
  CC test_memcpy.o
  CC test_memcpy_perf.o
--
  LD test
/usr/bin/ld: /root/FC32-64_K5.6.0_Clang10.0.0/x86_64-native-linuxapp-clang/c6768c00774d4a6685fb166b5322995d/dpdk/x86_64-native-linuxapp-clang/lib/librte_pmd_qat.a(qat_sym_frame.o): in function `qat_sym_get_qp':
qat_sym_frame.c:(.text.experimental+0xe): undefined reference to `rte_cryptodev_get_qp_status'
clang-10: error: linker command failed with exit code 1 (use -v to see invocation)
make[5]: *** [/root/FC32-64_K5.6.0_Clang10.0.0/x86_64-native-linuxapp-clang/c6768c00774d4a6685fb166b5322995d/dpdk/mk/rte.app.mk:454: test] Error 1
make[4]: *** [/root/FC32-64_K5.6.0_Clang10.0.0/x86_64-native-linuxapp-clang/c6768c00774d4a6685fb166b5322995d/dpdk/mk/rte.subdir.mk:37: test] Error 2
make[3]: *** [/root/FC32-64_K5.6.0_Clang10.0.0/x86_64-native-linuxapp-clang/c6768c00774d4a6685fb166b5322995d/dpdk/mk/rte.sdkbuild.mk:53: app] Error 2
make[2]: *** [/root/FC32-64_K5.6.0_Clang10.0.0/x86_64-native-linuxapp-clang/c6768c00774d4a6685fb166b5322995d/dpdk/mk/rte.sdkroot.mk:99: all] Error 2
make[1]: *** [/root/FC32-64_K5.6.0_Clang10.0.0/x86_64-native-linuxapp-clang/c6768c00774d4a6685fb166b5322995d/dpdk/mk/rte.sdkinstall.mk:61: pre_install] Error 2
make: *** [/root/FC32-64_K5.6.0_Clang10.0.0/x86_64-native-linuxapp-clang/c6768c00774d4a6685fb166b5322995d/dpdk/mk/rte.sdkroot.mk:77: install] Error 2


*Makefile Build Failed #9:
OS: FreeBSD1201-64
Target: x86_64-native-bsdapp-gcc
awk -f /usr/src/sys/tools/makeobjops.awk /usr/src/sys/kern/bus_if.m -h
awk -f /usr/src/sys/tools/makeobjops.awk /usr/src/sys/dev/pci/pci_if.m -h
Warning: Object directory not changed from original /root/FreeBSD1201-64_K12.1_GCC9.2.0/x86_64-native-bsdapp-gcc/c6768c00774d4a6685fb166b5322995d/dpdk/x86_64-native-bsdapp-gcc/build/kernel/freebsd/contigmem
cc  -Winline -Wall -Werror -include /root/FreeBSD1201-64_K12.1_GCC9.2.0/x86_64-native-bsdapp-gcc/c6768c00774d4a6685fb166b5322995d/dpdk/x86_64-native-bsdapp-gcc/include/rte_config.h  -Werror -D_KERNEL -DKLD_MODULE -nostdinc  -I/root/FreeBSD1201-64_K12.1_GCC9.2.0/x86_64-native-bsdapp-gcc/c6768c00774d4a6685fb166b5322995d/dpdk/kernel/freebsd/contigmem -I/root/FreeBSD1201-64_K12.1_GCC9.2.0/x86_64-native-bsdapp-gcc/c6768c00774d4a6685fb166b5322995d/dpdk/x86_64-native-bsdapp-gcc/include -I. -I/usr/src/sys -I/usr/src/sys/contrib/ck/include -fno-common  -fno-omit-frame-pointer -mno-omit-leaf-frame-pointer -fdebug-prefix-map=./machine=/usr/src/sys/amd64/include -fdebug-prefix-map=./x86=/usr/src/sys/x86/include   -MD  -MF.depend.contigmem.o -MTcontigmem.o -mcmodel=kernel -mno-red-zone -mno-mmx -mno-sse -msoft-float  -fno-asynchronous-unwind-tables -ffreestanding -fwrapv -fstack-protector -Wall -Wredundant-decls -Wnested-externs -Wstrict-prototypes -Wmissing-prototypes -Wpointer-arith -Wcast-qual -Wundef -Wno-pointer-sign -D__printf__=__freebsd_kprintf__ -Wmissing-include-dirs -fdiagnostics-show-option -Wno-unknown-pragmas -Wno-error-tautological-compare -Wno-error-empty-body -Wno-error-parentheses-equality -Wno-error-unused-function -Wno-error-pointer-sign -Wno-error-shift-negative-value -Wno-address-of-packed-member  -mno-aes -mno-avx  -std=iso9899:1999 -c contigmem.c -o contigmem.o
Warning: Object directory not changed from original /root/FreeBSD1201-64_K12.1_GCC9.2.0/x86_64-native-bsdapp-gcc/c6768c00774d4a6685fb166b5322995d/dpdk/x86_64-native-bsdapp-gcc/build/kernel/freebsd/nic_uio
cc  -Winline -Wall -Werror -include /root/FreeBSD1201-64_K12.1_GCC9.2.0/x86_64-native-bsdapp-gcc/c6768c00774d4a6685fb166b5322995d/dpdk/x86_64-native-bsdapp-gcc/include/rte_config.h  -Werror -D_KERNEL -DKLD_MODULE -nostdinc  -I/root/FreeBSD1201-64_K12.1_GCC9.2.0/x86_64-native-bsdapp-gcc/c6768c00774d4a6685fb166b5322995d/dpdk/kernel/freebsd/nic_uio -I/root/FreeBSD1201-64_K12.1_GCC9.2.0/x86_64-native-bsdapp-gcc/c6768c00774d4a6685fb166b5322995d/dpdk/x86_64-native-bsdapp-gcc/include -I. -I/usr/src/sys -I/usr/src/sys/contrib/ck/include -fno-common  -fno-omit-frame-pointer -mno-omit-leaf-frame-pointer -fdebug-prefix-map=./machine=/usr/src/sys/amd64/include -fdebug-prefix-map=./x86=/usr/src/sys/x86/include   -MD  -MF.depend.nic_uio.o -MTnic_uio.o -mcmodel=kernel -mno-red-zone -mno-mmx -mno-sse -msoft-float  -fno-asynchronous-unwind-tables -ffreestanding -fwrapv -fstack-protector -Wall -Wredundant-decls -Wnested-externs -Wstrict-prototypes -Wmissing-prototypes -Wpointer-arith -Wcast-qual -Wundef -Wno-pointer-sign -D__printf__=__freebsd_kprintf__ -Wmissing-include-dirs -fdiagnostics-show-option -Wno-unknown-pragmas -Wno-error-tautological-compare -Wno-error-empty-body -Wno-error-parentheses-equality -Wno-error-unused-function -Wno-error-pointer-sign -Wno-error-shift-negative-value -Wno-address-of-packed-member  -mno-aes -mno-avx  -std=iso9899:1999 -c nic_uio.c -o nic_uio.o
== Build drivers/common
ld -m elf_x86_64_fbsd -L/root/FreeBSD1201-64_K12.1_GCC9.2.0/x86_64-native-bsdapp-gcc/c6768c00774d4a6685fb166b5322995d/dpdk/x86_64-native-bsdapp-gcc/lib -d -warn-common --build-id=sha1 -r -d -o contigmem.ko contigmem.o
:> export_syms
--
  CC config.o
/usr/local/bin/ld: /root/FreeBSD1201-64_K12.1_GCC9.2.0/x86_64-native-bsdapp-gcc/c6768c00774d4a6685fb166b5322995d/dpdk/x86_64-native-bsdapp-gcc/lib/librte_pmd_qat.a(qat_sym_frame.o): in function `qat_sym_get_qp':
qat_sym_frame.c:(.text.experimental+0x16): undefined reference to `rte_cryptodev_get_qp_status'
collect2: error: ld returned 1 exit status
gmake[5]: *** [/root/FreeBSD1201-64_K12.1_GCC9.2.0/x86_64-native-bsdapp-gcc/c6768c00774d4a6685fb166b5322995d/dpdk/mk/rte.app.mk:454: testsad] Error 1
gmake[4]: *** [/root/FreeBSD1201-64_K12.1_GCC9.2.0/x86_64-native-bsdapp-gcc/c6768c00774d4a6685fb166b5322995d/dpdk/mk/rte.subdir.mk:37: test-sad] Error 2
gmake[4]: *** Waiting for unfinished jobs....
/usr/local/bin/ld: /root/FreeBSD1201-64_K12.1_GCC9.2.0/x86_64-native-bsdapp-gcc/c6768c00774d4a6685fb166b5322995d/dpdk/x86_64-native-bsdapp-gcc/lib/librte_pmd_qat.a(qat_sym_frame.o): in function `qat_sym_get_qp':
qat_sym_frame.c:(.text.experimental+0x16): undefined reference to `rte_cryptodev_get_qp_status'
collect2: error: ld returned 1 exit status
gmake[5]: *** [/root/FreeBSD1201-64_K12.1_GCC9.2.0/x86_64-native-bsdapp-gcc/c6768c00774d4a6685fb166b5322995d/dpdk/mk/rte.app.mk:454: cmdline_test] Error 1
gmake[4]: *** [/root/FreeBSD1201-64_K12.1_GCC9.2.0/x86_64-native-bsdapp-gcc/c6768c00774d4a6685fb166b5322995d/dpdk/mk/rte.subdir.mk:37: test-cmdline] Error 2
  CC init.o
  CC comp_perf_options_parse.o
  CC parameters.o
  LD testfib
/usr/local/bin/ld: /root/FreeBSD1201-64_K12.1_GCC9.2.0/x86_64-native-bsdapp-gcc/c6768c00774d4a6685fb166b5322995d/dpdk/x86_64-native-bsdapp-gcc/lib/librte_pmd_qat.a(qat_sym_frame.o): in function `qat_sym_get_qp':
qat_sym_frame.c:(.text.experimental+0x16): undefined reference to `rte_cryptodev_get_qp_status'
collect2: error: ld returned 1 exit status
  CC test.o
gmake[5]: *** [/root/FreeBSD1201-64_K12.1_GCC9.2.0/x86_64-native-bsdapp-gcc/c6768c00774d4a6685fb166b5322995d/dpdk/mk/rte.app.mk:454: dpdk-pdump] Error 1
gmake[4]: *** [/root/FreeBSD1201-64_K12.1_GCC9.2.0/x86_64-native-bsdapp-gcc/c6768c00774d4a6685fb166b5322995d/dpdk/mk/rte.subdir.mk:37: pdump] Error 2
/usr/local/bin/ld: /root/FreeBSD1201-64_K12.1_GCC9.2.0/x86_64-native-bsdapp-gcc/c6768c00774d4a6685fb166b5322995d/dpdk/x86_64-native-bsdapp-gcc/lib/librte_pmd_qat.a(qat_sym_frame.o): in function `qat_sym_get_qp':
qat_sym_frame.c:(.text.experimental+0x16): undefined reference to `rte_cryptodev_get_qp_status'
collect2: error: ld returned 1 exit status
gmake[5]: *** [/root/FreeBSD1201-64_K12.1_GCC9.2.0/x86_64-native-bsdapp-gcc/c6768c00774d4a6685fb166b5322995d/dpdk/mk/rte.app.mk:454: testacl] Error 1
gmake[4]: *** [/root/FreeBSD1201-64_K12.1_GCC9.2.0/x86_64-native-bsdapp-gcc/c6768c00774d4a6685fb166b5322995d/dpdk/mk/rte.subdir.mk:37: test-acl] Error 2
  CC comp_perf_test_throughput.o
  CC runtime.o
  CC cmdline.o
--
  CC resource.o
/usr/local/bin/ld: /root/FreeBSD1201-64_K12.1_GCC9.2.0/x86_64-native-bsdapp-gcc/c6768c00774d4a6685fb166b5322995d/dpdk/x86_64-native-bsdapp-gcc/lib/librte_pmd_qat.a(qat_sym_frame.o): in function `qat_sym_get_qp':
qat_sym_frame.c:(.text.experimental+0x16): undefined reference to `rte_cryptodev_get_qp_status'
collect2: error: ld returned 1 exit status
gmake[5]: *** [/root/FreeBSD1201-64_K12.1_GCC9.2.0/x86_64-native-bsdapp-gcc/c6768c00774d4a6685fb166b5322995d/dpdk/mk/rte.app.mk:454: testfib] Error 1
gmake[4]: *** [/root/FreeBSD1201-64_K12.1_GCC9.2.0/x86_64-native-bsdapp-gcc/c6768c00774d4a6685fb166b5322995d/dpdk/mk/rte.subdir.mk:37: test-fib] Error 2
  CC pipeline_stub.o
  CC test_resource.o
  CC comp_perf_test_cyclecount.o
--
  CC iofwd.o
/usr/local/bin/ld: /root/FreeBSD1201-64_K12.1_GCC9.2.0/x86_64-native-bsdapp-gcc/c6768c00774d4a6685fb166b5322995d/dpdk/x86_64-native-bsdapp-gcc/lib/librte_pmd_qat.a(qat_sym_frame.o): in function `qat_sym_get_qp':
qat_sym_frame.c:(.text.experimental+0x16): undefined reference to `rte_cryptodev_get_qp_status'
collect2: error: ld returned 1 exit status
gmake[5]: *** [/root/FreeBSD1201-64_K12.1_GCC9.2.0/x86_64-native-bsdapp-gcc/c6768c00774d4a6685fb166b5322995d/dpdk/mk/rte.app.mk:454: dpdk-test-compress-perf] Error 1
gmake[4]: *** [/root/FreeBSD1201-64_K12.1_GCC9.2.0/x86_64-native-bsdapp-gcc/c6768c00774d4a6685fb166b5322995d/dpdk/mk/rte.subdir.mk:37: test-compress-perf] Error 2
  CC macfwd.o
  CC macswap.o
  CC test_cycles.o
--
  CC test_memory.o
/usr/local/bin/ld: /root/FreeBSD1201-64_K12.1_GCC9.2.0/x86_64-native-bsdapp-gcc/c6768c00774d4a6685fb166b5322995d/dpdk/x86_64-native-bsdapp-gcc/lib/librte_pmd_qat.a(qat_sym_frame.o): in function `qat_sym_get_qp':
qat_sym_frame.c:(.text.experimental+0x16): undefined reference to `rte_cryptodev_get_qp_status'
collect2: error: ld returned 1 exit status
gmake[5]: *** [/root/FreeBSD1201-64_K12.1_GCC9.2.0/x86_64-native-bsdapp-gcc/c6768c00774d4a6685fb166b5322995d/dpdk/mk/rte.app.mk:454: testpipeline] Error 1
gmake[4]: *** [/root/FreeBSD1201-64_K12.1_GCC9.2.0/x86_64-native-bsdapp-gcc/c6768c00774d4a6685fb166b5322995d/dpdk/mk/rte.subdir.mk:37: test-pipeline] Error 2
  CC txonly.o
  CC test_bitmap.o
  CC test_memzone.o
--
  CC test_stack.o
/usr/local/bin/ld: /root/FreeBSD1201-64_K12.1_GCC9.2.0/x86_64-native-bsdapp-gcc/c6768c00774d4a6685fb166b5322995d/dpdk/x86_64-native-bsdapp-gcc/lib/librte_pmd_qat.a(qat_sym_frame.o): in function `qat_sym_get_qp':
qat_sym_frame.c:(.text.experimental+0x16): undefined reference to `rte_cryptodev_get_qp_status'
collect2: error: ld returned 1 exit status
gmake[5]: *** [/root/FreeBSD1201-64_K12.1_GCC9.2.0/x86_64-native-bsdapp-gcc/c6768c00774d4a6685fb166b5322995d/dpdk/mk/rte.app.mk:454: testbbdev] Error 1
gmake[4]: *** [/root/FreeBSD1201-64_K12.1_GCC9.2.0/x86_64-native-bsdapp-gcc/c6768c00774d4a6685fb166b5322995d/dpdk/mk/rte.subdir.mk:37: test-bbdev] Error 2
  CC test_stack_perf.o
  CC test_timer.o
  CC test_timer_perf.o
  CC test_timer_racecond.o
/usr/local/bin/ld: /root/FreeBSD1201-64_K12.1_GCC9.2.0/x86_64-native-bsdapp-gcc/c6768c00774d4a6685fb166b5322995d/dpdk/x86_64-native-bsdapp-gcc/lib/librte_pmd_qat.a(qat_sym_frame.o): in function `qat_sym_get_qp':
qat_sym_frame.c:(.text.experimental+0x16): undefined reference to `rte_cryptodev_get_qp_status'
collect2: error: ld returned 1 exit status
  CC test_timer_secondary.o
gmake[5]: *** [/root/FreeBSD1201-64_K12.1_GCC9.2.0/x86_64-native-bsdapp-gcc/c6768c00774d4a6685fb166b5322995d/dpdk/mk/rte.app.mk:454: testpmd] Error 1
gmake[4]: *** [/root/FreeBSD1201-64_K12.1_GCC9.2.0/x86_64-native-bsdapp-gcc/c6768c00774d4a6685fb166b5322995d/dpdk/mk/rte.subdir.mk:37: test-pmd] Error 2
  CC test_mempool_perf.o
  CC test_mempool.o
  CC test_mbuf.o
--
  LD test
/usr/local/bin/ld: /root/FreeBSD1201-64_K12.1_GCC9.2.0/x86_64-native-bsdapp-gcc/c6768c00774d4a6685fb166b5322995d/dpdk/x86_64-native-bsdapp-gcc/lib/librte_pmd_qat.a(qat_sym_frame.o): in function `qat_sym_get_qp':
qat_sym_frame.c:(.text.experimental+0x16): undefined reference to `rte_cryptodev_get_qp_status'
collect2: error: ld returned 1 exit status
gmake[5]: *** [/root/FreeBSD1201-64_K12.1_GCC9.2.0/x86_64-native-bsdapp-gcc/c6768c00774d4a6685fb166b5322995d/dpdk/mk/rte.app.mk:454: test] Error 1
gmake[4]: *** [/root/FreeBSD1201-64_K12.1_GCC9.2.0/x86_64-native-bsdapp-gcc/c6768c00774d4a6685fb166b5322995d/dpdk/mk/rte.subdir.mk:37: test] Error 2
gmake[3]: *** [/root/FreeBSD1201-64_K12.1_GCC9.2.0/x86_64-native-bsdapp-gcc/c6768c00774d4a6685fb166b5322995d/dpdk/mk/rte.sdkbuild.mk:53: app] Error 2
gmake[2]: *** [/root/FreeBSD1201-64_K12.1_GCC9.2.0/x86_64-native-bsdapp-gcc/c6768c00774d4a6685fb166b5322995d/dpdk/mk/rte.sdkroot.mk:99: all] Error 2
gmake[1]: *** [/root/FreeBSD1201-64_K12.1_GCC9.2.0/x86_64-native-bsdapp-gcc/c6768c00774d4a6685fb166b5322995d/dpdk/mk/rte.sdkinstall.mk:61: pre_install] Error 2
gmake: *** [/root/FreeBSD1201-64_K12.1_GCC9.2.0/x86_64-native-bsdapp-gcc/c6768c00774d4a6685fb166b5322995d/dpdk/mk/rte.sdkroot.mk:77: install] Error 2


*Makefile Build Failed #10:
OS: FreeBSD1201-64
Target: x86_64-native-bsdapp-clang
awk -f /usr/src/sys/tools/makeobjops.awk /usr/src/sys/kern/bus_if.m -h
awk -f /usr/src/sys/tools/makeobjops.awk /usr/src/sys/dev/pci/pci_if.m -h
Warning: Object directory not changed from original /root/FreeBSD1201-64_K12.1_Clang8.0.1/x86_64-native-bsdapp-clang/c6768c00774d4a6685fb166b5322995d/dpdk/x86_64-native-bsdapp-clang/build/kernel/freebsd/contigmem
cc  -Winline -Wall -Werror -include /root/FreeBSD1201-64_K12.1_Clang8.0.1/x86_64-native-bsdapp-clang/c6768c00774d4a6685fb166b5322995d/dpdk/x86_64-native-bsdapp-clang/include/rte_config.h  -Werror -D_KERNEL -DKLD_MODULE -nostdinc  -I/root/FreeBSD1201-64_K12.1_Clang8.0.1/x86_64-native-bsdapp-clang/c6768c00774d4a6685fb166b5322995d/dpdk/kernel/freebsd/contigmem -I/root/FreeBSD1201-64_K12.1_Clang8.0.1/x86_64-native-bsdapp-clang/c6768c00774d4a6685fb166b5322995d/dpdk/x86_64-native-bsdapp-clang/include -I. -I/usr/src/sys -I/usr/src/sys/contrib/ck/include -fno-common  -fno-omit-frame-pointer -mno-omit-leaf-frame-pointer -fdebug-prefix-map=./machine=/usr/src/sys/amd64/include -fdebug-prefix-map=./x86=/usr/src/sys/x86/include   -MD  -MF.depend.contigmem.o -MTcontigmem.o -mcmodel=kernel -mno-red-zone -mno-mmx -mno-sse -msoft-float  -fno-asynchronous-unwind-tables -ffreestanding -fwrapv -fstack-protector -Wall -Wredundant-decls -Wnested-externs -Wstrict-prototypes -Wmissing-prototypes -Wpointer-arith -Wcast-qual -Wundef -Wno-pointer-sign -D__printf__=__freebsd_kprintf__ -Wmissing-include-dirs -fdiagnostics-show-option -Wno-unknown-pragmas -Wno-error-tautological-compare -Wno-error-empty-body -Wno-error-parentheses-equality -Wno-error-unused-function -Wno-error-pointer-sign -Wno-error-shift-negative-value -Wno-address-of-packed-member  -mno-aes -mno-avx  -std=iso9899:1999 -c contigmem.c -o contigmem.o
Warning: Object directory not changed from original /root/FreeBSD1201-64_K12.1_Clang8.0.1/x86_64-native-bsdapp-clang/c6768c00774d4a6685fb166b5322995d/dpdk/x86_64-native-bsdapp-clang/build/kernel/freebsd/nic_uio
cc  -Winline -Wall -Werror -include /root/FreeBSD1201-64_K12.1_Clang8.0.1/x86_64-native-bsdapp-clang/c6768c00774d4a6685fb166b5322995d/dpdk/x86_64-native-bsdapp-clang/include/rte_config.h  -Werror -D_KERNEL -DKLD_MODULE -nostdinc  -I/root/FreeBSD1201-64_K12.1_Clang8.0.1/x86_64-native-bsdapp-clang/c6768c00774d4a6685fb166b5322995d/dpdk/kernel/freebsd/nic_uio -I/root/FreeBSD1201-64_K12.1_Clang8.0.1/x86_64-native-bsdapp-clang/c6768c00774d4a6685fb166b5322995d/dpdk/x86_64-native-bsdapp-clang/include -I. -I/usr/src/sys -I/usr/src/sys/contrib/ck/include -fno-common  -fno-omit-frame-pointer -mno-omit-leaf-frame-pointer -fdebug-prefix-map=./machine=/usr/src/sys/amd64/include -fdebug-prefix-map=./x86=/usr/src/sys/x86/include   -MD  -MF.depend.nic_uio.o -MTnic_uio.o -mcmodel=kernel -mno-red-zone -mno-mmx -mno-sse -msoft-float  -fno-asynchronous-unwind-tables -ffreestanding -fwrapv -fstack-protector -Wall -Wredundant-decls -Wnested-externs -Wstrict-prototypes -Wmissing-prototypes -Wpointer-arith -Wcast-qual -Wundef -Wno-pointer-sign -D__printf__=__freebsd_kprintf__ -Wmissing-include-dirs -fdiagnostics-show-option -Wno-unknown-pragmas -Wno-error-tautological-compare -Wno-error-empty-body -Wno-error-parentheses-equality -Wno-error-unused-function -Wno-error-pointer-sign -Wno-error-shift-negative-value -Wno-address-of-packed-member  -mno-aes -mno-avx  -std=iso9899:1999 -c nic_uio.c -o nic_uio.o
== Build drivers/common
== Build drivers/common/cpt
== Build drivers/common/octeontx
--
  LD testacl
  CC commands.o
  CC test.o
ld: error: undefined symbol: rte_cryptodev_get_qp_status
>>> referenced by qat_sym_frame.c
>>>               qat_sym_frame.o:(qat_sym_get_qp) in archive /root/FreeBSD1201-64_K12.1_Clang8.0.1/x86_64-native-bsdapp-clang/c6768c00774d4a6685fb166b5322995d/dpdk/x86_64-native-bsdapp-clang/lib/librte_pmd_qat.a
  CC config.o
--
  CC parameters.o
  LD dpdk-pdump
:   LD testsad
error: linker command failed with exit code 1 (use -v to see invocation)
gmake[5]: *** [/root/FreeBSD1201-64_K12.1_Clang8.0.1/x86_64-native-bsdapp-clang/c6768c00774d4a6685fb166b5322995d/dpdk/mk/rte.app.mk:454: testacl] Error 1
gmake[4]: *** [/root/FreeBSD1201-64_K12.1_Clang8.0.1/x86_64-native-bsdapp-clang/c6768c00774d4a6685fb166b5322995d/dpdk/mk/rte.subdir.mk:37: test-acl] Error 2
gmake[4]: *** Waiting for unfinished jobs....
  CC init.o
ld: error: undefined symbol: rte_cryptodev_get_qp_status
>>> referenced by qat_sym_frame.c
>>>               qat_sym_frame.o:(qat_sym_get_qp) in archive /root/FreeBSD1201-64_K12.1_Clang8.0.1/x86_64-native-bsdapp-clang/c6768c00774d4a6685fb166b5322995d/dpdk/x86_64-native-bsdapp-clang/lib/librte_pmd_qat.a
clang: error: linker command failed with exit code 1 (use -v to see invocation)
gmake[5]: *** [/root/FreeBSD1201-64_K12.1_Clang8.0.1/x86_64-native-bsdapp-clang/c6768c00774d4a6685fb166b5322995d/dpdk/mk/rte.app.mk:454: cmdline_test] Error 1
gmake[4]: *** [/root/FreeBSD1201-64_K12.1_Clang8.0.1/x86_64-native-bsdapp-clang/c6768c00774d4a6685fb166b5322995d/dpdk/mk/rte.subdir.mk:37: test-cmdline] Error 2
  CC test_resource.o
  CC cmdline.o
  CC comp_perf_test_verify.o
  LD testfib
ld: error: undefined symbol: rte_cryptodev_get_qp_status
>>> referenced by qat_sym_frame.c
>>>               qat_sym_frame.o:(qat_sym_get_qp) in archive /root/FreeBSD1201-64_K12.1_Clang8.0.1/x86_64-native-bsdapp-clang/c6768c00774d4a6685fb166b5322995d/dpdk/x86_64-native-bsdapp-clang/lib/librte_pmd_qat.a
clang: error: linker command failed with exit code 1 (use -v to see invocation)
gmake[5]: *** [/root/FreeBSD1201-64_K12.1_Clang8.0.1/x86_64-native-bsdapp-clang/c6768c00774d4a6685fb166b5322995d/dpdk/mk/rte.app.mk:454: dpdk-pdump] Error 1
gmake[4]: *** [/root/FreeBSD1201-64_K12.1_Clang8.0.1/x86_64-native-bsdapp-clang/c6768c00774d4a6685fb166b5322995d/dpdk/mk/rte.subdir.mk:37: pdump] Error 2
ld  CC test_prefetch.o
: error: undefined symbol: rte_cryptodev_get_qp_status
>>> referenced by qat_sym_frame.c
>>>               qat_sym_frame.o:(qat_sym_get_qp) in archive /root/FreeBSD1201-64_K12.1_Clang8.0.1/x86_64-native-bsdapp-clang/c6768c00774d4a6685fb166b5322995d/dpdk/x86_64-native-bsdapp-clang/lib/librte_pmd_qat.a
ld: error: undefined symbol: rte_cryptodev_get_qp_status
>>> referenced by qat_sym_frame.c
>>>               qat_sym_frame.o:(qat_sym_get_qp) in archive /root/FreeBSD1201-64_K12.1_Clang8.0.1/x86_64-native-bsdapp-clang/c6768c00774d4a6685fb166b5322995d/dpdk/x86_64-native-bsdapp-clang/lib/librte_pmd_qat.a
  CC runtime.o
clang: error: linker command failed with exit code 1 (use -v to see invocation)
gmake[5]: *** [/root/FreeBSD1201-64_K12.1_Clang8.0.1/x86_64-native-bsdapp-clang/c6768c00774d4a6685fb166b5322995d/dpdk/mk/rte.app.mk:454: testfib] Error 1
gmake[4]: *** [/root/FreeBSD1201-64_K12.1_Clang8.0.1/x86_64-native-bsdapp-clang/c6768c00774d4a6685fb166b5322995d/dpdk/mk/rte.subdir.mk:37: test-fib] Error 2
  CC test_bbdev_perf.o
  CC cmdline_flow.o
clang: error: linker command failed with exit code 1 (use -v to see invocation)
gmake[5]: *** [/root/FreeBSD1201-64_K12.1_Clang8.0.1/x86_64-native-bsdapp-clang/c6768c00774d4a6685fb166b5322995d/dpdk/mk/rte.app.mk:454: testsad] Error 1
gmake[4]: *** [/root/FreeBSD1201-64_K12.1_Clang8.0.1/x86_64-native-bsdapp-clang/c6768c00774d4a6685fb166b5322995d/dpdk/mk/rte.subdir.mk:37: test-sad] Error 2
  CC comp_perf_test_throughput.o
  CC pipeline_stub.o
  CC test_byteorder.o
--
  CC test_memzone.o
  CC test_bitmap.o
  CC test_memory.o
ld: error: undefined symbol: rte_cryptodev_get_qp_status
>>> referenced by qat_sym_frame.c
>>>               qat_sym_frame.o:(qat_sym_get_qp) in archive /root/FreeBSD1201-64_K12.1_Clang8.0.1/x86_64-native-bsdapp-clang/c6768c00774d4a6685fb166b5322995d/dpdk/x86_64-native-bsdapp-clang/lib/librte_pmd_qat.a
clang: error: linker command failed with exit code 1 (use -v to see invocation)
gmake[5]: *** [/root/FreeBSD1201-64_K12.1_Clang8.0.1/x86_64-native-bsdapp-clang/c6768c00774d4a6685fb166b5322995d/dpdk/mk/rte.app.mk:454: testpipeline] Error 1
  LD dpdk-test-compress-perf
  CC txonly.o
gmake[4]: *** [/root/FreeBSD1201-64_K12.1_Clang8.0.1/x86_64-native-bsdapp-clang/c6768c00774d4a6685fb166b5322995d/dpdk/mk/rte.subdir.mk:37: test-pipeline] Error 2
  CC test_reciprocal_division.o
  CC test_reciprocal_division_perf.o
  CC csumonly.o
  CC test_fbarray.o
ld: error: undefined symbol: rte_cryptodev_get_qp_status
>>> referenced by qat_sym_frame.c
>>>               qat_sym_frame.o:(qat_sym_get_qp) in archive /root/FreeBSD1201-64_K12.1_Clang8.0.1/x86_64-native-bsdapp-clang/c6768c00774d4a6685fb166b5322995d/dpdk/x86_64-native-bsdapp-clang/lib/librte_pmd_qat.a
clang: error: linker command failed with exit code 1 (use -v to see invocation)
gmake[5]: *** [/root/FreeBSD1201-64_K12.1_Clang8.0.1/x86_64-native-bsdapp-clang/c6768c00774d4a6685fb166b5322995d/dpdk/mk/rte.app.mk:454: dpdk-test-compress-perf] Error 1
gmake[4]: *** [/root/FreeBSD1201-64_K12.1_Clang8.0.1/x86_64-native-bsdapp-clang/c6768c00774d4a6685fb166b5322995d/dpdk/mk/rte.subdir.mk:37: test-compress-perf] Error 2
  CC noisy_vnf.o
  CC icmpecho.o
  CC test_external_mem.o
--
  CC test_ring.o
  CC util.o
  CC test_ring_mpmc_stress.o
ld: error: undefined symbol: rte_cryptodev_get_qp_status
>>> referenced by qat_sym_frame.c
>>>               qat_sym_frame.o:(qat_sym_get_qp) in archive /root/FreeBSD1201-64_K12.1_Clang8.0.1/x86_64-native-bsdapp-clang/c6768c00774d4a6685fb166b5322995d/dpdk/x86_64-native-bsdapp-clang/lib/librte_pmd_qat.a
clang: error: linker command failed with exit code 1 (use -v to see invocation)
gmake[5]: *** [/root/FreeBSD1201-64_K12.1_Clang8.0.1/x86_64-native-bsdapp-clang/c6768c00774d4a6685fb166b5322995d/dpdk/mk/rte.app.mk:454: testbbdev] Error 1
gmake[4]: *** [/root/FreeBSD1201-64_K12.1_Clang8.0.1/x86_64-native-bsdapp-clang/c6768c00774d4a6685fb166b5322995d/dpdk/mk/rte.subdir.mk:37: test-bbdev] Error 2
  CC test_ring_hts_stress.o
  CC test_ring_perf.o
  CC test_ring_peek_stress.o
--
  CC test_timer.o
  CC test_timer_racecond.o
  CC test_timer_secondary.o
ld: error: undefined symbol: rte_cryptodev_get_qp_status
>>> referenced by qat_sym_frame.c
>>>               qat_sym_frame.o:(qat_sym_get_qp) in archive /root/FreeBSD1201-64_K12.1_Clang8.0.1/x86_64-native-bsdapp-clang/c6768c00774d4a6685fb166b5322995d/dpdk/x86_64-native-bsdapp-clang/lib/librte_pmd_qat.a
  CC test_mempool.o
clang: error: linker command failed with exit code 1 (use -v to see invocation)
gmake[5]: *** [/root/FreeBSD1201-64_K12.1_Clang8.0.1/x86_64-native-bsdapp-clang/c6768c00774d4a6685fb166b5322995d/dpdk/mk/rte.app.mk:454: testpmd] Error 1
gmake[4]: *** [/root/FreeBSD1201-64_K12.1_Clang8.0.1/x86_64-native-bsdapp-clang/c6768c00774d4a6685fb166b5322995d/dpdk/mk/rte.subdir.mk:37: test-pmd] Error 2
  CC test_mempool_perf.o
  CC test_logs.o
  CC test_memcpy.o
--
  CC test_ipsec_sad.o
  MKRES test_resource_c.res.o
  LD test
ld: error: undefined symbol: rte_cryptodev_get_qp_status
>>> referenced by qat_sym_frame.c
>>>               qat_sym_frame.o:(qat_sym_get_qp) in archive /root/FreeBSD1201-64_K12.1_Clang8.0.1/x86_64-native-bsdapp-clang/c6768c00774d4a6685fb166b5322995d/dpdk/x86_64-native-bsdapp-clang/lib/librte_pmd_qat.a
clang: error: linker command failed with exit code 1 (use -v to see invocation)
gmake[5]: *** [/root/FreeBSD1201-64_K12.1_Clang8.0.1/x86_64-native-bsdapp-clang/c6768c00774d4a6685fb166b5322995d/dpdk/mk/rte.app.mk:454: test] Error 1
gmake[4]: *** [/root/FreeBSD1201-64_K12.1_Clang8.0.1/x86_64-native-bsdapp-clang/c6768c00774d4a6685fb166b5322995d/dpdk/mk/rte.subdir.mk:37: test] Error 2
gmake[3]: *** [/root/FreeBSD1201-64_K12.1_Clang8.0.1/x86_64-native-bsdapp-clang/c6768c00774d4a6685fb166b5322995d/dpdk/mk/rte.sdkbuild.mk:53: app] Error 2
gmake[2]: *** [/root/FreeBSD1201-64_K12.1_Clang8.0.1/x86_64-native-bsdapp-clang/c6768c00774d4a6685fb166b5322995d/dpdk/mk/rte.sdkroot.mk:99: all] Error 2
gmake[1]: *** [/root/FreeBSD1201-64_K12.1_Clang8.0.1/x86_64-native-bsdapp-clang/c6768c00774d4a6685fb166b5322995d/dpdk/mk/rte.sdkinstall.mk:61: pre_install] Error 2
gmake: *** [/root/FreeBSD1201-64_K12.1_Clang8.0.1/x86_64-native-bsdapp-clang/c6768c00774d4a6685fb166b5322995d/dpdk/mk/rte.sdkroot.mk:77: install] Error 2


*Makefile Build Failed #11:
OS: FreeBSD1201-64
Target: x86_64-native-bsdapp-gcc+shared
== Build drivers/common
awk -f /usr/src/sys/tools/makeobjops.awk /usr/src/sys/dev/pci/pci_if.m -h
Warning: Object directory not changed from original /root/FreeBSD1201-64_K12.1_GCC7.3.0/x86_64-native-bsdapp-gcc+shared/c6768c00774d4a6685fb166b5322995d/dpdk/x86_64-native-bsdapp-gcc/build/kernel/freebsd/contigmem
cc  -Winline -Wall -Werror -include /root/FreeBSD1201-64_K12.1_GCC7.3.0/x86_64-native-bsdapp-gcc+shared/c6768c00774d4a6685fb166b5322995d/dpdk/x86_64-native-bsdapp-gcc/include/rte_config.h  -Werror -D_KERNEL -DKLD_MODULE -nostdinc  -I/root/FreeBSD1201-64_K12.1_GCC7.3.0/x86_64-native-bsdapp-gcc+shared/c6768c00774d4a6685fb166b5322995d/dpdk/kernel/freebsd/contigmem -I/root/FreeBSD1201-64_K12.1_GCC7.3.0/x86_64-native-bsdapp-gcc+shared/c6768c00774d4a6685fb166b5322995d/dpdk/x86_64-native-bsdapp-gcc/include -I. -I/usr/src/sys -I/usr/src/sys/contrib/ck/include -fno-common  -fno-omit-frame-pointer -mno-omit-leaf-frame-pointer -fdebug-prefix-map=./machine=/usr/src/sys/amd64/include -fdebug-prefix-map=./x86=/usr/src/sys/x86/include   -MD  -MF.depend.contigmem.o -MTcontigmem.o -mcmodel=kernel -mno-red-zone -mno-mmx -mno-sse -msoft-float  -fno-asynchronous-unwind-tables -ffreestanding -fwrapv -fstack-protector -Wall -Wredundant-decls -Wnested-externs -Wstrict-prototypes -Wmissing-prototypes -Wpointer-arith -Wcast-qual -Wundef -Wno-pointer-sign -D__printf__=__freebsd_kprintf__ -Wmissing-include-dirs -fdiagnostics-show-option -Wno-unknown-pragmas -Wno-error-tautological-compare -Wno-error-empty-body -Wno-error-parentheses-equality -Wno-error-unused-function -Wno-error-pointer-sign -Wno-error-shift-negative-value -Wno-address-of-packed-member  -mno-aes -mno-avx  -std=iso9899:1999 -c contigmem.c -o contigmem.o
Warning: Object directory not changed from original /root/FreeBSD1201-64_K12.1_GCC7.3.0/x86_64-native-bsdapp-gcc+shared/c6768c00774d4a6685fb166b5322995d/dpdk/x86_64-native-bsdapp-gcc/build/kernel/freebsd/nic_uio
cc  -Winline -Wall -Werror -include /root/FreeBSD1201-64_K12.1_GCC7.3.0/x86_64-native-bsdapp-gcc+shared/c6768c00774d4a6685fb166b5322995d/dpdk/x86_64-native-bsdapp-gcc/include/rte_config.h  -Werror -D_KERNEL -DKLD_MODULE -nostdinc  -I/root/FreeBSD1201-64_K12.1_GCC7.3.0/x86_64-native-bsdapp-gcc+shared/c6768c00774d4a6685fb166b5322995d/dpdk/kernel/freebsd/nic_uio -I/root/FreeBSD1201-64_K12.1_GCC7.3.0/x86_64-native-bsdapp-gcc+shared/c6768c00774d4a6685fb166b5322995d/dpdk/x86_64-native-bsdapp-gcc/include -I. -I/usr/src/sys -I/usr/src/sys/contrib/ck/include -fno-common  -fno-omit-frame-pointer -mno-omit-leaf-frame-pointer -fdebug-prefix-map=./machine=/usr/src/sys/amd64/include -fdebug-prefix-map=./x86=/usr/src/sys/x86/include   -MD  -MF.depend.nic_uio.o -MTnic_uio.o -mcmodel=kernel -mno-red-zone -mno-mmx -mno-sse -msoft-float  -fno-asynchronous-unwind-tables -ffreestanding -fwrapv -fstack-protector -Wall -Wredundant-decls -Wnested-externs -Wstrict-prototypes -Wmissing-prototypes -Wpointer-arith -Wcast-qual -Wundef -Wno-pointer-sign -D__printf__=__freebsd_kprintf__ -Wmissing-include-dirs -fdiagnostics-show-option -Wno-unknown-pragmas -Wno-error-tautological-compare -Wno-error-empty-body -Wno-error-parentheses-equality -Wno-error-unused-function -Wno-error-pointer-sign -Wno-error-shift-negative-value -Wno-address-of-packed-member  -mno-aes -mno-avx  -std=iso9899:1999 -c nic_uio.c -o nic_uio.o
ld -m elf_x86_64_fbsd -L/root/FreeBSD1201-64_K12.1_GCC7.3.0/x86_64-native-bsdapp-gcc+shared/c6768c00774d4a6685fb166b5322995d/dpdk/x86_64-native-bsdapp-gcc/lib -d -warn-common --build-id=sha1 -r -d -o contigmem.ko contigmem.o
:> export_syms
ld -m elf_x86_64_fbsd -L/root/FreeBSD1201-64_K12.1_GCC7.3.0/x86_64-native-bsdapp-gcc+shared/c6768c00774d4a6685fb166b5322995d/dpdk/x86_64-native-bsdapp-gcc/lib -d -warn-common --build-id=sha1 -r -d -o nic_uio.ko nic_uio.o
--
  LD librte_pmd_qat.so.20.0.3
/usr/local/bin/ld: qat_sym_frame.o: in function `qat_sym_get_qp':
qat_sym_frame.c:(.text.experimental+0x16): undefined reference to `rte_cryptodev_get_qp_status'
collect2: error: ld returned 1 exit status
gmake[5]: *** [/root/FreeBSD1201-64_K12.1_GCC7.3.0/x86_64-native-bsdapp-gcc+shared/c6768c00774d4a6685fb166b5322995d/dpdk/mk/rte.lib.mk:100: librte_pmd_qat.so.20.0.3] Error 1
gmake[4]: *** [/root/FreeBSD1201-64_K12.1_GCC7.3.0/x86_64-native-bsdapp-gcc+shared/c6768c00774d4a6685fb166b5322995d/dpdk/mk/rte.subdir.mk:37: common/qat] Error 2
gmake[4]: *** Waiting for unfinished jobs....
  INSTALL-LIB librte_pmd_ark.so.20.0.3
== Build drivers/crypto/scheduler
--
  CC medford_nic.o
  LD librte_pmd_sfc_efx.so.20.0.3
  INSTALL-LIB librte_pmd_sfc_efx.so.20.0.3
gmake[3]: *** [/root/FreeBSD1201-64_K12.1_GCC7.3.0/x86_64-native-bsdapp-gcc+shared/c6768c00774d4a6685fb166b5322995d/dpdk/mk/rte.sdkbuild.mk:51: drivers] Error 2
gmake[2]: *** [/root/FreeBSD1201-64_K12.1_GCC7.3.0/x86_64-native-bsdapp-gcc+shared/c6768c00774d4a6685fb166b5322995d/dpdk/mk/rte.sdkroot.mk:99: all] Error 2
gmake[1]: *** [/root/FreeBSD1201-64_K12.1_GCC7.3.0/x86_64-native-bsdapp-gcc+shared/c6768c00774d4a6685fb166b5322995d/dpdk/mk/rte.sdkinstall.mk:61: pre_install] Error 2
gmake: *** [/root/FreeBSD1201-64_K12.1_GCC7.3.0/x86_64-native-bsdapp-gcc+shared/c6768c00774d4a6685fb166b5322995d/dpdk/mk/rte.sdkroot.mk:77: install] Error 2


*Makefile Build Failed #12:
OS: FreeBSD1201-64
Target: x86_64-native-bsdapp-gcc+debug
awk -f /usr/src/sys/tools/makeobjops.awk /usr/src/sys/kern/bus_if.m -h
awk -f /usr/src/sys/tools/makeobjops.awk /usr/src/sys/dev/pci/pci_if.m -h
Warning: Object directory not changed from original /root/FreeBSD1201-64_K12.1_GCC7.3.0/x86_64-native-bsdapp-gcc+debug/c6768c00774d4a6685fb166b5322995d/dpdk/x86_64-native-bsdapp-gcc/build/kernel/freebsd/contigmem
cc  -Winline -Wall -Werror -include /root/FreeBSD1201-64_K12.1_GCC7.3.0/x86_64-native-bsdapp-gcc+debug/c6768c00774d4a6685fb166b5322995d/dpdk/x86_64-native-bsdapp-gcc/include/rte_config.h  -Werror -D_KERNEL -DKLD_MODULE -nostdinc  -I/root/FreeBSD1201-64_K12.1_GCC7.3.0/x86_64-native-bsdapp-gcc+debug/c6768c00774d4a6685fb166b5322995d/dpdk/kernel/freebsd/contigmem -I/root/FreeBSD1201-64_K12.1_GCC7.3.0/x86_64-native-bsdapp-gcc+debug/c6768c00774d4a6685fb166b5322995d/dpdk/x86_64-native-bsdapp-gcc/include -I. -I/usr/src/sys -I/usr/src/sys/contrib/ck/include -fno-common  -fno-omit-frame-pointer -mno-omit-leaf-frame-pointer -fdebug-prefix-map=./machine=/usr/src/sys/amd64/include -fdebug-prefix-map=./x86=/usr/src/sys/x86/include   -MD  -MF.depend.contigmem.o -MTcontigmem.o -mcmodel=kernel -mno-red-zone -mno-mmx -mno-sse -msoft-float  -fno-asynchronous-unwind-tables -ffreestanding -fwrapv -fstack-protector -Wall -Wredundant-decls -Wnested-externs -Wstrict-prototypes -Wmissing-prototypes -Wpointer-arith -Wcast-qual -Wundef -Wno-pointer-sign -D__printf__=__freebsd_kprintf__ -Wmissing-include-dirs -fdiagnostics-show-option -Wno-unknown-pragmas -Wno-error-tautological-compare -Wno-error-empty-body -Wno-error-parentheses-equality -Wno-error-unused-function -Wno-error-pointer-sign -Wno-error-shift-negative-value -Wno-address-of-packed-member  -mno-aes -mno-avx  -std=iso9899:1999 -c contigmem.c -o contigmem.o
Warning: Object directory not changed from original /root/FreeBSD1201-64_K12.1_GCC7.3.0/x86_64-native-bsdapp-gcc+debug/c6768c00774d4a6685fb166b5322995d/dpdk/x86_64-native-bsdapp-gcc/build/kernel/freebsd/nic_uio
cc  -Winline -Wall -Werror -include /root/FreeBSD1201-64_K12.1_GCC7.3.0/x86_64-native-bsdapp-gcc+debug/c6768c00774d4a6685fb166b5322995d/dpdk/x86_64-native-bsdapp-gcc/include/rte_config.h  -Werror -D_KERNEL -DKLD_MODULE -nostdinc  -I/root/FreeBSD1201-64_K12.1_GCC7.3.0/x86_64-native-bsdapp-gcc+debug/c6768c00774d4a6685fb166b5322995d/dpdk/kernel/freebsd/nic_uio -I/root/FreeBSD1201-64_K12.1_GCC7.3.0/x86_64-native-bsdapp-gcc+debug/c6768c00774d4a6685fb166b5322995d/dpdk/x86_64-native-bsdapp-gcc/include -I. -I/usr/src/sys -I/usr/src/sys/contrib/ck/include -fno-common  -fno-omit-frame-pointer -mno-omit-leaf-frame-pointer -fdebug-prefix-map=./machine=/usr/src/sys/amd64/include -fdebug-prefix-map=./x86=/usr/src/sys/x86/include   -MD  -MF.depend.nic_uio.o -MTnic_uio.o -mcmodel=kernel -mno-red-zone -mno-mmx -mno-sse -msoft-float  -fno-asynchronous-unwind-tables -ffreestanding -fwrapv -fstack-protector -Wall -Wredundant-decls -Wnested-externs -Wstrict-prototypes -Wmissing-prototypes -Wpointer-arith -Wcast-qual -Wundef -Wno-pointer-sign -D__printf__=__freebsd_kprintf__ -Wmissing-include-dirs -fdiagnostics-show-option -Wno-unknown-pragmas -Wno-error-tautological-compare -Wno-error-empty-body -Wno-error-parentheses-equality -Wno-error-unused-function -Wno-error-pointer-sign -Wno-error-shift-negative-value -Wno-address-of-packed-member  -mno-aes -mno-avx  -std=iso9899:1999 -c nic_uio.c -o nic_uio.o
== Build drivers/common
ld -m elf_x86_64_fbsd -L/root/FreeBSD1201-64_K12.1_GCC7.3.0/x86_64-native-bsdapp-gcc+debug/c6768c00774d4a6685fb166b5322995d/dpdk/x86_64-native-bsdapp-gcc/lib -d -warn-common --build-id=sha1 -r -d -o contigmem.ko contigmem.o
:> export_syms
--
  CC resource.o
/usr/local/bin/ld: /root/FreeBSD1201-64_K12.1_GCC7.3.0/x86_64-native-bsdapp-gcc+debug/c6768c00774d4a6685fb166b5322995d/dpdk/x86_64-native-bsdapp-gcc/lib/librte_pmd_qat.a(qat_sym_frame.o): in function `qat_sym_get_qp':
qat_sym_frame.c:(.text.experimental+0x16): undefined reference to `rte_cryptodev_get_qp_status'
collect2: error: ld returned 1 exit status
gmake[5]: *** [/root/FreeBSD1201-64_K12.1_GCC7.3.0/x86_64-native-bsdapp-gcc+debug/c6768c00774d4a6685fb166b5322995d/dpdk/mk/rte.app.mk:454: testfib] Error 1
gmake[4]: *** [/root/FreeBSD1201-64_K12.1_GCC7.3.0/x86_64-native-bsdapp-gcc+debug/c6768c00774d4a6685fb166b5322995d/dpdk/mk/rte.subdir.mk:37: test-fib] Error 2
gmake[4]: *** Waiting for unfinished jobs....
/usr/local/bin/ld: /root/FreeBSD1201-64_K12.1_GCC7.3.0/x86_64-native-bsdapp-gcc+debug/c6768c00774d4a6685fb166b5322995d/dpdk/x86_64-native-bsdapp-gcc/lib/librte_pmd_qat.a(qat_sym_frame.o): in function `qat_sym_get_qp':
qat_sym_frame.c:(.text.experimental+0x16): undefined reference to `rte_cryptodev_get_qp_status'
collect2: error: ld returned 1 exit status
gmake[5]: *** [/root/FreeBSD1201-64_K12.1_GCC7.3.0/x86_64-native-bsdapp-gcc+debug/c6768c00774d4a6685fb166b5322995d/dpdk/mk/rte.app.mk:454: testsad] Error 1
gmake[4]: *** [/root/FreeBSD1201-64_K12.1_GCC7.3.0/x86_64-native-bsdapp-gcc+debug/c6768c00774d4a6685fb166b5322995d/dpdk/mk/rte.subdir.mk:37: test-sad] Error 2
  CC init.o
  CC comp_perf_options_parse.o
/usr/local/bin/ld: /root/FreeBSD1201-64_K12.1_GCC7.3.0/x86_64-native-bsdapp-gcc+debug/c6768c00774d4a6685fb166b5322995d/dpdk/x86_64-native-bsdapp-gcc/lib/librte_pmd_qat.a(qat_sym_frame.o): in function `qat_sym_get_qp':
qat_sym_frame.c:(.text.experimental+0x16): undefined reference to `rte_cryptodev_get_qp_status'
collect2: error: ld returned 1 exit status
gmake[5]: *** [/root/FreeBSD1201-64_K12.1_GCC7.3.0/x86_64-native-bsdapp-gcc+debug/c6768c00774d4a6685fb166b5322995d/dpdk/mk/rte.app.mk:454: cmdline_test] Error 1
gmake[4]: *** [/root/FreeBSD1201-64_K12.1_GCC7.3.0/x86_64-native-bsdapp-gcc+debug/c6768c00774d4a6685fb166b5322995d/dpdk/mk/rte.subdir.mk:37: test-cmdline] Error 2
/usr/local/bin/ld: /root/FreeBSD1201-64_K12.1_GCC7.3.0/x86_64-native-bsdapp-gcc+debug/c6768c00774d4a6685fb166b5322995d/dpdk/x86_64-native-bsdapp-gcc/lib/librte_pmd_qat.a(qat_sym_frame.o): in function `qat_sym_get_qp':
qat_sym_frame.c:(.text.experimental+0x16): undefined reference to `rte_cryptodev_get_qp_status'
collect2: error: ld returned 1 exit status
gmake[5]: *** [/root/FreeBSD1201-64_K12.1_GCC7.3.0/x86_64-native-bsdapp-gcc+debug/c6768c00774d4a6685fb166b5322995d/dpdk/mk/rte.app.mk:454: dpdk-pdump] Error 1
gmake[4]: *** [/root/FreeBSD1201-64_K12.1_GCC7.3.0/x86_64-native-bsdapp-gcc+debug/c6768c00774d4a6685fb166b5322995d/dpdk/mk/rte.subdir.mk:37: pdump] Error 2
  CC parameters.o
  CC test_resource.o
  CC runtime.o
--
  CC cmdline.o
/usr/local/bin/ld: /root/FreeBSD1201-64_K12.1_GCC7.3.0/x86_64-native-bsdapp-gcc+debug/c6768c00774d4a6685fb166b5322995d/dpdk/x86_64-native-bsdapp-gcc/lib/librte_pmd_qat.a(qat_sym_frame.o): in function `qat_sym_get_qp':
qat_sym_frame.c:(.text.experimental+0x16): undefined reference to `rte_cryptodev_get_qp_status'
collect2: error: ld returned 1 exit status
gmake[5]: *** [/root/FreeBSD1201-64_K12.1_GCC7.3.0/x86_64-native-bsdapp-gcc+debug/c6768c00774d4a6685fb166b5322995d/dpdk/mk/rte.app.mk:454: testacl] Error 1
gmake[4]: *** [/root/FreeBSD1201-64_K12.1_GCC7.3.0/x86_64-native-bsdapp-gcc+debug/c6768c00774d4a6685fb166b5322995d/dpdk/mk/rte.subdir.mk:37: test-acl] Error 2
  CC pipeline_stub.o
  CC comp_perf_test_verify.o
  CC test_bbdev_perf.o
--
/usr  LD testpipeline
/local/bin/ld: /root/FreeBSD1201-64_K12.1_GCC7.3.0/x86_64-native-bsdapp-gcc+debug/c6768c00774d4a6685fb166b5322995d/dpdk/x86_64-native-bsdapp-gcc/lib/librte_pmd_qat.a(qat_sym_frame.o): in function `qat_sym_get_qp':
qat_sym_frame.c:(.text.experimental+0x16): undefined reference to `rte_cryptodev_get_qp_status'
collect2: error: ld returned 1 exit status
gmake[5]: *** [/root/FreeBSD1201-64_K12.1_GCC7.3.0/x86_64-native-bsdapp-gcc+debug/c6768c00774d4a6685fb166b5322995d/dpdk/mk/rte.app.mk:454: dpdk-test-compress-perf] Error 1
gmake[4]: *** [/root/FreeBSD1201-64_K12.1_GCC7.3.0/x86_64-native-bsdapp-gcc+debug/c6768c00774d4a6685fb166b5322995d/dpdk/mk/rte.subdir.mk:37: test-compress-perf] Error 2
  CC test_memory.o
  CC flowgen.o
  CC test_memzone.o
--
  CC txonly.o
/usr/local/bin/ld: /root/FreeBSD1201-64_K12.1_GCC7.3.0/x86_64-native-bsdapp-gcc+debug/c6768c00774d4a6685fb166b5322995d/dpdk/x86_64-native-bsdapp-gcc/lib/librte_pmd_qat.a(qat_sym_frame.o): in function `qat_sym_get_qp':
qat_sym_frame.c:(.text.experimental+0x16): undefined reference to `rte_cryptodev_get_qp_status'
collect2: error: ld returned 1 exit status
gmake[5]: *** [/root/FreeBSD1201-64_K12.1_GCC7.3.0/x86_64-native-bsdapp-gcc+debug/c6768c00774d4a6685fb166b5322995d/dpdk/mk/rte.app.mk:454: testpipeline] Error 1
gmake[4]: *** [/root/FreeBSD1201-64_K12.1_GCC7.3.0/x86_64-native-bsdapp-gcc+debug/c6768c00774d4a6685fb166b5322995d/dpdk/mk/rte.subdir.mk:37: test-pipeline] Error 2
  CC test_reciprocal_division.o
  CC test_reciprocal_division_perf.o
  CC csumonly.o
--
  CC test_ring_rts_stress.o
/usr/local/bin/ld: /root/FreeBSD1201-64_K12.1_GCC7.3.0/x86_64-native-bsdapp-gcc+debug/c6768c00774d4a6685fb166b5322995d/dpdk/x86_64-native-bsdapp-gcc/lib/librte_pmd_qat.a(qat_sym_frame.o): in function `qat_sym_get_qp':
qat_sym_frame.c:(.text.experimental+0x16): undefined reference to `rte_cryptodev_get_qp_status'
collect2: error: ld returned 1 exit status
gmake[5]: *** [/root/FreeBSD1201-64_K12.1_GCC7.3.0/x86_64-native-bsdapp-gcc+debug/c6768c00774d4a6685fb166b5322995d/dpdk/mk/rte.app.mk:454: testbbdev] Error 1
gmake[4]: *** [/root/FreeBSD1201-64_K12.1_GCC7.3.0/x86_64-native-bsdapp-gcc+debug/c6768c00774d4a6685fb166b5322995d/dpdk/mk/rte.subdir.mk:37: test-bbdev] Error 2
  CC test_ring_stress.o
  CC test_table.o
  CC test_pmd_perf.o
--
qat_sym_frame.c:(.text.experimental+0x16): undefined reference  CC test_mempool_perf.o
  CC test_mbuf.o
 to `rte_cryptodev_get_qp_status'
collect2: error: ld returned 1 exit status
  CC test_logs.o
gmake[5]: *** [/root/FreeBSD1201-64_K12.1_GCC7.3.0/x86_64-native-bsdapp-gcc+debug/c6768c00774d4a6685fb166b5322995d/dpdk/mk/rte.app.mk:454: testpmd] Error 1
gmake[4]: *** [/root/FreeBSD1201-64_K12.1_GCC7.3.0/x86_64-native-bsdapp-gcc+debug/c6768c00774d4a6685fb166b5322995d/dpdk/mk/rte.subdir.mk:37: test-pmd] Error 2
  CC test_memcpy.o
  CC test_memcpy_perf.o
  CC test_member_perf.o
--
  LD test
/usr/local/bin/ld: /root/FreeBSD1201-64_K12.1_GCC7.3.0/x86_64-native-bsdapp-gcc+debug/c6768c00774d4a6685fb166b5322995d/dpdk/x86_64-native-bsdapp-gcc/lib/librte_pmd_qat.a(qat_sym_frame.o): in function `qat_sym_get_qp':
qat_sym_frame.c:(.text.experimental+0x16): undefined reference to `rte_cryptodev_get_qp_status'
collect2: error: ld returned 1 exit status
gmake[5]: *** [/root/FreeBSD1201-64_K12.1_GCC7.3.0/x86_64-native-bsdapp-gcc+debug/c6768c00774d4a6685fb166b5322995d/dpdk/mk/rte.app.mk:454: test] Error 1
gmake[4]: *** [/root/FreeBSD1201-64_K12.1_GCC7.3.0/x86_64-native-bsdapp-gcc+debug/c6768c00774d4a6685fb166b5322995d/dpdk/mk/rte.subdir.mk:37: test] Error 2
gmake[3]: *** [/root/FreeBSD1201-64_K12.1_GCC7.3.0/x86_64-native-bsdapp-gcc+debug/c6768c00774d4a6685fb166b5322995d/dpdk/mk/rte.sdkbuild.mk:53: app] Error 2
gmake[2]: *** [/root/FreeBSD1201-64_K12.1_GCC7.3.0/x86_64-native-bsdapp-gcc+debug/c6768c00774d4a6685fb166b5322995d/dpdk/mk/rte.sdkroot.mk:99: all] Error 2
gmake[1]: *** [/root/FreeBSD1201-64_K12.1_GCC7.3.0/x86_64-native-bsdapp-gcc+debug/c6768c00774d4a6685fb166b5322995d/dpdk/mk/rte.sdkinstall.mk:61: pre_install] Error 2
gmake: *** [/root/FreeBSD1201-64_K12.1_GCC7.3.0/x86_64-native-bsdapp-gcc+debug/c6768c00774d4a6685fb166b5322995d/dpdk/mk/rte.sdkroot.mk:77: install] Error 2


*Makefile Build Failed #13:
OS: RHEL82-64
Target: x86_64-native-linuxapp-gcc
  CC test_bbdev_perf.o
/root/RHEL82-64_K4.18.0_GCC8.3.1/x86_64-native-linuxapp-gcc/c6768c00774d4a6685fb166b5322995d/dpdk/x86_64-native-linuxapp-gcc/lib/librte_pmd_qat.a(qat_sym_frame.o): In function `qat_sym_get_qp':
qat_sym_frame.c:(.text.experimental+0x16): undefined reference to `rte_cryptodev_get_qp_status'
collect2: error: ld returned 1 exit status
/root/RHEL82-64_K4.18.0_GCC8.3.1/x86_64-native-linuxapp-gcc/c6768c00774d4a6685fb166b5322995d/dpdk/x86_64-native-linuxapp-gcc/lib/librte_pmd_qat.a(qat_sym_frame.o): In function `qat_sym_get_qp':
qat_sym_frame.c:(.text.experimental+0x16): undefined reference to `rte_cryptodev_get_qp_status'
collect2: error: ld returned 1 exit status
make[5]: *** [/root/RHEL82-64_K4.18.0_GCC8.3.1/x86_64-native-linuxapp-gcc/c6768c00774d4a6685fb166b5322995d/dpdk/mk/rte.app.mk:454: testacl] Error 1
make[5]: *** [/root/RHEL82-64_K4.18.0_GCC8.3.1/x86_64-native-linuxapp-gcc/c6768c00774d4a6685fb166b5322995d/dpdk/mk/rte.app.mk:454: dpdk-pdump] Error 1
make[4]: *** [/root/RHEL82-64_K4.18.0_GCC8.3.1/x86_64-native-linuxapp-gcc/c6768c00774d4a6685fb166b5322995d/dpdk/mk/rte.subdir.mk:37: test-acl] Error 2
make[4]: *** Waiting for unfinished jobs....
make[4]: *** [/root/RHEL82-64_K4.18.0_GCC8.3.1/x86_64-native-linuxapp-gcc/c6768c00774d4a6685fb166b5322995d/dpdk/mk/rte.subdir.mk:37: pdump] Error 2
  CC test_prefetch.o
  CC runtime.o
/root/RHEL82-64_K4.18.0_GCC8.3.1/x86_64-native-linuxapp-gcc/c6768c00774d4a6685fb166b5322995d/dpdk/x86_64-native-linuxapp-gcc/lib/librte_pmd_qat.a(qat_sym_frame.o): In function `qat_sym_get_qp':
qat_sym_frame.c:(.text.experimental+0x16): undefined reference to `rte_cryptodev_get_qp_status'
collect2: error: ld returned 1 exit status
/root/RHEL82-64_K4.18.0_GCC8.3.1/x86_64-native-linuxapp-gcc/c6768c00774d4a6685fb166b5322995d/dpdk/x86_64-native-linuxapp-gcc/lib/librte_pmd_qat.a(qat_sym_frame.o): In function `qat_sym_get_qp':
qat_sym_frame.c:(.text.experimental+0x16): undefined reference to `rte_cryptodev_get_qp_status'
collect2: error: ld returned 1 exit status
make[5]: *** [/root/RHEL82-64_K4.18.0_GCC8.3.1/x86_64-native-linuxapp-gcc/c6768c00774d4a6685fb166b5322995d/dpdk/mk/rte.app.mk:454: testsad] Error 1
  CC parameters.o
make[4]: *** [/root/RHEL82-64_K4.18.0_GCC8.3.1/x86_64-native-linuxapp-gcc/c6768c00774d4a6685fb166b5322995d/dpdk/mk/rte.subdir.mk:37: test-sad] Error 2
make[5]: *** [/root/RHEL82-64_K4.18.0_GCC8.3.1/x86_64-native-linuxapp-gcc/c6768c00774d4a6685fb166b5322995d/dpdk/mk/rte.app.mk:454: cmdline_test] Error 1
make[4]: *** [/root/RHEL82-64_K4.18.0_GCC8.3.1/x86_64-native-linuxapp-gcc/c6768c00774d4a6685fb166b5322995d/dpdk/mk/rte.subdir.mk:37: test-cmdline] Error 2
  CC cmdline.o
  CC pipeline_stub.o
  CC pipeline_hash.o
--
  CC test_byteorder.o
/root/RHEL82-64_K4.18.0_GCC8.3.1/x86_64-native-linuxapp-gcc/c6768c00774d4a6685fb166b5322995d/dpdk/x86_64-native-linuxapp-gcc/lib/librte_pmd_qat.a(qat_sym_frame.o): In function `qat_sym_get_qp':
qat_sym_frame.c:(.text.experimental+0x16): undefined reference to `rte_cryptodev_get_qp_status'
collect2: error: ld returned 1 exit status
make[5]: *** [/root/RHEL82-64_K4.18.0_GCC8.3.1/x86_64-native-linuxapp-gcc/c6768c00774d4a6685fb166b5322995d/dpdk/mk/rte.app.mk:454: testfib] Error 1
make[4]: *** [/root/RHEL82-64_K4.18.0_GCC8.3.1/x86_64-native-linuxapp-gcc/c6768c00774d4a6685fb166b5322995d/dpdk/mk/rte.subdir.mk:37: test-fib] Error 2
  CC test_per_lcore.o
/root/RHEL82-64_K4.18.0_GCC8.3.1/x86_64-native-linuxapp-gcc/c6768c00774d4a6685fb166b5322995d/dpdk/x86_64-native-linuxapp-gcc/lib/librte_pmd_qat.a(qat_sym_frame.o): In function `qat_sym_get_qp':
qat_sym_frame.c:(.text.experimental+0x16): undefined reference to `rte_cryptodev_get_qp_status'
collect2: error: ld returned 1 exit status
make[5]: *** [/root/RHEL82-64_K4.18.0_GCC8.3.1/x86_64-native-linuxapp-gcc/c6768c00774d4a6685fb166b5322995d/dpdk/mk/rte.app.mk:454: dpdk-procinfo] Error 1
make[4]: *** [/root/RHEL82-64_K4.18.0_GCC8.3.1/x86_64-native-linuxapp-gcc/c6768c00774d4a6685fb166b5322995d/dpdk/mk/rte.subdir.mk:37: proc-info] Error 2
  CC cmdline_mtr.o
  CC test_atomic.o
  CC pipeline_lpm.o
--
  CC test_fbarray.o
/root/RHEL82-64_K4.18.0_GCC8.3.1/x86_64-native-linuxapp-gcc/c6768c00774d4a6685fb166b5322995d/dpdk/x86_64-native-linuxapp-gcc/lib/librte_pmd_qat.a(qat_sym_frame.o): In function `qat_sym_get_qp':
qat_sym_frame.c:(.text.experimental+0x16): undefined reference to `rte_cryptodev_get_qp_status'
collect2: error: ld returned 1 exit status
make[5]: *** [/root/RHEL82-64_K4.18.0_GCC8.3.1/x86_64-native-linuxapp-gcc/c6768c00774d4a6685fb166b5322995d/dpdk/mk/rte.app.mk:454: testpipeline] Error 1
make[4]: *** [/root/RHEL82-64_K4.18.0_GCC8.3.1/x86_64-native-linuxapp-gcc/c6768c00774d4a6685fb166b5322995d/dpdk/mk/rte.subdir.mk:37: test-pipeline] Error 2
  CC test_external_mem.o
  CC test_rand_perf.o
  CC test_ring.o
--
  CC softnicfwd.o
/root/RHEL82-64_K4.18.0_GCC8.3.1/x86_64-native-linuxapp-gcc/c6768c00774d4a6685fb166b5322995d/dpdk/x86_64-native-linuxapp-gcc/lib/librte_pmd_qat.a(qat_sym_frame.o): In function `qat_sym_get_qp':
qat_sym_frame.c:(.text.experimental+0x16): undefined reference to `rte_cryptodev_get_qp_status'
collect2: error: ld returned 1 exit status
make[5]: *** [/root/RHEL82-64_K4.18.0_GCC8.3.1/x86_64-native-linuxapp-gcc/c6768c00774d4a6685fb166b5322995d/dpdk/mk/rte.app.mk:454: testbbdev] Error 1
make[4]: *** [/root/RHEL82-64_K4.18.0_GCC8.3.1/x86_64-native-linuxapp-gcc/c6768c00774d4a6685fb166b5322995d/dpdk/mk/rte.subdir.mk:37: test-bbdev] Error 2
  CC test_table.o
  CC test_table_pipeline.o
  CC test_table_tables.o
--
  CC test_mbuf.o
/root/RHEL82-64_K4.18.0_GCC8.3.1/x86_64-native-linuxapp-gcc/c6768c00774d4a6685fb166b5322995d/dpdk/x86_64-native-linuxapp-gcc/lib/librte_pmd_qat.a(qat_sym_frame.o): In function `qat_sym_get_qp':
qat_sym_frame.c:(.text.experimental+0x16): undefined reference to `rte_cryptodev_get_qp_status'
collect2: error: ld returned 1 exit status
make[5]: *** [/root/RHEL82-64_K4.18.0_GCC8.3.1/x86_64-native-linuxapp-gcc/c6768c00774d4a6685fb166b5322995d/dpdk/mk/rte.app.mk:454: testpmd] Error 1
make[4]: *** [/root/RHEL82-64_K4.18.0_GCC8.3.1/x86_64-native-linuxapp-gcc/c6768c00774d4a6685fb166b5322995d/dpdk/mk/rte.subdir.mk:37: test-pmd] Error 2
  CC test_logs.o
  CC test_memcpy.o
  CC test_memcpy_perf.o
--
  LD test
/root/RHEL82-64_K4.18.0_GCC8.3.1/x86_64-native-linuxapp-gcc/c6768c00774d4a6685fb166b5322995d/dpdk/x86_64-native-linuxapp-gcc/lib/librte_pmd_qat.a(qat_sym_frame.o): In function `qat_sym_get_qp':
qat_sym_frame.c:(.text.experimental+0x16): undefined reference to `rte_cryptodev_get_qp_status'
collect2: error: ld returned 1 exit status
make[5]: *** [/root/RHEL82-64_K4.18.0_GCC8.3.1/x86_64-native-linuxapp-gcc/c6768c00774d4a6685fb166b5322995d/dpdk/mk/rte.app.mk:454: test] Error 1
make[4]: *** [/root/RHEL82-64_K4.18.0_GCC8.3.1/x86_64-native-linuxapp-gcc/c6768c00774d4a6685fb166b5322995d/dpdk/mk/rte.subdir.mk:37: test] Error 2
make[3]: *** [/root/RHEL82-64_K4.18.0_GCC8.3.1/x86_64-native-linuxapp-gcc/c6768c00774d4a6685fb166b5322995d/dpdk/mk/rte.sdkbuild.mk:53: app] Error 2
make[2]: *** [/root/RHEL82-64_K4.18.0_GCC8.3.1/x86_64-native-linuxapp-gcc/c6768c00774d4a6685fb166b5322995d/dpdk/mk/rte.sdkroot.mk:99: all] Error 2
make[1]: *** [/root/RHEL82-64_K4.18.0_GCC8.3.1/x86_64-native-linuxapp-gcc/c6768c00774d4a6685fb166b5322995d/dpdk/mk/rte.sdkinstall.mk:61: pre_install] Error 2
make: *** [/root/RHEL82-64_K4.18.0_GCC8.3.1/x86_64-native-linuxapp-gcc/c6768c00774d4a6685fb166b5322995d/dpdk/mk/rte.sdkroot.mk:77: install] Error 2


*Makefile Build Failed #14:
OS: SUSE15-64
Target: x86_64-native-linuxapp-clang
/root/SUSE15-64_K4.12.14_Clang5.0.1/x86_64-native-linuxapp-clang/c6768c00774d4a6685fb166b5322995d/dpdk/drivers/crypto/qat/qat_sym_frame.c:(.text.experimental+0xe): undefined reference to `rte_cryptodev_get_qp_status'
  LD testsad
  LD dpdk-pdump
clang-5.0.1: error: linker command failed with exit code 1 (use -v to see invocation)
make[5]: *** [/root/SUSE15-64_K4.12.14_Clang5.0.1/x86_64-native-linuxapp-clang/c6768c00774d4a6685fb166b5322995d/dpdk/mk/rte.app.mk:454: cmdline_test] Error 1
make[4]: *** [/root/SUSE15-64_K4.12.14_Clang5.0.1/x86_64-native-linuxapp-clang/c6768c00774d4a6685fb166b5322995d/dpdk/mk/rte.subdir.mk:37: test-cmdline] Error 2
make[4]: *** Waiting for unfinished jobs....
  CC config.o
  CC init.o
--
/root/SUSE15-64_K4.12.14_Clang5.0.1/x86_64-native-linuxapp-clang/c6768c00774d4a6685fb166b5322995d/dpdk/drivers/crypto/qat/qat_sym_frame.c:(.text.experimental+0xe): undefined reference to `rte_cryptodev_get_qp_status'
  CC test_prefetch.o
  CC cmdline.o
clang-5.0.1: error: linker command failed with exit code 1 (use -v to see invocation)
make[5]: *** [/root/SUSE15-64_K4.12.14_Clang5.0.1/x86_64-native-linuxapp-clang/c6768c00774d4a6685fb166b5322995d/dpdk/mk/rte.app.mk:454: dpdk-pdump] Error 1
make[4]: *** [/root/SUSE15-64_K4.12.14_Clang5.0.1/x86_64-native-linuxapp-clang/c6768c00774d4a6685fb166b5322995d/dpdk/mk/rte.subdir.mk:37: pdump] Error 2
  CC runtime.o
  CC test_byteorder.o
clang-5.0.1: error: linker command failed with exit code 1 (use -v to see invocation)
make[5]: *** [/root/SUSE15-64_K4.12.14_Clang5.0.1/x86_64-native-linuxapp-clang/c6768c00774d4a6685fb166b5322995d/dpdk/mk/rte.app.mk:454: dpdk-procinfo] Error 1
make[4]: *** [/root/SUSE15-64_K4.12.14_Clang5.0.1/x86_64-native-linuxapp-clang/c6768c00774d4a6685fb166b5322995d/dpdk/mk/rte.subdir.mk:37: proc-info] Error 2
  CC pipeline_stub.o
  CC cmdline_flow.o
/root/SUSE15-64_K4.12.14_Clang5.0.1/x86_64-native-linuxapp-clang/c6768c00774d4a6685fb166b5322995d/dpdk/x86_64-native-linuxapp-clang/lib/librte_pmd_qat.a(qat_sym_frame.o): In function `qat_sym_get_qp':
/root/SUSE15-64_K4.12.14_Clang5.0.1/x86_64-native-linuxapp-clang/c6768c00774d4a6685fb166b5322995d/dpdk/drivers/crypto/qat/qat_sym_frame.c:(.text.experimental+0xe): undefined reference to `rte_cryptodev_get_qp_status'
  LD testfib
clang-5.0.1: error: linker command failed with exit code 1 (use -v to see invocation)
  CC test_per_lcore.o
make[5]: *** [/root/SUSE15-64_K4.12.14_Clang5.0.1/x86_64-native-linuxapp-clang/c6768c00774d4a6685fb166b5322995d/dpdk/mk/rte.app.mk:454: testsad] Error 1
make[4]: *** [/root/SUSE15-64_K4.12.14_Clang5.0.1/x86_64-native-linuxapp-clang/c6768c00774d4a6685fb166b5322995d/dpdk/mk/rte.subdir.mk:37: test-sad] Error 2
  CC test_bbdev_perf.o
  CC cmdline_mtr.o
clang-5.0.1: error: linker command failed with exit code 1 (use -v to see invocation)
make[5]: *** [/root/SUSE15-64_K4.12.14_Clang5.0.1/x86_64-native-linuxapp-clang/c6768c00774d4a6685fb166b5322995d/dpdk/mk/rte.app.mk:454: testacl] Error 1
make[4]: *** [/root/SUSE15-64_K4.12.14_Clang5.0.1/x86_64-native-linuxapp-clang/c6768c00774d4a6685fb166b5322995d/dpdk/mk/rte.subdir.mk:37: test-acl] Error 2
  CC pipeline_hash.o
  CC test_atomic.o
  CC cmdline_tm.o
/root/SUSE15-64_K4.12.14_Clang5.0.1/x86_64-native-linuxapp-clang/c6768c00774d4a6685fb166b5322995d/dpdk/x86_64-native-linuxapp-clang/lib/librte_pmd_qat.a(qat_sym_frame.o): In function `qat_sym_get_qp':
/root/SUSE15-64_K4.12.14_Clang5.0.1/x86_64-native-linuxapp-clang/c6768c00774d4a6685fb166b5322995d/dpdk/drivers/crypto/qat/qat_sym_frame.c:(.text.experimental+0xe): undefined reference to `rte_cryptodev_get_qp_status'
  CC test_barrier.o
clang-5.0.1: error: linker command failed with exit code 1 (use -v to see invocation)
make[5]: *** [/root/SUSE15-64_K4.12.14_Clang5.0.1/x86_64-native-linuxapp-clang/c6768c00774d4a6685fb166b5322995d/dpdk/mk/rte.app.mk:454: testfib] Error 1
make[4]: *** [/root/SUSE15-64_K4.12.14_Clang5.0.1/x86_64-native-linuxapp-clang/c6768c00774d4a6685fb166b5322995d/dpdk/mk/rte.subdir.mk:37: test-fib] Error 2
  CC pipeline_lpm.o
  CC test_malloc.o
  CC config.o
--
/root/SUSE15-64_K4.12.14_Clang5.0.1/x86_64-native-linuxapp-clang/c6768c00774d4a6685fb166b5322995d/dpdk/drivers/crypto/qat/qat_sym_frame.c:(.text.experimental+0xe): undefined reference to `rte_cryptodev_get_qp_status'
  CC icmpecho.o
  CC test_ticketlock.o
clang-5.0.1: error: linker command failed with exit code 1 (use -v to see invocation)
make[5]: *** [/root/SUSE15-64_K4.12.14_Clang5.0.1/x86_64-native-linuxapp-clang/c6768c00774d4a6685fb166b5322995d/dpdk/mk/rte.app.mk:454: testpipeline] Error 1
make[4]: *** [/root/SUSE15-64_K4.12.14_Clang5.0.1/x86_64-native-linuxapp-clang/c6768c00774d4a6685fb166b5322995d/dpdk/mk/rte.subdir.mk:37: test-pipeline] Error 2
  CC noisy_vnf.o
  CC test_memory.o
  CC test_memzone.o
--
/root/SUSE15-64_K4.12.14_Clang5.0.1/x86_64-native-linuxapp-clang/c6768c00774d4a6685fb166b5322995d/dpdk/drivers/crypto/qat/qat_sym_frame.c:(.text.experimental+0xe): undefined reference to `rte_cryptodev_get_qp_status'
  CC test_ring_stress.o
  CC test_pmd_perf.o
clang-5.0.1: error: linker command failed with exit code 1 (use -v to see invocation)
make[5]: *** [/root/SUSE15-64_K4.12.14_Clang5.0.1/x86_64-native-linuxapp-clang/c6768c00774d4a6685fb166b5322995d/dpdk/mk/rte.app.mk:454: testbbdev] Error 1
make[4]: *** [/root/SUSE15-64_K4.12.14_Clang5.0.1/x86_64-native-linuxapp-clang/c6768c00774d4a6685fb166b5322995d/dpdk/mk/rte.subdir.mk:37: test-bbdev] Error 2
  CC test_table.o
  CC test_table_pipeline.o
  CC test_table_tables.o
--
  CC test_timer_racecond.o
  CC test_timer_secondary.o
  CC test_mempool.o
clang-5.0.1: error: linker command failed with exit code 1 (use -v to see invocation)
  CC test_mempool_perf.o
make[5]: *** [/root/SUSE15-64_K4.12.14_Clang5.0.1/x86_64-native-linuxapp-clang/c6768c00774d4a6685fb166b5322995d/dpdk/mk/rte.app.mk:454: testpmd] Error 1
make[4]: *** [/root/SUSE15-64_K4.12.14_Clang5.0.1/x86_64-native-linuxapp-clang/c6768c00774d4a6685fb166b5322995d/dpdk/mk/rte.subdir.mk:37: test-pmd] Error 2
  CC test_mbuf.o
  CC test_logs.o
  CC test_memcpy.o
--
  LD test
/root/SUSE15-64_K4.12.14_Clang5.0.1/x86_64-native-linuxapp-clang/c6768c00774d4a6685fb166b5322995d/dpdk/x86_64-native-linuxapp-clang/lib/librte_pmd_qat.a(qat_sym_frame.o): In function `qat_sym_get_qp':
/root/SUSE15-64_K4.12.14_Clang5.0.1/x86_64-native-linuxapp-clang/c6768c00774d4a6685fb166b5322995d/dpdk/drivers/crypto/qat/qat_sym_frame.c:(.text.experimental+0xe): undefined reference to `rte_cryptodev_get_qp_status'
clang-5.0.1: error: linker command failed with exit code 1 (use -v to see invocation)
make[5]: *** [/root/SUSE15-64_K4.12.14_Clang5.0.1/x86_64-native-linuxapp-clang/c6768c00774d4a6685fb166b5322995d/dpdk/mk/rte.app.mk:454: test] Error 1
make[4]: *** [/root/SUSE15-64_K4.12.14_Clang5.0.1/x86_64-native-linuxapp-clang/c6768c00774d4a6685fb166b5322995d/dpdk/mk/rte.subdir.mk:37: test] Error 2
make[3]: *** [/root/SUSE15-64_K4.12.14_Clang5.0.1/x86_64-native-linuxapp-clang/c6768c00774d4a6685fb166b5322995d/dpdk/mk/rte.sdkbuild.mk:53: app] Error 2
make[2]: *** [/root/SUSE15-64_K4.12.14_Clang5.0.1/x86_64-native-linuxapp-clang/c6768c00774d4a6685fb166b5322995d/dpdk/mk/rte.sdkroot.mk:99: all] Error 2
make[1]: *** [/root/SUSE15-64_K4.12.14_Clang5.0.1/x86_64-native-linuxapp-clang/c6768c00774d4a6685fb166b5322995d/dpdk/mk/rte.sdkinstall.mk:61: pre_install] Error 2
make: *** [/root/SUSE15-64_K4.12.14_Clang5.0.1/x86_64-native-linuxapp-clang/c6768c00774d4a6685fb166b5322995d/dpdk/mk/rte.sdkroot.mk:77: install] Error 2


*Makefile Build Failed #15:
OS: SUSE15-64
Target: x86_64-native-linuxapp-gcc
  CC test_per_lcore.o
/root/SUSE15-64_K4.12.14_GCC7.3.1/x86_64-native-linuxapp-gcc/c6768c00774d4a6685fb166b5322995d/dpdk/x86_64-native-linuxapp-gcc/lib/librte_pmd_qat.a(qat_sym_frame.o): In function `qat_sym_get_qp':
qat_sym_frame.c:(.text.experimental+0x16): undefined reference to `rte_cryptodev_get_qp_status'
collect2: error: ld returned 1 exit status
make[5]: *** [/root/SUSE15-64_K4.12.14_GCC7.3.1/x86_64-native-linuxapp-gcc/c6768c00774d4a6685fb166b5322995d/dpdk/mk/rte.app.mk:454: dpdk-procinfo] Error 1
make[4]: *** [/root/SUSE15-64_K4.12.14_GCC7.3.1/x86_64-native-linuxapp-gcc/c6768c00774d4a6685fb166b5322995d/dpdk/mk/rte.subdir.mk:37: proc-info] Error 2
make[4]: *** Waiting for unfinished jobs....
  CC pipeline_stub.o
/root/SUSE15-64_K4.12.14_GCC7.3.1/x86_64-native-linuxapp-gcc/c6768c00774d4a6685fb166b5322995d/dpdk/x86_64-native-linuxapp-gcc/lib/librte_pmd_qat.a(qat_sym_frame.o): In function `qat_sym_get_qp':
qat_sym_frame.c:(.text.experimental+0x16): undefined reference to `rte_cryptodev_get_qp_status'
collect2: error: ld returned 1 exit status
make[5]: *** [/root/SUSE15-64_K4.12.14_GCC7.3.1/x86_64-native-linuxapp-gcc/c6768c00774d4a6685fb166b5322995d/dpdk/mk/rte.app.mk:454: testacl] Error 1
make[4]: *** [/root/SUSE15-64_K4.12.14_GCC7.3.1/x86_64-native-linuxapp-gcc/c6768c00774d4a6685fb166b5322995d/dpdk/mk/rte.subdir.mk:37: test-acl] Error 2
/root/SUSE15-64_K4.12.14_GCC7.3.1/x86_64-native-linuxapp-gcc/c6768c00774d4a6685fb166b5322995d/dpdk/x86_64-native-linuxapp-gcc/lib/librte_pmd_qat.a(qat_sym_frame.o): In function `qat_sym_get_qp':
qat_sym_frame.c:(.text.experimental+0x16): undefined reference to `rte_cryptodev_get_qp_status'
collect2: error: ld returned 1 exit status
make[5]: *** [/root/SUSE15-64_K4.12.14_GCC7.3.1/x86_64-native-linuxapp-gcc/c6768c00774d4a6685fb166b5322995d/dpdk/mk/rte.app.mk:454: testsad] Error 1
make[4]: *** [/root/SUSE15-64_K4.12.14_GCC7.3.1/x86_64-native-linuxapp-gcc/c6768c00774d4a6685fb166b5322995d/dpdk/mk/rte.subdir.mk:37: test-sad] Error 2
  CC test_atomic.o
  CC test_bbdev_vector.o
/root/SUSE15-64_K4.12.14_GCC7.3.1/x86_64-native-linuxapp-gcc/c6768c00774d4a6685fb166b5322995d/dpdk/x86_64-native-linuxapp-gcc/lib/librte_pmd_qat.a(qat_sym_frame.o): In function `qat_sym_get_qp':
qat_sym_frame.c:(.text.experimental+0x16): undefined reference to `rte_cryptodev_get_qp_status'
collect2: error: ld returned 1 exit status
make[5]: *** [/root/SUSE15-64_K4.12.14_GCC7.3.1/x86_64-native-linuxapp-gcc/c6768c00774d4a6685fb166b5322995d/dpdk/mk/rte.app.mk:454: cmdline_test] Error 1
make[4]: *** [/root/SUSE15-64_K4.12.14_GCC7.3.1/x86_64-native-linuxapp-gcc/c6768c00774d4a6685fb166b5322995d/dpdk/mk/rte.subdir.mk:37: test-cmdline] Error 2
  CC test_barrier.o
/root/SUSE15-64_K4.12.14_GCC7.3.1/x86_64-native-linuxapp-gcc/c6768c00774d4a6685fb166b5322995d/dpdk/x86_64-native-linuxapp-gcc/lib/librte_pmd_qat.a(qat_sym_frame.o): In function `qat_sym_get_qp':
qat_sym_frame.c:(.text.experimental+0x16): undefined reference to `rte_cryptodev_get_qp_status'
collect2: error: ld returned 1 exit status
make[5]: *** [/root/SUSE15-64_K4.12.14_GCC7.3.1/x86_64-native-linuxapp-gcc/c6768c00774d4a6685fb166b5322995d/dpdk/mk/rte.app.mk:454: dpdk-pdump] Error 1
make[4]: *** [/root/SUSE15-64_K4.12.14_GCC7.3.1/x86_64-native-linuxapp-gcc/c6768c00774d4a6685fb166b5322995d/dpdk/mk/rte.subdir.mk:37: pdump] Error 2
  CC test_malloc.o
  CC test_cycles.o
  CC parameters.o
--
  CC test_memory.o
/root/SUSE15-64_K4.12.14_GCC7.3.1/x86_64-native-linuxapp-gcc/c6768c00774d4a6685fb166b5322995d/dpdk/x86_64-native-linuxapp-gcc/lib/librte_pmd_qat.a(qat_sym_frame.o): In function `qat_sym_get_qp':
qat_sym_frame.c:(.text.experimental+0x16): undefined reference to `rte_cryptodev_get_qp_status'
collect2: error: ld returned 1 exit status
make[5]: *** [/root/SUSE15-64_K4.12.14_GCC7.3.1/x86_64-native-linuxapp-gcc/c6768c00774d4a6685fb166b5322995d/dpdk/mk/rte.app.mk:454: testfib] Error 1
make[4]: *** [/root/SUSE15-64_K4.12.14_GCC7.3.1/x86_64-native-linuxapp-gcc/c6768c00774d4a6685fb166b5322995d/dpdk/mk/rte.subdir.mk:37: test-fib] Error 2
  CC test_memzone.o
  CC test_bitmap.o
  CC test_reciprocal_division.o
--
  CC test_table_tables.o
/root/SUSE15-64_K4.12.14_GCC7.3.1/x86_64-native-linuxapp-gcc/c6768c00774d4a6685fb166b5322995d/dpdk/x86_64-native-linuxapp-gcc/lib/librte_pmd_qat.a(qat_sym_frame.o): In function `qat_sym_get_qp':
qat_sym_frame.c:(.text.experimental+0x16): undefined reference to `rte_cryptodev_get_qp_status'
collect2: error: ld returned 1 exit status
make[5]: *** [/root/SUSE15-64_K4.12.14_GCC7.3.1/x86_64-native-linuxapp-gcc/c6768c00774d4a6685fb166b5322995d/dpdk/mk/rte.app.mk:454: testpipeline] Error 1
make[4]: *** [/root/SUSE15-64_K4.12.14_GCC7.3.1/x86_64-native-linuxapp-gcc/c6768c00774d4a6685fb166b5322995d/dpdk/mk/rte.subdir.mk:37: test-pipeline] Error 2
  CC config.o
  CC iofwd.o
  CC test_table_ports.o
--
  CC noisy_vnf.o
/root/SUSE15-64_K4.12.14_GCC7.3.1/x86_64-native-linuxapp-gcc/c6768c00774d4a6685fb166b5322995d/dpdk/x86_64-native-linuxapp-gcc/lib/librte_pmd_qat.a(qat_sym_frame.o): In function `qat_sym_get_qp':
qat_sym_frame.c:(.text.experimental+0x16): undefined reference to `rte_cryptodev_get_qp_status'
collect2: error: ld returned 1 exit status
make[5]: *** [/root/SUSE15-64_K4.12.14_GCC7.3.1/x86_64-native-linuxapp-gcc/c6768c00774d4a6685fb166b5322995d/dpdk/mk/rte.app.mk:454: testbbdev] Error 1
make[4]: *** [/root/SUSE15-64_K4.12.14_GCC7.3.1/x86_64-native-linuxapp-gcc/c6768c00774d4a6685fb166b5322995d/dpdk/mk/rte.subdir.mk:37: test-bbdev] Error 2
  CC test_stack_perf.o
  CC test_timer.o
  CC bpf_cmd.o
--
  CC test_trace_register.o
/root/SUSE15-64_K4.12.14_GCC7.3.1/x86_64-native-linuxapp-gcc/c6768c00774d4a6685fb166b5322995d/dpdk/x86_64-native-linuxapp-gcc/lib/librte_pmd_qat.a(qat_sym_frame.o): In function `qat_sym_get_qp':
qat_sym_frame.c:(.text.experimental+0x16): undefined reference to `rte_cryptodev_get_qp_status'
collect2: error: ld returned 1 exit status
make[5]: *** [/root/SUSE15-64_K4.12.14_GCC7.3.1/x86_64-native-linuxapp-gcc/c6768c00774d4a6685fb166b5322995d/dpdk/mk/rte.app.mk:454: testpmd] Error 1
make[4]: *** [/root/SUSE15-64_K4.12.14_GCC7.3.1/x86_64-native-linuxapp-gcc/c6768c00774d4a6685fb166b5322995d/dpdk/mk/rte.subdir.mk:37: test-pmd] Error 2
  CC test_trace_perf.o
  CC test_service_cores.o
  CC sample_packet_forward.o
--
  LD test
/root/SUSE15-64_K4.12.14_GCC7.3.1/x86_64-native-linuxapp-gcc/c6768c00774d4a6685fb166b5322995d/dpdk/x86_64-native-linuxapp-gcc/lib/librte_pmd_qat.a(qat_sym_frame.o): In function `qat_sym_get_qp':
qat_sym_frame.c:(.text.experimental+0x16): undefined reference to `rte_cryptodev_get_qp_status'
collect2: error: ld returned 1 exit status
make[5]: *** [/root/SUSE15-64_K4.12.14_GCC7.3.1/x86_64-native-linuxapp-gcc/c6768c00774d4a6685fb166b5322995d/dpdk/mk/rte.app.mk:454: test] Error 1
make[4]: *** [/root/SUSE15-64_K4.12.14_GCC7.3.1/x86_64-native-linuxapp-gcc/c6768c00774d4a6685fb166b5322995d/dpdk/mk/rte.subdir.mk:37: test] Error 2
make[3]: *** [/root/SUSE15-64_K4.12.14_GCC7.3.1/x86_64-native-linuxapp-gcc/c6768c00774d4a6685fb166b5322995d/dpdk/mk/rte.sdkbuild.mk:53: app] Error 2
make[2]: *** [/root/SUSE15-64_K4.12.14_GCC7.3.1/x86_64-native-linuxapp-gcc/c6768c00774d4a6685fb166b5322995d/dpdk/mk/rte.sdkroot.mk:99: all] Error 2
make[1]: *** [/root/SUSE15-64_K4.12.14_GCC7.3.1/x86_64-native-linuxapp-gcc/c6768c00774d4a6685fb166b5322995d/dpdk/mk/rte.sdkinstall.mk:61: pre_install] Error 2
make: *** [/root/SUSE15-64_K4.12.14_GCC7.3.1/x86_64-native-linuxapp-gcc/c6768c00774d4a6685fb166b5322995d/dpdk/mk/rte.sdkroot.mk:77: install] Error 2


*Makefile Build Failed #16:
OS: UB1804-64
Target: x86_64-native-linuxapp-gcc
  CC parameters.o
/root/UB1804-64_K4.15.0_GCC7.3.0/x86_64-native-linuxapp-gcc/c6768c00774d4a6685fb166b5322995d/dpdk/x86_64-native-linuxapp-gcc/lib/librte_pmd_qat.a(qat_sym_frame.o): In function `qat_sym_get_qp':
qat_sym_frame.c:(.text.experimental+0x16): undefined reference to `rte_cryptodev_get_qp_status'
collect2: error: ld returned 1 exit status
/root/UB1804-64_K4.15.0_GCC7.3.0/x86_64-native-linuxapp-gcc/c6768c00774d4a6685fb166b5322995d/dpdk/mk/rte.app.mk:452: recipe for target 'cmdline_test' failed
make[5]: *** [cmdline_test] Error 1
/root/UB1804-64_K4.15.0_GCC7.3.0/x86_64-native-linuxapp-gcc/c6768c00774d4a6685fb166b5322995d/dpdk/mk/rte.subdir.mk:35: recipe for target 'test-cmdline' failed
make[4]: *** [test-cmdline] Error 2
make[4]: *** Waiting for unfinished jobs....
  CC test_atomic.o
  CC test_per_lcore.o
--
  CC runtime.o
/root/UB1804-64_K4.15.0_GCC7.3.0/x86_64-native-linuxapp-gcc/c6768c00774d4a6685fb166b5322995d/dpdk/x86_64-native-linuxapp-gcc/lib/librte_pmd_qat.a(qat_sym_frame.o): In function `qat_sym_get_qp':
qat_sym_frame.c:(.text.experimental+0x16): undefined reference to `rte_cryptodev_get_qp_status'
collect2: error: ld returned 1 exit status
/root/UB1804-64_K4.15.0_GCC7.3.0/x86_64-native-linuxapp-gcc/c6768c00774d4a6685fb166b5322995d/dpdk/mk/rte.app.mk:452: recipe for target 'dpdk-procinfo' failed
make[5]: *** [dpdk-procinfo] Error 1
/root/UB1804-64_K4.15.0_GCC7.3.0/x86_64-native-linuxapp-gcc/c6768c00774d4a6685fb166b5322995d/dpdk/mk/rte.subdir.mk:35: recipe for target 'proc-info' failed
make[4]: *** [proc-info] Error 2
  CC pipeline_stub.o
  CC test_barrier.o
  CC test_malloc.o
/root/UB1804-64_K4.15.0_GCC7.3.0/x86_64-native-linuxapp-gcc/c6768c00774d4a6685fb166b5322995d/dpdk/x86_64-native-linuxapp-gcc/lib/librte_pmd_qat.a(qat_sym_frame.o): In function `qat_sym_get_qp':
qat_sym_frame.c:(.text.experimental+0x16): undefined reference to `rte_cryptodev_get_qp_status'
collect2: error: ld returned 1 exit status
/root/UB1804-64_K4.15.0_GCC7.3.0/x86_64-native-linuxapp-gcc/c6768c00774d4a6685fb166b5322995d/dpdk/mk/rte.app.mk:452: recipe for target 'testsad' failed
make[5]: *** [testsad] Error 1
/root/UB1804-64_K4.15.0_GCC7.3.0/x86_64-native-linuxapp-gcc/c6768c00774d4a6685fb166b5322995d/dpdk/x86_64-native-linuxapp-gcc/lib/librte_pmd_qat.a(qat_sym_frame.o): In function `qat_sym_get_qp':
qat_sym_frame.c:(.text.experimental+0x16): undefined reference to `rte_cryptodev_get_qp_status'
collect2: error: ld returned 1 exit status
/root/UB1804-64_K4.15.0_GCC7.3.0/x86_64-native-linuxapp-gcc/c6768c00774d4a6685fb166b5322995d/dpdk/mk/rte.subdir.mk:35: recipe for target 'test-sad' failed
make[4]: *** [test-sad] Error 2
/root/UB1804-64_K4.15.0_GCC7.3.0/x86_64-native-linuxapp-gcc/c6768c00774d4a6685fb166b5322995d/dpdk/mk/rte.app.mk:452: recipe for target 'dpdk-pdump' failed
make[5]: *** [dpdk-pdump] Error 1
/root/UB1804-64_K4.15.0_GCC7.3.0/x86_64-native-linuxapp-gcc/c6768c00774d4a6685fb166b5322995d/dpdk/mk/rte.subdir.mk:35: recipe for target 'pdump' failed
make[4]: *** [pdump] Error 2
/root/UB1804-64_K4.15.0_GCC7.3.0/x86_64-native-linuxapp-gcc/c6768c00774d4a6685fb166b5322995d/dpdk/x86_64-native-linuxapp-gcc/lib/librte_pmd_qat.a(qat_sym_frame.o): In function `qat_sym_get_qp':
qat_sym_frame.c:(.text.experimental+0x16): undefined reference to `rte_cryptodev_get_qp_status'
collect2: error: ld returned 1 exit status
  CC cmdline.o
/root/UB1804-64_K4.15.0_GCC7.3.0/x86_64-native-linuxapp-gcc/c6768c00774d4a6685fb166b5322995d/dpdk/mk/rte.app.mk:452: recipe for target 'testfib' failed
make[5]: *** [testfib] Error 1
/root/UB1804-64_K4.15.0_GCC7.3.0/x86_64-native-linuxapp-gcc/c6768c00774d4a6685fb166b5322995d/dpdk/mk/rte.subdir.mk:35: recipe for target 'test-fib' failed
make[4]: *** [test-fib] Error 2
  CC cmdline_flow.o
  CC test_cycles.o
  CC test_mcslock.o
/root/UB1804-64_K4.15.0_GCC7.3.0/x86_64-native-linuxapp-gcc/c6768c00774d4a6685fb166b5322995d/dpdk/x86_64-native-linuxapp-gcc/lib/librte_pmd_qat.a(qat_sym_frame.o): In function `qat_sym_get_qp':
qat_sym_frame.c:(.text.experimental+0x16): undefined reference to `rte_cryptodev_get_qp_status'
collect2: error: ld returned 1 exit status
/root/UB1804-64_K4.15.0_GCC7.3.0/x86_64-native-linuxapp-gcc/c6768c00774d4a6685fb166b5322995d/dpdk/mk/rte.app.mk:452: recipe for target 'testacl' failed
make[5]: *** [testacl] Error 1
/root/UB1804-64_K4.15.0_GCC7.3.0/x86_64-native-linuxapp-gcc/c6768c00774d4a6685fb166b5322995d/dpdk/mk/rte.subdir.mk:35: recipe for target 'test-acl' failed
make[4]: *** [test-acl] Error 2
  CC test_bbdev_vector.o
  CC test_spinlock.o
  CC pipeline_hash.o
--
  CC test_ring_rts_stress.o
/root/UB1804-64_K4.15.0_GCC7.3.0/x86_64-native-linuxapp-gcc/c6768c00774d4a6685fb166b5322995d/dpdk/x86_64-native-linuxapp-gcc/lib/librte_pmd_qat.a(qat_sym_frame.o): In function `qat_sym_get_qp':
qat_sym_frame.c:(.text.experimental+0x16): undefined reference to `rte_cryptodev_get_qp_status'
collect2: error: ld returned 1 exit status
/root/UB1804-64_K4.15.0_GCC7.3.0/x86_64-native-linuxapp-gcc/c6768c00774d4a6685fb166b5322995d/dpdk/mk/rte.app.mk:452: recipe for target 'testpipeline' failed
make[5]: *** [testpipeline] Error 1
/root/UB1804-64_K4.15.0_GCC7.3.0/x86_64-native-linuxapp-gcc/c6768c00774d4a6685fb166b5322995d/dpdk/mk/rte.subdir.mk:35: recipe for target 'test-pipeline' failed
make[4]: *** [test-pipeline] Error 2
  CC test_ring_stress.o
  CC flowgen.o
  CC rxonly.o
--
  CC test_rwlock.o
/root/UB1804-64_K4.15.0_GCC7.3.0/x86_64-native-linuxapp-gcc/c6768c00774d4a6685fb166b5322995d/dpdk/x86_64-native-linuxapp-gcc/lib/librte_pmd_qat.a(qat_sym_frame.o): In function `qat_sym_get_qp':
qat_sym_frame.c:(.text.experimental+0x16): undefined reference to `rte_cryptodev_get_qp_status'
collect2: error: ld returned 1 exit status
/root/UB1804-64_K4.15.0_GCC7.3.0/x86_64-native-linuxapp-gcc/c6768c00774d4a6685fb166b5322995d/dpdk/mk/rte.app.mk:452: recipe for target 'testbbdev' failed
make[5]: *** [testbbdev] Error 1
/root/UB1804-64_K4.15.0_GCC7.3.0/x86_64-native-linuxapp-gcc/c6768c00774d4a6685fb166b5322995d/dpdk/mk/rte.subdir.mk:35: recipe for target 'test-bbdev' failed
make[4]: *** [test-bbdev] Error 2
  CC test_stack.o
  CC test_stack_perf.o
  CC test_timer.o
--
  CC test_fib_perf.o
/root/UB1804-64_K4.15.0_GCC7.3.0/x86_64-native-linuxapp-gcc/c6768c00774d4a6685fb166b5322995d/dpdk/x86_64-native-linuxapp-gcc/lib/librte_pmd_qat.a(qat_sym_frame.o): In function `qat_sym_get_qp':
qat_sym_frame.c:(.text.experimental+0x16): undefined reference to `rte_cryptodev_get_qp_status'
collect2: error: ld returned 1 exit status
/root/UB1804-64_K4.15.0_GCC7.3.0/x86_64-native-linuxapp-gcc/c6768c00774d4a6685fb166b5322995d/dpdk/mk/rte.app.mk:452: recipe for target 'testpmd' failed
make[5]: *** [testpmd] Error 1
/root/UB1804-64_K4.15.0_GCC7.3.0/x86_64-native-linuxapp-gcc/c6768c00774d4a6685fb166b5322995d/dpdk/mk/rte.subdir.mk:35: recipe for target 'test-pmd' failed
make[4]: *** [test-pmd] Error 2
  CC test_lpm.o
  CC test_fib6_perf.o
  CC test_lpm_perf.o
--
  LD test
/root/UB1804-64_K4.15.0_GCC7.3.0/x86_64-native-linuxapp-gcc/c6768c00774d4a6685fb166b5322995d/dpdk/x86_64-native-linuxapp-gcc/lib/librte_pmd_qat.a(qat_sym_frame.o): In function `qat_sym_get_qp':
qat_sym_frame.c:(.text.experimental+0x16): undefined reference to `rte_cryptodev_get_qp_status'
collect2: error: ld returned 1 exit status
/root/UB1804-64_K4.15.0_GCC7.3.0/x86_64-native-linuxapp-gcc/c6768c00774d4a6685fb166b5322995d/dpdk/mk/rte.app.mk:452: recipe for target 'test' failed
make[5]: *** [test] Error 1
/root/UB1804-64_K4.15.0_GCC7.3.0/x86_64-native-linuxapp-gcc/c6768c00774d4a6685fb166b5322995d/dpdk/mk/rte.subdir.mk:35: recipe for target 'test' failed
make[4]: *** [test] Error 2
/root/UB1804-64_K4.15.0_GCC7.3.0/x86_64-native-linuxapp-gcc/c6768c00774d4a6685fb166b5322995d/dpdk/mk/rte.sdkbuild.mk:51: recipe for target 'app' failed
make[3]: *** [app] Error 2
/root/UB1804-64_K4.15.0_GCC7.3.0/x86_64-native-linuxapp-gcc/c6768c00774d4a6685fb166b5322995d/dpdk/mk/rte.sdkroot.mk:98: recipe for target 'all' failed
make[2]: *** [all] Error 2
/root/UB1804-64_K4.15.0_GCC7.3.0/x86_64-native-linuxapp-gcc/c6768c00774d4a6685fb166b5322995d/dpdk/mk/rte.sdkinstall.mk:60: recipe for target 'pre_install' failed
make[1]: *** [pre_install] Error 2
/root/UB1804-64_K4.15.0_GCC7.3.0/x86_64-native-linuxapp-gcc/c6768c00774d4a6685fb166b5322995d/dpdk/mk/rte.sdkroot.mk:77: recipe for target 'install' failed
make: *** [install] Error 2


*Makefile Build Failed #17:
OS: UB2004-64
Target: x86_64-native-linuxapp-clang
  CC test_resource.o
/usr/bin/ld: /root/UB2004-64_K5.4.0_Clang10.0.0/x86_64-native-linuxapp-clang/c6768c00774d4a6685fb166b5322995d/dpdk/x86_64-native-linuxapp-clang/lib/librte_pmd_qat.a(qat_sym_frame.o): in function `qat_sym_get_qp':
qat_sym_frame.c:(.text.experimental+0xe): undefined reference to `rte_cryptodev_get_qp_status'
clang: error: linker command failed with exit code 1 (use -v to see invocation)
make[5]: *** [/root/UB2004-64_K5.4.0_Clang10.0.0/x86_64-native-linuxapp-clang/c6768c00774d4a6685fb166b5322995d/dpdk/mk/rte.app.mk:454: cmdline_test] Error 1
make[4]: *** [/root/UB2004-64_K5.4.0_Clang10.0.0/x86_64-native-linuxapp-clang/c6768c00774d4a6685fb166b5322995d/dpdk/mk/rte.subdir.mk:35: test-cmdline] Error 2
make[4]: *** Waiting for unfinished jobs....
/usr/bin/ld: /root/UB2004-64_K5.4.0_Clang10.0.0/x86_64-native-linuxapp-clang/c6768c00774d4a6685fb166b5322995d/dpdk/x86_64-native-linuxapp-clang/lib/librte_pmd_qat.a(qat_sym_frame.o): in function `qat_sym_get_qp':
qat_sym_frame.c:(.text.experimental+0xe): undefined reference to `rte_cryptodev_get_qp_status'
--
  CC test_prefetch.o
/usr/bin/ld: /root/UB2004-64_K5.4.0_Clang10.0.0/x86_64-native-linuxapp-clang/c6768c00774d4a6685fb166b5322995d/dpdk/x86_64-native-linuxapp-clang/lib/librte_pmd_qat.a(qat_sym_frame.o): in function `qat_sym_get_qp':
qat_sym_frame.c:(.text.experimental+0xe): undefined reference to `rte_cryptodev_get_qp_status'
clang: error: linker command failed with exit code 1 (use -v to see invocation)
make[5]: *** [/root/UB2004-64_K5.4.0_Clang10.0.0/x86_64-native-linuxapp-clang/c6768c00774d4a6685fb166b5322995d/dpdk/mk/rte.app.mk:454: testacl] Error 1
make[4]: *** [/root/UB2004-64_K5.4.0_Clang10.0.0/x86_64-native-linuxapp-clang/c6768c00774d4a6685fb166b5322995d/dpdk/mk/rte.subdir.mk:35: test-acl] Error 2
  CC parameters.o
  CC cmdline.o
/usr/bin/ld: /root/UB2004-64_K5.4.0_Clang10.0.0/x86_64-native-linuxapp-clang/c6768c00774d4a6685fb166b5322995d/dpdk/x86_64-native-linuxapp-clang/lib/librte_pmd_qat.a(qat_sym_frame.o): in function `qat_sym_get_qp':
qat_sym_frame.c:(.text.experimental+0xe): undefined reference to `rte_cryptodev_get_qp_status'
  CC test_byteorder.o
clang: error: linker command failed with exit code 1 (use -v to see invocation)
make[5]: *** [/root/UB2004-64_K5.4.0_Clang10.0.0/x86_64-native-linuxapp-clang/c6768c00774d4a6685fb166b5322995d/dpdk/mk/rte.app.mk:454: dpdk-procinfo] Error 1
make[4]: *** [/root/UB2004-64_K5.4.0_Clang10.0.0/x86_64-native-linuxapp-clang/c6768c00774d4a6685fb166b5322995d/dpdk/mk/rte.subdir.mk:35: proc-info] Error 2
  CC test_per_lcore.o
clang: error: linker command failed with exit code 1 (use -v to see invocation)
make[5]: *** [/root/UB2004-64_K5.4.0_Clang10.0.0/x86_64-native-linuxapp-clang/c6768c00774d4a6685fb166b5322995d/dpdk/mk/rte.app.mk:454: testsad] Error 1
make[4]: *** [/root/UB2004-64_K5.4.0_Clang10.0.0/x86_64-native-linuxapp-clang/c6768c00774d4a6685fb166b5322995d/dpdk/mk/rte.subdir.mk:35: test-sad] Error 2
  CC pipeline_stub.o
  CC test_atomic.o
clang: error: linker command failed with exit code 1 (use -v to see invocation)
make[5]: *** [/root/UB2004-64_K5.4.0_Clang10.0.0/x86_64-native-linuxapp-clang/c6768c00774d4a6685fb166b5322995d/dpdk/mk/rte.app.mk:454: dpdk-pdump] Error 1
  CC test_barrier.o
make[4]: *** [/root/UB2004-64_K5.4.0_Clang10.0.0/x86_64-native-linuxapp-clang/c6768c00774d4a6685fb166b5322995d/dpdk/mk/rte.subdir.mk:35: pdump] Error 2
  CC pipeline_hash.o
/usr/bin/ld: /root/UB2004-64_K5.4.0_Clang10.0.0/x86_64-native-linuxapp-clang/c6768c00774d4a6685fb166b5322995d/dpdk/x86_64-native-linuxapp-clang/lib/librte_pmd_qat.a(qat_sym_frame.o): in function `qat_sym_get_qp':
qat_sym_frame.c:(.text.experimental+0xe): undefined reference to `rte_cryptodev_get_qp_status'
  CC test_malloc.o
  CC test_cycles.o
clang: error: linker command failed with exit code 1 (use -v to see invocation)
make[5]: *** [/root/UB2004-64_K5.4.0_Clang10.0.0/x86_64-native-linuxapp-clang/c6768c00774d4a6685fb166b5322995d/dpdk/mk/rte.app.mk:454: testfib] Error 1
make[4]: *** [/root/UB2004-64_K5.4.0_Clang10.0.0/x86_64-native-linuxapp-clang/c6768c00774d4a6685fb166b5322995d/dpdk/mk/rte.subdir.mk:35: test-fib] Error 2
  CC pipeline_lpm.o
  CC pipeline_lpm_ipv6.o
  CC test_mcslock.o
--
/usr/bin/ld: /root/UB2004-64_K5.4.0_Clang10.0.0/x86_64-native-linuxapp-clang/c6768c00774d4a6685fb166b5322995d/dpdk/x86_64-native-linuxapp-clang/lib/librte_pmd_qat.a(qat_sym_frame.o): in function `qat_sym_get_qp':
qat_sym_frame.c:(.text.experimental+0xe): undefined reference to `rte_cryptodev_get_qp_status'
  CC test_ring_stress.o
clang: error: linker command failed with exit code 1 (use -v to see invocation)
make[5]: *** [/root/UB2004-64_K5.4.0_Clang10.0.0/x86_64-native-linuxapp-clang/c6768c00774d4a6685fb166b5322995d/dpdk/mk/rte.app.mk:454: testpipeline] Error 1
make[4]: *** [/root/UB2004-64_K5.4.0_Clang10.0.0/x86_64-native-linuxapp-clang/c6768c00774d4a6685fb166b5322995d/dpdk/mk/rte.subdir.mk:35: test-pipeline] Error 2
  CC macswap.o
  CC flowgen.o
  CC rxonly.o
--
/usr/bin/ld: /root/UB2004-64_K5.4.0_Clang10.0.0/x86_64-native-linuxapp-clang/c6768c00774d4a6685fb166b5322995d/dpdk/x86_64-native-linuxapp-clang/lib/librte_pmd_qat.a(qat_sym_frame.o): in function `qat_sym_get_qp':
qat_sym_frame.c:(.text.experimental+0xe): undefined reference to `rte_cryptodev_get_qp_status'
  CC test_stack.o
clang: error: linker command failed with exit code 1 (use -v to see invocation)
  CC test_stack_perf.o
  CC test_timer.o
make[5]: *** [/root/UB2004-64_K5.4.0_Clang10.0.0/x86_64-native-linuxapp-clang/c6768c00774d4a6685fb166b5322995d/dpdk/mk/rte.app.mk:454: testbbdev] Error 1
make[4]: *** [/root/UB2004-64_K5.4.0_Clang10.0.0/x86_64-native-linuxapp-clang/c6768c00774d4a6685fb166b5322995d/dpdk/mk/rte.subdir.mk:35: test-bbdev] Error 2
  CC test_timer_perf.o
  CC test_timer_racecond.o
  CC test_timer_secondary.o
--
qat_sym_frame.c:(.text.experimental+0xe): undefined reference to `rte_cryptodev_get_qp_status'
  CC test_hash_multiwriter.o
  CC test_hash_readwrite.o
clang: error: linker command failed with exit code 1 (use -v to see invocation)
make[5]: *** [/root/UB2004-64_K5.4.0_Clang10.0.0/x86_64-native-linuxapp-clang/c6768c00774d4a6685fb166b5322995d/dpdk/mk/rte.app.mk:454: testpmd] Error 1
make[4]: *** [/root/UB2004-64_K5.4.0_Clang10.0.0/x86_64-native-linuxapp-clang/c6768c00774d4a6685fb166b5322995d/dpdk/mk/rte.subdir.mk:35: test-pmd] Error 2
  CC test_hash_readwrite_lf_perf.o
  CC test_rib.o
  CC test_rib6.o
--
  LD test
/usr/bin/ld: /root/UB2004-64_K5.4.0_Clang10.0.0/x86_64-native-linuxapp-clang/c6768c00774d4a6685fb166b5322995d/dpdk/x86_64-native-linuxapp-clang/lib/librte_pmd_qat.a(qat_sym_frame.o): in function `qat_sym_get_qp':
qat_sym_frame.c:(.text.experimental+0xe): undefined reference to `rte_cryptodev_get_qp_status'
clang: error: linker command failed with exit code 1 (use -v to see invocation)
make[5]: *** [/root/UB2004-64_K5.4.0_Clang10.0.0/x86_64-native-linuxapp-clang/c6768c00774d4a6685fb166b5322995d/dpdk/mk/rte.app.mk:454: test] Error 1
make[4]: *** [/root/UB2004-64_K5.4.0_Clang10.0.0/x86_64-native-linuxapp-clang/c6768c00774d4a6685fb166b5322995d/dpdk/mk/rte.subdir.mk:35: test] Error 2
make[3]: *** [/root/UB2004-64_K5.4.0_Clang10.0.0/x86_64-native-linuxapp-clang/c6768c00774d4a6685fb166b5322995d/dpdk/mk/rte.sdkbuild.mk:53: app] Error 2
make[2]: *** [/root/UB2004-64_K5.4.0_Clang10.0.0/x86_64-native-linuxapp-clang/c6768c00774d4a6685fb166b5322995d/dpdk/mk/rte.sdkroot.mk:99: all] Error 2
make[1]: *** [/root/UB2004-64_K5.4.0_Clang10.0.0/x86_64-native-linuxapp-clang/c6768c00774d4a6685fb166b5322995d/dpdk/mk/rte.sdkinstall.mk:61: pre_install] Error 2
make: *** [/root/UB2004-64_K5.4.0_Clang10.0.0/x86_64-native-linuxapp-clang/c6768c00774d4a6685fb166b5322995d/dpdk/mk/rte.sdkroot.mk:77: install] Error 2


*Makefile Build Failed #18:
OS: UB2004-64
Target: x86_64-native-linuxapp-gcc
qat_sym_frame.c:(.text.experimental+0x18): undefined reference to `rte_cryptodev_get_qp_status'
/usr/bin/ld: /root/UB2004-64_K5.4.0_GCC9.3.0/x86_64-native-linuxapp-gcc/c6768c00774d4a6685fb166b5322995d/dpdk/x86_64-native-linuxapp-gcc/lib/librte_pmd_qat.a(qat_sym_frame.o): in function `qat_sym_get_qp':
qat_sym_frame.c:(.text.experimental+0x18): undefined reference to `rte_cryptodev_get_qp_status'
collect2: error: ld returned 1 exit status
make[5]: *** [/root/UB2004-64_K5.4.0_GCC9.3.0/x86_64-native-linuxapp-gcc/c6768c00774d4a6685fb166b5322995d/dpdk/mk/rte.app.mk:454: testsad] Error 1
make[4]: *** [/root/UB2004-64_K5.4.0_GCC9.3.0/x86_64-native-linuxapp-gcc/c6768c00774d4a6685fb166b5322995d/dpdk/mk/rte.subdir.mk:37: test-sad] Error 2
make[4]: *** Waiting for unfinished jobs....
  CC test_barrier.o
  CC test_malloc.o
collect2: error: ld returned 1 exit status
make[5]: *** [/root/UB2004-64_K5.4.0_GCC9.3.0/x86_64-native-linuxapp-gcc/c6768c00774d4a6685fb166b5322995d/dpdk/mk/rte.app.mk:454: cmdline_test] Error 1
make[4]: *** [/root/UB2004-64_K5.4.0_GCC9.3.0/x86_64-native-linuxapp-gcc/c6768c00774d4a6685fb166b5322995d/dpdk/mk/rte.subdir.mk:37: test-cmdline] Error 2
  CC test_cycles.o
collect2: error: ld returned 1 exit status
make[5]: *** [/root/UB2004-64_K5.4.0_GCC9.3.0/x86_64-native-linuxapp-gcc/c6768c00774d4a6685fb166b5322995d/dpdk/mk/rte.app.mk:454: testacl] Error 1
make[4]: *** [/root/UB2004-64_K5.4.0_GCC9.3.0/x86_64-native-linuxapp-gcc/c6768c00774d4a6685fb166b5322995d/dpdk/mk/rte.subdir.mk:37: test-acl] Error 2
  CC runtime.o
  CC test_mcslock.o
/usr/bin/ld: /root/UB2004-64_K5.4.0_GCC9.3.0/x86_64-native-linuxapp-gcc/c6768c00774d4a6685fb166b5322995d/dpdk/x86_64-native-linuxapp-gcc/lib/librte_pmd_qat.a(qat_sym_frame.o): in function `qat_sym_get_qp':
--
  CC test_spinlock.o
/usr/bin/ld: /root/UB2004-64_K5.4.0_GCC9.3.0/x86_64-native-linuxapp-gcc/c6768c00774d4a6685fb166b5322995d/dpdk/x86_64-native-linuxapp-gcc/lib/librte_pmd_qat.a(qat_sym_frame.o): in function `qat_sym_get_qp':
qat_sym_frame.c:(.text.experimental+0x18): undefined reference to `rte_cryptodev_get_qp_status'
collect2: error: ld returned 1 exit status
make[5]: *** [/root/UB2004-64_K5.4.0_GCC9.3.0/x86_64-native-linuxapp-gcc/c6768c00774d4a6685fb166b5322995d/dpdk/mk/rte.app.mk:454: dpdk-procinfo] Error 1
  CC test_ticketlock.o
make[4]: *** [/root/UB2004-64_K5.4.0_GCC9.3.0/x86_64-native-linuxapp-gcc/c6768c00774d4a6685fb166b5322995d/dpdk/mk/rte.subdir.mk:37: proc-info] Error 2
  CC test_memory.o
collect2: error: ld returned 1 exit status
make[5]: *** [/root/UB2004-64_K5.4.0_GCC9.3.0/x86_64-native-linuxapp-gcc/c6768c00774d4a6685fb166b5322995d/dpdk/mk/rte.app.mk:454: dpdk-pdump] Error 1
make[4]: *** [/root/UB2004-64_K5.4.0_GCC9.3.0/x86_64-native-linuxapp-gcc/c6768c00774d4a6685fb166b5322995d/dpdk/mk/rte.subdir.mk:37: pdump] Error 2
  CC test_memzone.o
  CC test_bitmap.o
  CC test_reciprocal_division.o
collect2: error: ld returned 1 exit status
make[5]: *** [/root/UB2004-64_K5.4.0_GCC9.3.0/x86_64-native-linuxapp-gcc/c6768c00774d4a6685fb166b5322995d/dpdk/mk/rte.app.mk:454: testfib] Error 1
make[4]: *** [/root/UB2004-64_K5.4.0_GCC9.3.0/x86_64-native-linuxapp-gcc/c6768c00774d4a6685fb166b5322995d/dpdk/mk/rte.subdir.mk:37: test-fib] Error 2
  CC cmdline.o
  CC test_reciprocal_division_perf.o
  CC pipeline_stub.o
--
qat_sym_frame.c:(.text.experimental+0x18): undefined reference to `rte_cryptodev_get_qp_status'
  CC cmdline_mtr.o
  CC test_rwlock.o
collect2: error: ld returned 1 exit status
make[5]: *** [/root/UB2004-64_K5.4.0_GCC9.3.0/x86_64-native-linuxapp-gcc/c6768c00774d4a6685fb166b5322995d/dpdk/mk/rte.app.mk:454: testpipeline] Error 1
make[4]: *** [/root/UB2004-64_K5.4.0_GCC9.3.0/x86_64-native-linuxapp-gcc/c6768c00774d4a6685fb166b5322995d/dpdk/mk/rte.subdir.mk:37: test-pipeline] Error 2
  CC cmdline_tm.o
  CC test_stack.o
  CC test_stack_perf.o
--
/usr/bin/ld: /root/UB2004-64_K5.4.0_GCC9.3.0/x86_64-native-linuxapp-gcc/c6768c00774d4a6685fb166b5322995d/dpdk/x86_64-native-linuxapp-gcc/lib/librte_pmd_qat.a(qat_sym_frame.o): in function `qat_sym_get_qp':
qat_sym_frame.c:(.text.experimental+0x18): undefined reference to `rte_cryptodev_get_qp_status'
  CC test_hash_functions.o
collect2: error: ld returned 1 exit status
make[5]: *** [/root/UB2004-64_K5.4.0_GCC9.3.0/x86_64-native-linuxapp-gcc/c6768c00774d4a6685fb166b5322995d/dpdk/mk/rte.app.mk:454: testbbdev] Error 1
make[4]: *** [/root/UB2004-64_K5.4.0_GCC9.3.0/x86_64-native-linuxapp-gcc/c6768c00774d4a6685fb166b5322995d/dpdk/mk/rte.subdir.mk:37: test-bbdev] Error 2
  CC test_hash_multiwriter.o
  CC test_hash_readwrite.o
  CC bpf_cmd.o
--
  CC test_cmdline_string.o
  CC test_cmdline_lib.o
  CC test_crc.o
collect2: error: ld returned 1 exit status
make[5]: *** [/root/UB2004-64_K5.4.0_GCC9.3.0/x86_64-native-linuxapp-gcc/c6768c00774d4a6685fb166b5322995d/dpdk/mk/rte.app.mk:454: testpmd] Error 1
make[4]: *** [/root/UB2004-64_K5.4.0_GCC9.3.0/x86_64-native-linuxapp-gcc/c6768c00774d4a6685fb166b5322995d/dpdk/mk/rte.subdir.mk:37: test-pmd] Error 2
  CC test_red.o
  CC test_sched.o
  CC test_meter.o
--
  LD test
/usr/bin/ld: /root/UB2004-64_K5.4.0_GCC9.3.0/x86_64-native-linuxapp-gcc/c6768c00774d4a6685fb166b5322995d/dpdk/x86_64-native-linuxapp-gcc/lib/librte_pmd_qat.a(qat_sym_frame.o): in function `qat_sym_get_qp':
qat_sym_frame.c:(.text.experimental+0x18): undefined reference to `rte_cryptodev_get_qp_status'
collect2: error: ld returned 1 exit status
make[5]: *** [/root/UB2004-64_K5.4.0_GCC9.3.0/x86_64-native-linuxapp-gcc/c6768c00774d4a6685fb166b5322995d/dpdk/mk/rte.app.mk:454: test] Error 1
make[4]: *** [/root/UB2004-64_K5.4.0_GCC9.3.0/x86_64-native-linuxapp-gcc/c6768c00774d4a6685fb166b5322995d/dpdk/mk/rte.subdir.mk:37: test] Error 2
make[3]: *** [/root/UB2004-64_K5.4.0_GCC9.3.0/x86_64-native-linuxapp-gcc/c6768c00774d4a6685fb166b5322995d/dpdk/mk/rte.sdkbuild.mk:53: app] Error 2
make[2]: *** [/root/UB2004-64_K5.4.0_GCC9.3.0/x86_64-native-linuxapp-gcc/c6768c00774d4a6685fb166b5322995d/dpdk/mk/rte.sdkroot.mk:99: all] Error 2
make[1]: *** [/root/UB2004-64_K5.4.0_GCC9.3.0/x86_64-native-linuxapp-gcc/c6768c00774d4a6685fb166b5322995d/dpdk/mk/rte.sdkinstall.mk:61: pre_install] Error 2
make: *** [/root/UB2004-64_K5.4.0_GCC9.3.0/x86_64-native-linuxapp-gcc/c6768c00774d4a6685fb166b5322995d/dpdk/mk/rte.sdkroot.mk:77: install] Error 2


*Makefile Build Failed #19:
OS: UB2004-64
Target: x86_64-native-linuxapp-icc
ld: /root/UB2004-64_K5.4.0_ICC19.1.0/x86_64-native-linuxapp-icc/c6768c00774d4a6685fb166b5322995d/dpdk/x86_64-native-linuxapp-icc/lib/librte_pmd_qat.a(qat_sym_frame.o): in function `qat_sym_get_qp':
qat_sym_frame.c:(.text.experimental+0x16): undefined reference to `rte_cryptodev_get_qp_status'
  CC resource.o
make[5]: *** [/root/UB2004-64_K5.4.0_ICC19.1.0/x86_64-native-linuxapp-icc/c6768c00774d4a6685fb166b5322995d/dpdk/mk/rte.app.mk:454: testfib] Error 1
make[4]: *** [/root/UB2004-64_K5.4.0_ICC19.1.0/x86_64-native-linuxapp-icc/c6768c00774d4a6685fb166b5322995d/dpdk/mk/rte.subdir.mk:37: test-fib] Error 2
make[4]: *** Waiting for unfinished jobs....
  CC test_resource.o
  CC pipeline_stub.o
--
qat_sym_frame.c:(.text.experimental+0x16): undefined reference to `rte_cryptodev_get_qp_status'
ld: /root/UB2004-64_K5.4.0_ICC19.1.0/x86_64-native-linuxapp-icc/c6768c00774d4a6685fb166b5322995d/dpdk/x86_64-native-linuxapp-icc/lib/librte_pmd_qat.a(qat_sym_frame.o): in function `qat_sym_get_qp':
qat_sym_frame.c:(.text.experimental+0x16): undefined reference to `rte_cryptodev_get_qp_status'
make[5]: *** [/root/UB2004-64_K5.4.0_ICC19.1.0/x86_64-native-linuxapp-icc/c6768c00774d4a6685fb166b5322995d/dpdk/mk/rte.app.mk:454: testsad] Error 1
make[4]: *** [/root/UB2004-64_K5.4.0_ICC19.1.0/x86_64-native-linuxapp-icc/c6768c00774d4a6685fb166b5322995d/dpdk/mk/rte.subdir.mk:37: test-sad] Error 2
  CC pipeline_lpm.o
  CC parameters.o
ld: /root/UB2004-64_K5.4.0_ICC19.1.0/x86_64-native-linuxapp-icc/c6768c00774d4a6685fb166b5322995d/dpdk/x86_64-native-linuxapp-icc/lib/librte_pmd_qat.a(qat_sym_frame.o): in function `qat_sym_get_qp':
qat_sym_frame.c:(.text.experimental+0x16): undefined reference to `rte_cryptodev_get_qp_status'
make[5]: *** [/root/UB2004-64_K5.4.0_ICC19.1.0/x86_64-native-linuxapp-icc/c6768c00774d4a6685fb166b5322995d/dpdk/mk/rte.app.mk:454: cmdline_test] Error 1
make[4]: *** [/root/UB2004-64_K5.4.0_ICC19.1.0/x86_64-native-linuxapp-icc/c6768c00774d4a6685fb166b5322995d/dpdk/mk/rte.subdir.mk:37: test-cmdline] Error 2
  CC pipeline_lpm_ipv6.o
  CC test_atomic.o
make[5]: *** [/root/UB2004-64_K5.4.0_ICC19.1.0/x86_64-native-linuxapp-icc/c6768c00774d4a6685fb166b5322995d/dpdk/mk/rte.app.mk:454: testacl] Error 1
make[4]: *** [/root/UB2004-64_K5.4.0_ICC19.1.0/x86_64-native-linuxapp-icc/c6768c00774d4a6685fb166b5322995d/dpdk/mk/rte.subdir.mk:37: test-acl] Error 2
  CC test_barrier.o
  CC pipeline_acl.o
  CC test_malloc.o
make[5]: *** [/root/UB2004-64_K5.4.0_ICC19.1.0/x86_64-native-linuxapp-icc/c6768c00774d4a6685fb166b5322995d/dpdk/mk/rte.app.mk:454: dpdk-procinfo] Error 1
make[4]: *** [/root/UB2004-64_K5.4.0_ICC19.1.0/x86_64-native-linuxapp-icc/c6768c00774d4a6685fb166b5322995d/dpdk/mk/rte.subdir.mk:37: proc-info] Error 2
  CC test_cycles.o
ld: /root/UB2004-64_K5.4.0_ICC19.1.0/x86_64-native-linuxapp-icc/c6768c00774d4a6685fb166b5322995d/dpdk/x86_64-native-linuxapp-icc/lib/librte_pmd_qat.a(qat_sym_frame.o): in function `qat_sym_get_qp':
qat_sym_frame.c:(.text.experimental+0x16): undefined reference to `rte_cryptodev_get_qp_status'
  CC test_mcslock.o
make[5]: *** [/root/UB2004-64_K5.4.0_ICC19.1.0/x86_64-native-linuxapp-icc/c6768c00774d4a6685fb166b5322995d/dpdk/mk/rte.app.mk:454: dpdk-pdump] Error 1
make[4]: *** [/root/UB2004-64_K5.4.0_ICC19.1.0/x86_64-native-linuxapp-icc/c6768c00774d4a6685fb166b5322995d/dpdk/mk/rte.subdir.mk:37: pdump] Error 2
  CC test_spinlock.o
  CC test_ticketlock.o
  CC test_memory.o
--
  CC test_pmd_perf.o
ld: /root/UB2004-64_K5.4.0_ICC19.1.0/x86_64-native-linuxapp-icc/c6768c00774d4a6685fb166b5322995d/dpdk/x86_64-native-linuxapp-icc/lib/librte_pmd_qat.a(qat_sym_frame.o): in function `qat_sym_get_qp':
qat_sym_frame.c:(.text.experimental+0x16): undefined reference to `rte_cryptodev_get_qp_status'
make[5]: *** [/root/UB2004-64_K5.4.0_ICC19.1.0/x86_64-native-linuxapp-icc/c6768c00774d4a6685fb166b5322995d/dpdk/mk/rte.app.mk:454: testpipeline] Error 1
make[4]: *** [/root/UB2004-64_K5.4.0_ICC19.1.0/x86_64-native-linuxapp-icc/c6768c00774d4a6685fb166b5322995d/dpdk/mk/rte.subdir.mk:37: test-pipeline] Error 2
  CC test_table.o
  CC test_table_pipeline.o
  CC test_table_tables.o
--
  CC txonly.o
  CC test_bitratestats.o
  CC test_latencystats.o
make[5]: *** [/root/UB2004-64_K5.4.0_ICC19.1.0/x86_64-native-linuxapp-icc/c6768c00774d4a6685fb166b5322995d/dpdk/mk/rte.app.mk:454: testbbdev] Error 1
make[4]: *** [/root/UB2004-64_K5.4.0_ICC19.1.0/x86_64-native-linuxapp-icc/c6768c00774d4a6685fb166b5322995d/dpdk/mk/rte.subdir.mk:37: test-bbdev] Error 2
  CC test_pdump.o
  CC test_cmdline.o
  CC test_cmdline_num.o
--
ld: /root/UB2004-64_K5.4.0_ICC19.1.0/x86_64-native-linuxapp-icc/c6768c00774d4a6685fb166b5322995d/dpdk/x86_64-native-linuxapp-icc/lib/librte_pmd_qat.a(qat_sym_frame.o): in function `qat_sym_get_qp':
qat_sym_frame.c:(.text.experimental+0x16): undefined reference to `rte_cryptodev_get_qp_status'
  CC test_pmd_ring.o
make[5]: *** [/root/UB2004-64_K5.4.0_ICC19.1.0/x86_64-native-linuxapp-icc/c6768c00774d4a6685fb166b5322995d/dpdk/mk/rte.app.mk:454: testpmd] Error 1
make[4]: *** [/root/UB2004-64_K5.4.0_ICC19.1.0/x86_64-native-linuxapp-icc/c6768c00774d4a6685fb166b5322995d/dpdk/mk/rte.subdir.mk:37: test-pmd] Error 2
  CC test_pmd_ring_perf.o
  CC test_cryptodev_blockcipher.o
  CC test_cryptodev.o
--
  LD test
ld: /root/UB2004-64_K5.4.0_ICC19.1.0/x86_64-native-linuxapp-icc/c6768c00774d4a6685fb166b5322995d/dpdk/x86_64-native-linuxapp-icc/lib/librte_pmd_qat.a(qat_sym_frame.o): in function `qat_sym_get_qp':
qat_sym_frame.c:(.text.experimental+0x16): undefined reference to `rte_cryptodev_get_qp_status'
make[5]: *** [/root/UB2004-64_K5.4.0_ICC19.1.0/x86_64-native-linuxapp-icc/c6768c00774d4a6685fb166b5322995d/dpdk/mk/rte.app.mk:454: test] Error 1
make[4]: *** [/root/UB2004-64_K5.4.0_ICC19.1.0/x86_64-native-linuxapp-icc/c6768c00774d4a6685fb166b5322995d/dpdk/mk/rte.subdir.mk:37: test] Error 2
make[3]: *** [/root/UB2004-64_K5.4.0_ICC19.1.0/x86_64-native-linuxapp-icc/c6768c00774d4a6685fb166b5322995d/dpdk/mk/rte.sdkbuild.mk:53: app] Error 2
make[2]: *** [/root/UB2004-64_K5.4.0_ICC19.1.0/x86_64-native-linuxapp-icc/c6768c00774d4a6685fb166b5322995d/dpdk/mk/rte.sdkroot.mk:99: all] Error 2
make[1]: *** [/root/UB2004-64_K5.4.0_ICC19.1.0/x86_64-native-linuxapp-icc/c6768c00774d4a6685fb166b5322995d/dpdk/mk/rte.sdkinstall.mk:61: pre_install] Error 2
make: *** [/root/UB2004-64_K5.4.0_ICC19.1.0/x86_64-native-linuxapp-icc/c6768c00774d4a6685fb166b5322995d/dpdk/mk/rte.sdkroot.mk:77: install] Error 2
DPDK STV team

^ permalink raw reply	[flat|nested] 2+ messages in thread

* [dpdk-test-report]  |FAILURE| pw(72184) [v2, 1/3] crypto/qat: add data-path APIs
@ 2020-06-26  5:28 sys_stv
  0 siblings, 0 replies; 2+ messages in thread
From: sys_stv @ 2020-06-26  5:28 UTC (permalink / raw)
  To: test-report

[-- Attachment #1: Type: text/plain, Size: 84011 bytes --]


Test-Label: Intel-compilation
Test-Status: FAILURE
http://dpdk.org/patch/72184

_Compilation issues_

Submitter: Fan Zhang <roy.fan.zhang@intel.com>
Date: 2020-06-25 13:31:36
Reply_mail: 20200625133138.42827-2-roy.fan.zhang@intel.com

DPDK git baseline: Repo:dpdk-next-crypto, CommitID: 27991115743bc0e1feb2c4ba7a766020d51bdb5d


Meson build Summary: 8 Builds Done, 5 Successful, 3 Failures, 0 Blocked

Makefile build Summary: 20 Builds Done, 1 Successful, 19 Failures, 0 Blocked

                +==============================================+===========+==========+
                |                   Makefile                   |   Meson   | Document |
+----------------+------+-------+------+------------+-----------+-----------+----------+
| os             | gcc  | clang | icc  | gcc+shared | gcc+debug | gcc/clang | pdf/html |
+----------------+------+-------+------+------------+-----------+-----------+----------+
| CENTOS82-64    | FAIL | FAIL  | FAIL | FAIL       | FAIL      | FAIL      |          |
| RHEL82-64      | FAIL |       |      |            |           |           |          |
| UB1804-64      | FAIL |       |      |            |           |           |          |
| FC32-64        | FAIL | FAIL  |      |            |           | FAIL      |          |
| CENTOS77-64    | FAIL |       |      |            |           |           |          |
| UB2004-64      | FAIL | FAIL  | FAIL |            |           | FAIL      | pass     |
| WIN10-64       |      |       |      |            |           | pass      |          |
| UB2004-32      | pass |       |      |            |           |           |          |
| UB1804-32      |      |       |      |            |           | pass      |          |
| FreeBSD1201-64 | FAIL | FAIL  |      | FAIL       | FAIL      | pass      |          |
| SUSE15-64      | FAIL | FAIL  |      |            |           | pass      |          |
+----------------+------+-------+------+------------+-----------+-----------+----------+
Test environment and configuration as below:

** Makefile build **


OS: CENTOS82-64
	Kernel Version: 4.18.0-193.el8.x86_64
	CPU info: Intel(R) Xeon(R) Platinum 8280M CPU @ 2.70GHz
	GCC Version: gcc (GCC) 8.3.1 20191121 (Red Hat 8.3.1-5)
	Clang Version: 9.0.1 (Red Hat 9.0.1-2.module_el8.2.0+309+0c7b6b03)
	x86_64-native-linuxapp-gcc
	x86_64-native-linuxapp-clang
	x86_64-native-linuxapp-icc
	x86_64-native-linuxapp-gcc+shared
	x86_64-native-linuxapp-gcc+debug


OS: RHEL82-64
	Kernel Version: 4.18.0-193.el8.x86_64
	CPU info: Intel(R) Xeon(R) Platinum 8280M CPU @ 2.70GHz
	GCC Version: gcc (GCC) 8.3.1 20191121 (Red Hat 8.3.1-5)
	Clang Version: 8.0.1 (Red Hat 8.0.1-1.module_el8.1.0+215+a01033fb)
	x86_64-native-linuxapp-gcc


OS: UB1804-64
	Kernel Version: 4.15.0-29-generic
	CPU info: Intel(R) Xeon(R) Platinum 8180 CPU @ 2.50GHz
	GCC Version: gcc (Ubuntu 7.5.0-3ubuntu1~18.04) 7.5.0
	Clang Version: 6.0.0-1ubuntu2 (tags/RELEASE_600/final)
	x86_64-native-linuxapp-gcc


OS: FC32-64
	Kernel Version: 5.6.0-0.rc7.git0.2.fc32.x86_64
	CPU info: Intel(R) Xeon(R) Platinum 8280M CPU @ 2.70GHz
	GCC Version: gcc (GCC) 10.0.1 20200311 (Red Hat 10.0.1-0.9)
	Clang Version: 10.0.0 (Fedora 10.0.0-0.3.rc4.fc32)
	x86_64-native-linuxapp-gcc
	x86_64-native-linuxapp-clang


OS: CENTOS77-64
	Kernel Version: 3.10.0-1062.9.1.el7.x86_64
	CPU info: Intel(R) Xeon(R) Platinum 8280M CPU @ 2.70GHz
	GCC Version: gcc (GCC) 4.8.5 20150623 (Red Hat 4.8.5-39)
	Clang Version: 3.4.2 (tags/RELEASE_34/dot2-final)
	x86_64-native-linuxapp-gcc


OS: UB2004-64
	Kernel Version: 5.4.0-26-generic
	CPU info: Intel(R) Xeon(R) Platinum 8180 CPU @ 2.50GHz
	GCC Version: gcc (Ubuntu 10-20200416-0ubuntu1) 10.0.1 20200416 (experimental) [master revision 3c3f12e2a76:dcee354ce56:44b326839d864fc10c459916abcc97f35a9ac3de]
	Clang Version: 10.0.0-4ubuntu1
	x86_64-native-linuxapp-clang
	x86_64-native-linuxapp-gcc
	x86_64-native-linuxapp-icc


OS: UB2004-32
	Kernel Version: 5.4.0-26-generic
	CPU info: Intel(R) Xeon(R) Platinum 8180 CPU @ 2.50GHz
	GCC Version: gcc (Ubuntu 9.3.0-10ubuntu2) 9.3.0
	Clang Version: 10.0.0-4ubuntu1
	i686-native-linuxapp-gcc


OS: FreeBSD1201-64
	Kernel Version: 12.1-RELEASE
	CPU info: Intel(R) Xeon(R) CPU E5-2699 v3 @ 2.30GHz (2294.74-MHz K8-class CPU)
	GCC Version: gcc (FreeBSD Ports Collection) 9.2.0
	Clang Version: 8.0.1 (tags/RELEASE_801/final 366581) (based on LLVM 8.0.1)
	x86_64-native-bsdapp-gcc
	x86_64-native-bsdapp-clang
	x86_64-native-bsdapp-gcc+shared
	x86_64-native-bsdapp-gcc+debug


OS: SUSE15-64
	Kernel Version: 4.12.14-lp150.11-default
	CPU info: Intel(R) Xeon(R) CPU E5-2699 v4 @ 2.20GHz
	GCC Version: gcc (SUSE Linux) 7.3.1 20180323 [gcc-7-branch revision 258812]
	Clang Version: 5.0.1 (tags/RELEASE_501/final 312548)
	x86_64-native-linuxapp-clang
	x86_64-native-linuxapp-gcc

** Meson build **


OS: CENTOS82-64
	Kernel Version: 4.18.0-193.el8.x86_64
	CPU info: Intel(R) Xeon(R) CPU E5-2699 v4 @ 2.20GHz
	GCC Version: gcc (GCC) 8.3.1 20191121 (Red Hat 8.3.1-5)
	Clang Version: 9.0.1 (Red Hat 9.0.1-2.module_el8.2.0+309+0c7b6b03)
	./build-gcc-static
	./build-gcc-shared
	./build-clang-static
	./build-clang-shared
	./build-x86-default


OS: UB2004-64
	Kernel Version: 5.4.0-26-generic
	CPU info: Intel(R) Xeon(R) Platinum 8180 CPU @ 2.50GHz
	GCC Version: gcc (Ubuntu 9.3.0-10ubuntu2) 9.3.0
	Clang Version: 10.0.0-4ubuntu1
	x86_64-native-linuxapp-doc
	./build-gcc-static
	./build-gcc-shared
	./build-clang-static
	./build-clang-shared
	./build-x86-default


OS: FC32-64
	Kernel Version: 5.6.0-0.rc7.git0.2.fc32.x86_64
	CPU info: Intel(R) Xeon(R) CPU E5-2699 v4 @ 2.20GHz
	GCC Version: gcc (GCC) 10.0.1 20200311 (Red Hat 10.0.1-0.9)
	Clang Version: 10.0.0 (Fedora 10.0.0-0.3.rc4.fc32)
	./build-gcc-static
	./build-gcc-shared
	./build-clang-static
	./build-clang-shared
	./build-x86-default


OS: WIN10-64
	Kernel Version: N/A
	CPU info: N/A
	GCC Version: N/A
	Clang Version: Clang 8.0.0
	x86_64-windows-clang


OS: UB1804-32
	Kernel Version: 4.15.0-20-generic
	CPU info: Intel(R) Xeon(R) CPU E5-2699 v4 @ 2.20GHz
	GCC Version: gcc (Ubuntu 7.5.0-3ubuntu1~18.04) 7.5.0
	Clang Version: 6.0.0-1ubuntu2 (tags/RELEASE_600/final)
	./build-gcc-static
	./build-gcc-shared
	./build-clang-static
	./build-clang-shared
	./build-x86-default


OS: FreeBSD1201-64
	Kernel Version: 12.1-RELEASE
	CPU info: Intel(R) Xeon(R) CPU E5-2699 v4 @ 2.20GHz (2194.97-MHz K8-class CPU)
	GCC Version: gcc (FreeBSD Ports Collection) 9.2.0
	Clang Version: 8.0.1 (tags/RELEASE_801/final 366581) (based on LLVM 8.0.1)
	./build-gcc-static
	./build-gcc-shared
	./build-clang-static
	./build-clang-shared
	./build-x86-default


OS: SUSE15-64
	Kernel Version: 4.12.14-lp150.12.82-default
	CPU info: Intel(R) Xeon(R) CPU E5-2699 v4 @ 2.20GHz
	GCC Version: gcc (SUSE Linux) 7.4.1 20190905 [gcc-7-branch revision 275407]
	Clang Version: 5.0.1 (tags/RELEASE_501/final 312548)
	./build-gcc-static
	./build-gcc-shared
	./build-clang-static
	./build-clang-shared
	./build-x86-default



*Meson Build Failed #1:
OS: CENTOS82-64
Target:./build-gcc-static
FAILED: drivers/a715181@@tmp_rte_pmd_qat@sta/crypto_qat_qat_sym_frame.c.o 
gcc -Idrivers/a715181@@tmp_rte_pmd_qat@sta -Idrivers -I../drivers -Idrivers/compress/qat -I../drivers/compress/qat -Idrivers/common/qat -I../drivers/common/qat -I../drivers/common/qat/qat_adf -Idrivers/crypto/qat -I../drivers/crypto/qat -Ilib/librte_compressdev -I../lib/librte_compressdev -I. -I../ -Iconfig -I../config -Ilib/librte_eal/include -I../lib/librte_eal/include -Ilib/librte_eal/linux/include -I../lib/librte_eal/linux/include -Ilib/librte_eal/x86/include -I../lib/librte_eal/x86/include -Ilib/librte_eal/common -I../lib/librte_eal/common -Ilib/librte_eal -I../lib/librte_eal -Ilib/librte_kvargs -I../lib/librte_kvargs -Ilib/librte_telemetry/../librte_metrics -I../lib/librte_telemetry/../librte_metrics -Ilib/librte_telemetry -I../lib/librte_telemetry -Ilib/librte_mbuf -I../lib/librte_mbuf -Ilib/librte_mempool -I../lib/librte_mempool -Ilib/librte_ring -I../lib/librte_ring -Idrivers/bus/pci -I../drivers/bus/pci -I../drivers/bus/pci/linux -Ilib/librte_pci -I../lib/librte_pci -Ilib/librte_cryptodev -I../lib/librte_cryptodev -fdiagnostics-color=always -pipe -D_FILE_OFFSET_BITS=64 -Wall -Winvalid-pch -Werror -O2 -g -include rte_config.h -Wextra -Wcast-qual -Wdeprecated -Wformat-nonliteral -Wformat-security -Wmissing-declarations -Wmissing-prototypes -Wnested-externs -Wold-style-definition -Wpointer-arith -Wsign-compare -Wstrict-prototypes -Wundef -Wwrite-strings -Wno-packed-not-aligned -Wno-missing-field-initializers -D_GNU_SOURCE -fPIC -march=native -mno-avx512f -DALLOW_EXPERIMENTAL_API -DALLOW_INTERNAL_API -Wno-format-truncation -DBUILD_QAT_SYM -DBUILD_QAT_ASYM -MD -MQ 'drivers/a715181@@tmp_rte_pmd_qat@sta/crypto_qat_qat_sym_frame.c.o' -MF 'drivers/a715181@@tmp_rte_pmd_qat@sta/crypto_qat_qat_sym_frame.c.o.d' -o 'drivers/a715181@@tmp_rte_pmd_qat@sta/crypto_qat_qat_sym_frame.c.o' -c ../drivers/crypto/qat/qat_sym_frame.c
../drivers/crypto/qat/qat_sym_frame.c: In function ‘qat_sym_get_qp’:
../drivers/crypto/qat/qat_sym_frame.c:25:7: error: implicit declaration of function ‘rte_cryptodev_get_qp_status’; did you mean ‘rte_cryptodev_get_sec_ctx’? [-Werror=implicit-function-declaration]
  if (!rte_cryptodev_get_qp_status(dev_id, qp_id))
       ^~~~~~~~~~~~~~~~~~~~~~~~~~~
       rte_cryptodev_get_sec_ctx
../drivers/crypto/qat/qat_sym_frame.c:25:7: error: nested extern declaration of ‘rte_cryptodev_get_qp_status’ [-Werror=nested-externs]
cc1: all warnings being treated as errors
[1801/2194] Linking target drivers/librte_pmd_octeontx_compress.so.20.0.3.
[1802/2194] Compiling C object 'drivers/a715181@@tmp_rte_pmd_ifc@sta/vdpa_ifc_base_ifcvf.c.o'.
[1803/2194] Compiling C object 'drivers/a715181@@tmp_rte_pmd_zlib@sta/compress_zlib_zlib_pmd_ops.c.o'.
[1804/2194] Compiling C object 'drivers/a715181@@tmp_rte_pmd_qat@sta/crypto_qat_qat_sym_session.c.o'.
[1805/2194] Compiling C object 'drivers/a715181@@tmp_rte_pmd_qat@sta/compress_qat_qat_comp.c.o'.
[1806/2194] Compiling C object 'drivers/a715181@@tmp_rte_pmd_zlib@sta/compress_zlib_zlib_pmd.c.o'.
[1807/2194] Compiling C object 'drivers/a715181@@tmp_rte_pmd_ifc@sta/vdpa_ifc_ifcvf_vdpa.c.o'.
[1808/2194] Compiling C object 'drivers/a715181@@tmp_rte_pmd_dpaa_event@sta/event_dpaa_dpaa_eventdev.c.o'.
[1809/2194] Compiling C object 'drivers/a715181@@tmp_rte_pmd_qat@sta/crypto_qat_qat_asym.c.o'.
[1810/2194] Compiling C object 'drivers/a715181@@tmp_rte_pmd_octeontx2_crypto@sta/crypto_octeontx2_otx2_cryptodev_ops.c.o'.
[1811/2194] Compiling C object 'drivers/a715181@@tmp_rte_pmd_octeontx_crypto@sta/crypto_octeontx_otx_cryptodev_ops.c.o'.
ninja: build stopped: subcommand failed




*Meson Build Failed #2:
OS: FC32-64
Target:./build-gcc-static
FAILED: drivers/a715181@@tmp_rte_pmd_qat@sta/crypto_qat_qat_sym_frame.c.o 
gcc -Idrivers/a715181@@tmp_rte_pmd_qat@sta -Idrivers -I../drivers -Idrivers/compress/qat -I../drivers/compress/qat -Idrivers/common/qat -I../drivers/common/qat -I../drivers/common/qat/qat_adf -Idrivers/crypto/qat -I../drivers/crypto/qat -Ilib/librte_compressdev -I../lib/librte_compressdev -I. -I../ -Iconfig -I../config -Ilib/librte_eal/include -I../lib/librte_eal/include -Ilib/librte_eal/linux/include -I../lib/librte_eal/linux/include -Ilib/librte_eal/x86/include -I../lib/librte_eal/x86/include -Ilib/librte_eal/common -I../lib/librte_eal/common -Ilib/librte_eal -I../lib/librte_eal -Ilib/librte_kvargs -I../lib/librte_kvargs -Ilib/librte_telemetry/../librte_metrics -I../lib/librte_telemetry/../librte_metrics -Ilib/librte_telemetry -I../lib/librte_telemetry -Ilib/librte_mbuf -I../lib/librte_mbuf -Ilib/librte_mempool -I../lib/librte_mempool -Ilib/librte_ring -I../lib/librte_ring -Idrivers/bus/pci -I../drivers/bus/pci -I../drivers/bus/pci/linux -Ilib/librte_pci -I../lib/librte_pci -Ilib/librte_cryptodev -I../lib/librte_cryptodev -fdiagnostics-color=always -pipe -D_FILE_OFFSET_BITS=64 -Wall -Winvalid-pch -Werror -O2 -g -include rte_config.h -Wextra -Wcast-qual -Wdeprecated -Wformat-nonliteral -Wformat-security -Wmissing-declarations -Wmissing-prototypes -Wnested-externs -Wold-style-definition -Wpointer-arith -Wsign-compare -Wstrict-prototypes -Wundef -Wwrite-strings -Wno-address-of-packed-member -Wno-packed-not-aligned -Wno-missing-field-initializers -Wno-zero-length-bounds -D_GNU_SOURCE -fPIC -march=native -DALLOW_EXPERIMENTAL_API -DALLOW_INTERNAL_API -Wno-format-truncation -DBUILD_QAT_SYM -DBUILD_QAT_ASYM -MD -MQ 'drivers/a715181@@tmp_rte_pmd_qat@sta/crypto_qat_qat_sym_frame.c.o' -MF 'drivers/a715181@@tmp_rte_pmd_qat@sta/crypto_qat_qat_sym_frame.c.o.d' -o 'drivers/a715181@@tmp_rte_pmd_qat@sta/crypto_qat_qat_sym_frame.c.o' -c ../drivers/crypto/qat/qat_sym_frame.c
../drivers/crypto/qat/qat_sym_frame.c: In function ‘qat_sym_get_qp’:
../drivers/crypto/qat/qat_sym_frame.c:25:7: error: implicit declaration of function ‘rte_cryptodev_get_qp_status’; did you mean ‘rte_cryptodev_get_sec_ctx’? [-Werror=implicit-function-declaration]
   25 |  if (!rte_cryptodev_get_qp_status(dev_id, qp_id))
      |       ^~~~~~~~~~~~~~~~~~~~~~~~~~~
      |       rte_cryptodev_get_sec_ctx
../drivers/crypto/qat/qat_sym_frame.c:25:7: error: nested extern declaration of ‘rte_cryptodev_get_qp_status’ [-Werror=nested-externs]
cc1: all warnings being treated as errors
[1803/2195] Compiling C object 'drivers/a715181@@tmp_rte_pmd_qat@sta/compress_qat_qat_comp.c.o'.
[1804/2195] Compiling C object 'drivers/a715181@@tmp_rte_pmd_zlib@sta/compress_zlib_zlib_pmd_ops.c.o'.
[1805/2195] Compiling C object 'drivers/a715181@@tmp_rte_pmd_qat@sta/crypto_qat_qat_sym_session.c.o'.
[1806/2195] Compiling C object 'drivers/a715181@@tmp_rte_pmd_zlib@sta/compress_zlib_zlib_pmd.c.o'.
[1807/2195] Compiling C object 'drivers/a715181@@tmp_rte_pmd_ifc@sta/vdpa_ifc_ifcvf_vdpa.c.o'.
[1808/2195] Compiling C object 'drivers/a715181@@tmp_rte_pmd_dpaa_event@sta/event_dpaa_dpaa_eventdev.c.o'.
[1809/2195] Compiling C object 'drivers/a715181@@tmp_rte_pmd_qat@sta/crypto_qat_qat_asym.c.o'.
[1810/2195] Compiling C object 'drivers/a715181@@tmp_rte_pmd_octeontx2_crypto@sta/crypto_octeontx2_otx2_cryptodev_ops.c.o'.
[1811/2195] Compiling C object 'drivers/a715181@@tmp_rte_pmd_octeontx_crypto@sta/crypto_octeontx_otx_cryptodev_ops.c.o'.
ninja: build stopped: subcommand failed




*Meson Build Failed #3:
OS: UB2004-64
Target:./build-gcc-static
FAILED: drivers/a715181@@tmp_rte_pmd_qat@sta/crypto_qat_qat_sym_frame.c.o 
gcc -Idrivers/a715181@@tmp_rte_pmd_qat@sta -Idrivers -I../drivers -Idrivers/compress/qat -I../drivers/compress/qat -Idrivers/common/qat -I../drivers/common/qat -I../drivers/common/qat/qat_adf -Idrivers/crypto/qat -I../drivers/crypto/qat -Ilib/librte_compressdev -I../lib/librte_compressdev -I. -I../ -Iconfig -I../config -Ilib/librte_eal/include -I../lib/librte_eal/include -Ilib/librte_eal/linux/include -I../lib/librte_eal/linux/include -Ilib/librte_eal/x86/include -I../lib/librte_eal/x86/include -Ilib/librte_eal/common -I../lib/librte_eal/common -Ilib/librte_eal -I../lib/librte_eal -Ilib/librte_kvargs -I../lib/librte_kvargs -Ilib/librte_telemetry/../librte_metrics -I../lib/librte_telemetry/../librte_metrics -Ilib/librte_telemetry -I../lib/librte_telemetry -Ilib/librte_mbuf -I../lib/librte_mbuf -Ilib/librte_mempool -I../lib/librte_mempool -Ilib/librte_ring -I../lib/librte_ring -Idrivers/bus/pci -I../drivers/bus/pci -I../drivers/bus/pci/linux -Ilib/librte_pci -I../lib/librte_pci -Ilib/librte_cryptodev -I../lib/librte_cryptodev -fdiagnostics-color=always -pipe -D_FILE_OFFSET_BITS=64 -Wall -Winvalid-pch -Werror -O2 -g -include rte_config.h -Wextra -Wcast-qual -Wdeprecated -Wformat-nonliteral -Wformat-security -Wmissing-declarations -Wmissing-prototypes -Wnested-externs -Wold-style-definition -Wpointer-arith -Wsign-compare -Wstrict-prototypes -Wundef -Wwrite-strings -Wno-address-of-packed-member -Wno-packed-not-aligned -Wno-missing-field-initializers -D_GNU_SOURCE -fPIC -march=native -DALLOW_EXPERIMENTAL_API -DALLOW_INTERNAL_API -Wno-format-truncation -DBUILD_QAT_SYM -DBUILD_QAT_ASYM -MD -MQ 'drivers/a715181@@tmp_rte_pmd_qat@sta/crypto_qat_qat_sym_frame.c.o' -MF 'drivers/a715181@@tmp_rte_pmd_qat@sta/crypto_qat_qat_sym_frame.c.o.d' -o 'drivers/a715181@@tmp_rte_pmd_qat@sta/crypto_qat_qat_sym_frame.c.o' -c ../drivers/crypto/qat/qat_sym_frame.c
../drivers/crypto/qat/qat_sym_frame.c: In function ‘qat_sym_get_qp’:
../drivers/crypto/qat/qat_sym_frame.c:25:7: error: implicit declaration of function ‘rte_cryptodev_get_qp_status’; did you mean ‘rte_cryptodev_get_sec_ctx’? [-Werror=implicit-function-declaration]
   25 |  if (!rte_cryptodev_get_qp_status(dev_id, qp_id))
      |       ^~~~~~~~~~~~~~~~~~~~~~~~~~~
      |       rte_cryptodev_get_sec_ctx
../drivers/crypto/qat/qat_sym_frame.c:25:7: error: nested extern declaration of ‘rte_cryptodev_get_qp_status’ [-Werror=nested-externs]
cc1: all warnings being treated as errors
[1808/2186] Compiling C object 'drivers/a715181@@tmp_rte_pmd_zlib@sta/compress_zlib_zlib_pmd.c.o'.
[1809/2186] Compiling C object 'drivers/a715181@@tmp_rte_pmd_ifc@sta/vdpa_ifc_ifcvf_vdpa.c.o'.
[1810/2186] Compiling C object 'drivers/a715181@@tmp_rte_pmd_qat@sta/crypto_qat_qat_sym_session.c.o'.
[1811/2186] Compiling C object 'drivers/a715181@@tmp_rte_pmd_dpaa2_event@sta/event_dpaa2_dpaa2_hw_dpcon.c.o'.
[1812/2186] Compiling C object 'drivers/a715181@@tmp_rte_pmd_dpaa_event@sta/event_dpaa_dpaa_eventdev.c.o'.
[1813/2186] Compiling C object 'drivers/a715181@@tmp_rte_pmd_dpaa2_event@sta/event_dpaa2_dpaa2_eventdev.c.o'.
[1814/2186] Compiling C object 'drivers/a715181@@tmp_rte_pmd_octeontx2_event@sta/event_octeontx2_otx2_evdev_irq.c.o'.
[1815/2186] Compiling C object 'drivers/a715181@@tmp_rte_pmd_dpaa2_event@sta/event_dpaa2_dpaa2_eventdev_selftest.c.o'.
[1816/2186] Compiling C object 'drivers/a715181@@tmp_rte_pmd_qat@sta/crypto_qat_qat_asym.c.o'.
[1817/2186] Compiling C object 'drivers/a715181@@tmp_rte_pmd_octeontx_crypto@sta/crypto_octeontx_otx_cryptodev_ops.c.o'.
[1818/2186] Compiling C object 'drivers/a715181@@tmp_rte_pmd_octeontx2_event@sta/event_octeontx2_otx2_evdev.c.o'.
ninja: build stopped: subcommand failed



*Makefile Build Failed #1:
OS: CENTOS77-64
Target: x86_64-native-linuxapp-gcc
  CC test_atomic.o
/root/CENTOS77-64_K3.10.0_GCC4.8.5/x86_64-native-linuxapp-gcc/c6768c00774d4a6685fb166b5322995d/dpdk/x86_64-native-linuxapp-gcc/lib/librte_pmd_qat.a(qat_sym_frame.o): In function `qat_sym_get_qp':
qat_sym_frame.c:(.text.experimental+0x16): undefined reference to `rte_cryptodev_get_qp_status'
collect2: error: ld returned 1 exit status
make[5]: *** [dpdk-procinfo] Error 1
make[4]: *** [proc-info] Error 2
make[4]: *** Waiting for unfinished jobs....
  CC parameters.o
  CC test_barrier.o
--
  LD testpmd
/root/CENTOS77-64_K3.10.0_GCC4.8.5/x86_64-native-linuxapp-gcc/c6768c00774d4a6685fb166b5322995d/dpdk/x86_64-native-linuxapp-gcc/lib/librte_pmd_qat.a(qat_sym_frame.o): In function `qat_sym_get_qp':
qat_sym_frame.c:(.text.experimental+0x16): undefined reference to `rte_cryptodev_get_qp_status'
collect2: error: ld returned 1 exit status
make[5]: *** [testpmd] Error 1
make[4]: *** [test-pmd] Error 2
  CC test_ring_peek_stress.o
  CC test_ring_rts_stress.o
  CC test_ring_stress.o
--
  LD test
/root/CENTOS77-64_K3.10.0_GCC4.8.5/x86_64-native-linuxapp-gcc/c6768c00774d4a6685fb166b5322995d/dpdk/x86_64-native-linuxapp-gcc/lib/librte_pmd_qat.a(qat_sym_frame.o): In function `qat_sym_get_qp':
qat_sym_frame.c:(.text.experimental+0x16): undefined reference to `rte_cryptodev_get_qp_status'
collect2: error: ld returned 1 exit status
make[5]: *** [test] Error 1
make[4]: *** [test] Error 2
make[3]: *** [app] Error 2
make[2]: *** [all] Error 2
make[1]: *** [pre_install] Error 2
make: *** [install] Error 2


*Makefile Build Failed #2:
OS: CENTOS82-64
Target: x86_64-native-linuxapp-gcc
  CC test_per_lcore.o
/root/CENTOS82-64_K4.18.0_GCC8.3.1/x86_64-native-linuxapp-gcc/c6768c00774d4a6685fb166b5322995d/dpdk/x86_64-native-linuxapp-gcc/lib/librte_pmd_qat.a(qat_sym_frame.o): In function `qat_sym_get_qp':
qat_sym_frame.c:(.text.experimental+0x16): undefined reference to `rte_cryptodev_get_qp_status'
collect2: error: ld returned 1 exit status
make[5]: *** [/root/CENTOS82-64_K4.18.0_GCC8.3.1/x86_64-native-linuxapp-gcc/c6768c00774d4a6685fb166b5322995d/dpdk/mk/rte.app.mk:454: dpdk-procinfo] Error 1
make[4]: *** [/root/CENTOS82-64_K4.18.0_GCC8.3.1/x86_64-native-linuxapp-gcc/c6768c00774d4a6685fb166b5322995d/dpdk/mk/rte.subdir.mk:37: proc-info] Error 2
make[4]: *** Waiting for unfinished jobs....
  CC test_atomic.o
  CC test_barrier.o
--
  CC test_table_tables.o
/root/CENTOS82-64_K4.18.0_GCC8.3.1/x86_64-native-linuxapp-gcc/c6768c00774d4a6685fb166b5322995d/dpdk/x86_64-native-linuxapp-gcc/lib/librte_pmd_qat.a(qat_sym_frame.o): In function `qat_sym_get_qp':
qat_sym_frame.c:(.text.experimental+0x16): undefined reference to `rte_cryptodev_get_qp_status'
collect2: error: ld returned 1 exit status
make[5]: *** [/root/CENTOS82-64_K4.18.0_GCC8.3.1/x86_64-native-linuxapp-gcc/c6768c00774d4a6685fb166b5322995d/dpdk/mk/rte.app.mk:454: testpmd] Error 1
make[4]: *** [/root/CENTOS82-64_K4.18.0_GCC8.3.1/x86_64-native-linuxapp-gcc/c6768c00774d4a6685fb166b5322995d/dpdk/mk/rte.subdir.mk:37: test-pmd] Error 2
  CC test_table_ports.o
  CC test_table_combined.o
  CC test_table_acl.o
--
  LD test
/root/CENTOS82-64_K4.18.0_GCC8.3.1/x86_64-native-linuxapp-gcc/c6768c00774d4a6685fb166b5322995d/dpdk/x86_64-native-linuxapp-gcc/lib/librte_pmd_qat.a(qat_sym_frame.o): In function `qat_sym_get_qp':
qat_sym_frame.c:(.text.experimental+0x16): undefined reference to `rte_cryptodev_get_qp_status'
collect2: error: ld returned 1 exit status
make[5]: *** [/root/CENTOS82-64_K4.18.0_GCC8.3.1/x86_64-native-linuxapp-gcc/c6768c00774d4a6685fb166b5322995d/dpdk/mk/rte.app.mk:454: test] Error 1
make[4]: *** [/root/CENTOS82-64_K4.18.0_GCC8.3.1/x86_64-native-linuxapp-gcc/c6768c00774d4a6685fb166b5322995d/dpdk/mk/rte.subdir.mk:37: test] Error 2
make[3]: *** [/root/CENTOS82-64_K4.18.0_GCC8.3.1/x86_64-native-linuxapp-gcc/c6768c00774d4a6685fb166b5322995d/dpdk/mk/rte.sdkbuild.mk:53: app] Error 2
make[2]: *** [/root/CENTOS82-64_K4.18.0_GCC8.3.1/x86_64-native-linuxapp-gcc/c6768c00774d4a6685fb166b5322995d/dpdk/mk/rte.sdkroot.mk:99: all] Error 2
make[1]: *** [/root/CENTOS82-64_K4.18.0_GCC8.3.1/x86_64-native-linuxapp-gcc/c6768c00774d4a6685fb166b5322995d/dpdk/mk/rte.sdkinstall.mk:61: pre_install] Error 2
make: *** [/root/CENTOS82-64_K4.18.0_GCC8.3.1/x86_64-native-linuxapp-gcc/c6768c00774d4a6685fb166b5322995d/dpdk/mk/rte.sdkroot.mk:77: install] Error 2


*Makefile Build Failed #3:
OS: CENTOS82-64
Target: x86_64-native-linuxapp-clang
  CC test.o
/root/CENTOS82-64_K4.18.0_Clang7.0.1/x86_64-native-linuxapp-clang/c6768c00774d4a6685fb166b5322995d/dpdk/x86_64-native-linuxapp-clang/lib/librte_pmd_qat.a(qat_sym_frame.o): In function `qat_sym_get_qp':
qat_sym_frame.c:(.text.experimental+0xe): undefined reference to `rte_cryptodev_get_qp_status'
clang-9: error: linker command failed with exit code 1 (use -v to see invocation)
make[5]: *** [/root/CENTOS82-64_K4.18.0_Clang7.0.1/x86_64-native-linuxapp-clang/c6768c00774d4a6685fb166b5322995d/dpdk/mk/rte.app.mk:454: dpdk-procinfo] Error 1
make[4]: *** [/root/CENTOS82-64_K4.18.0_Clang7.0.1/x86_64-native-linuxapp-clang/c6768c00774d4a6685fb166b5322995d/dpdk/mk/rte.subdir.mk:37: proc-info] Error 2
make[4]: *** Waiting for unfinished jobs....
  CC parameters.o
  CC resource.o
--
/root/CENTOS82-64_K4.18.0_Clang7.0.1/x86_64-native-linuxapp-clang/c6768c00774d4a6685fb166b5322995d/dpdk/x86_64-native-linuxapp-clang/lib/librte_pmd_qat.a(qat_sym_frame.o): In function `qat_sym_get_qp':
qat_sym_frame.c:(.text.experimental+0xe): undefined reference to `rte_cryptodev_get_qp_status'
  CC test_ring_perf.o
clang-9: error: linker command failed with exit code 1 (use -v to see invocation)
make[5]: *** [/root/CENTOS82-64_K4.18.0_Clang7.0.1/x86_64-native-linuxapp-clang/c6768c00774d4a6685fb166b5322995d/dpdk/mk/rte.app.mk:454: testpmd] Error 1
make[4]: *** [/root/CENTOS82-64_K4.18.0_Clang7.0.1/x86_64-native-linuxapp-clang/c6768c00774d4a6685fb166b5322995d/dpdk/mk/rte.subdir.mk:37: test-pmd] Error 2
  CC test_ring_peek_stress.o
  CC test_ring_rts_stress.o
  CC test_ring_stress.o
--
  LD test
/root/CENTOS82-64_K4.18.0_Clang7.0.1/x86_64-native-linuxapp-clang/c6768c00774d4a6685fb166b5322995d/dpdk/x86_64-native-linuxapp-clang/lib/librte_pmd_qat.a(qat_sym_frame.o): In function `qat_sym_get_qp':
qat_sym_frame.c:(.text.experimental+0xe): undefined reference to `rte_cryptodev_get_qp_status'
clang-9: error: linker command failed with exit code 1 (use -v to see invocation)
make[5]: *** [/root/CENTOS82-64_K4.18.0_Clang7.0.1/x86_64-native-linuxapp-clang/c6768c00774d4a6685fb166b5322995d/dpdk/mk/rte.app.mk:454: test] Error 1
make[4]: *** [/root/CENTOS82-64_K4.18.0_Clang7.0.1/x86_64-native-linuxapp-clang/c6768c00774d4a6685fb166b5322995d/dpdk/mk/rte.subdir.mk:37: test] Error 2
make[3]: *** [/root/CENTOS82-64_K4.18.0_Clang7.0.1/x86_64-native-linuxapp-clang/c6768c00774d4a6685fb166b5322995d/dpdk/mk/rte.sdkbuild.mk:53: app] Error 2
make[2]: *** [/root/CENTOS82-64_K4.18.0_Clang7.0.1/x86_64-native-linuxapp-clang/c6768c00774d4a6685fb166b5322995d/dpdk/mk/rte.sdkroot.mk:99: all] Error 2
make[1]: *** [/root/CENTOS82-64_K4.18.0_Clang7.0.1/x86_64-native-linuxapp-clang/c6768c00774d4a6685fb166b5322995d/dpdk/mk/rte.sdkinstall.mk:61: pre_install] Error 2
make: *** [/root/CENTOS82-64_K4.18.0_Clang7.0.1/x86_64-native-linuxapp-clang/c6768c00774d4a6685fb166b5322995d/dpdk/mk/rte.sdkroot.mk:77: install] Error 2


*Makefile Build Failed #4:
OS: CENTOS82-64
Target: x86_64-native-linuxapp-icc
  CC test_per_lcore.o
/root/CENTOS82-64_K4.18.0_ICC19.1.1/x86_64-native-linuxapp-icc/c6768c00774d4a6685fb166b5322995d/dpdk/x86_64-native-linuxapp-icc/lib/librte_pmd_qat.a(qat_sym_frame.o): In function `qat_sym_get_qp':
qat_sym_frame.c:(.text.experimental+0x16): undefined reference to `rte_cryptodev_get_qp_status'
make[5]: *** [/root/CENTOS82-64_K4.18.0_ICC19.1.1/x86_64-native-linuxapp-icc/c6768c00774d4a6685fb166b5322995d/dpdk/mk/rte.app.mk:454: dpdk-procinfo] Error 1
make[4]: *** [/root/CENTOS82-64_K4.18.0_ICC19.1.1/x86_64-native-linuxapp-icc/c6768c00774d4a6685fb166b5322995d/dpdk/mk/rte.subdir.mk:37: proc-info] Error 2
make[4]: *** Waiting for unfinished jobs....
  CC test_atomic.o
  CC test_barrier.o
--
  CC test_ring_perf.o
/root/CENTOS82-64_K4.18.0_ICC19.1.1/x86_64-native-linuxapp-icc/c6768c00774d4a6685fb166b5322995d/dpdk/x86_64-native-linuxapp-icc/lib/librte_pmd_qat.a(qat_sym_frame.o): In function `qat_sym_get_qp':
qat_sym_frame.c:(.text.experimental+0x16): undefined reference to `rte_cryptodev_get_qp_status'
make[5]: *** [/root/CENTOS82-64_K4.18.0_ICC19.1.1/x86_64-native-linuxapp-icc/c6768c00774d4a6685fb166b5322995d/dpdk/mk/rte.app.mk:454: testpmd] Error 1
make[4]: *** [/root/CENTOS82-64_K4.18.0_ICC19.1.1/x86_64-native-linuxapp-icc/c6768c00774d4a6685fb166b5322995d/dpdk/mk/rte.subdir.mk:37: test-pmd] Error 2
  CC test_ring_peek_stress.o
  CC test_ring_rts_stress.o
  CC test_ring_stress.o
--
  LD test
/root/CENTOS82-64_K4.18.0_ICC19.1.1/x86_64-native-linuxapp-icc/c6768c00774d4a6685fb166b5322995d/dpdk/x86_64-native-linuxapp-icc/lib/librte_pmd_qat.a(qat_sym_frame.o): In function `qat_sym_get_qp':
qat_sym_frame.c:(.text.experimental+0x16): undefined reference to `rte_cryptodev_get_qp_status'
make[5]: *** [/root/CENTOS82-64_K4.18.0_ICC19.1.1/x86_64-native-linuxapp-icc/c6768c00774d4a6685fb166b5322995d/dpdk/mk/rte.app.mk:454: test] Error 1
make[4]: *** [/root/CENTOS82-64_K4.18.0_ICC19.1.1/x86_64-native-linuxapp-icc/c6768c00774d4a6685fb166b5322995d/dpdk/mk/rte.subdir.mk:37: test] Error 2
make[3]: *** [/root/CENTOS82-64_K4.18.0_ICC19.1.1/x86_64-native-linuxapp-icc/c6768c00774d4a6685fb166b5322995d/dpdk/mk/rte.sdkbuild.mk:53: app] Error 2
make[2]: *** [/root/CENTOS82-64_K4.18.0_ICC19.1.1/x86_64-native-linuxapp-icc/c6768c00774d4a6685fb166b5322995d/dpdk/mk/rte.sdkroot.mk:99: all] Error 2
make[1]: *** [/root/CENTOS82-64_K4.18.0_ICC19.1.1/x86_64-native-linuxapp-icc/c6768c00774d4a6685fb166b5322995d/dpdk/mk/rte.sdkinstall.mk:61: pre_install] Error 2
make: *** [/root/CENTOS82-64_K4.18.0_ICC19.1.1/x86_64-native-linuxapp-icc/c6768c00774d4a6685fb166b5322995d/dpdk/mk/rte.sdkroot.mk:77: install] Error 2


*Makefile Build Failed #5:
OS: CENTOS82-64
Target: x86_64-native-linuxapp-gcc+shared
  LD librte_pmd_qat.so.20.0.3
qat_sym_frame.o: In function `qat_sym_get_qp':
qat_sym_frame.c:(.text.experimental+0x16): undefined reference to `rte_cryptodev_get_qp_status'
collect2: error: ld returned 1 exit status
make[5]: *** [/root/CENTOS82-64_K4.18.0_GCC8.3.1/x86_64-native-linuxapp-gcc+shared/c6768c00774d4a6685fb166b5322995d/dpdk/mk/rte.lib.mk:100: librte_pmd_qat.so.20.0.3] Error 1
make[4]: *** [/root/CENTOS82-64_K4.18.0_GCC8.3.1/x86_64-native-linuxapp-gcc+shared/c6768c00774d4a6685fb166b5322995d/dpdk/mk/rte.subdir.mk:37: common/qat] Error 2
make[4]: *** Waiting for unfinished jobs....
== Build drivers/crypto/openssl
  CC otx2_cryptodev.o
--
  CC medford2_nic.o
  LD librte_pmd_sfc_efx.so.20.0.3
  INSTALL-LIB librte_pmd_sfc_efx.so.20.0.3
make[3]: *** [/root/CENTOS82-64_K4.18.0_GCC8.3.1/x86_64-native-linuxapp-gcc+shared/c6768c00774d4a6685fb166b5322995d/dpdk/mk/rte.sdkbuild.mk:51: drivers] Error 2
make[2]: *** [/root/CENTOS82-64_K4.18.0_GCC8.3.1/x86_64-native-linuxapp-gcc+shared/c6768c00774d4a6685fb166b5322995d/dpdk/mk/rte.sdkroot.mk:99: all] Error 2
make[1]: *** [/root/CENTOS82-64_K4.18.0_GCC8.3.1/x86_64-native-linuxapp-gcc+shared/c6768c00774d4a6685fb166b5322995d/dpdk/mk/rte.sdkinstall.mk:61: pre_install] Error 2
make: *** [/root/CENTOS82-64_K4.18.0_GCC8.3.1/x86_64-native-linuxapp-gcc+shared/c6768c00774d4a6685fb166b5322995d/dpdk/mk/rte.sdkroot.mk:77: install] Error 2


*Makefile Build Failed #6:
OS: CENTOS82-64
Target: x86_64-native-linuxapp-gcc+debug
  CC test_resource.o
/root/CENTOS82-64_K4.18.0_GCC8.3.1/x86_64-native-linuxapp-gcc+debug/c6768c00774d4a6685fb166b5322995d/dpdk/x86_64-native-linuxapp-gcc/lib/librte_pmd_qat.a(qat_sym_frame.o): In function `qat_sym_get_qp':
qat_sym_frame.c:(.text.experimental+0x16): undefined reference to `rte_cryptodev_get_qp_status'
collect2: error: ld returned 1 exit status
make[5]: *** [/root/CENTOS82-64_K4.18.0_GCC8.3.1/x86_64-native-linuxapp-gcc+debug/c6768c00774d4a6685fb166b5322995d/dpdk/mk/rte.app.mk:454: dpdk-procinfo] Error 1
make[4]: *** [/root/CENTOS82-64_K4.18.0_GCC8.3.1/x86_64-native-linuxapp-gcc+debug/c6768c00774d4a6685fb166b5322995d/dpdk/mk/rte.subdir.mk:37: proc-info] Error 2
make[4]: *** Waiting for unfinished jobs....
  CC test_prefetch.o
  CC test_byteorder.o
--
  CC test_table_combined.o
/root/CENTOS82-64_K4.18.0_GCC8.3.1/x86_64-native-linuxapp-gcc+debug/c6768c00774d4a6685fb166b5322995d/dpdk/x86_64-native-linuxapp-gcc/lib/librte_pmd_qat.a(qat_sym_frame.o): In function `qat_sym_get_qp':
qat_sym_frame.c:(.text.experimental+0x16): undefined reference to `rte_cryptodev_get_qp_status'
collect2: error: ld returned 1 exit status
make[5]: *** [/root/CENTOS82-64_K4.18.0_GCC8.3.1/x86_64-native-linuxapp-gcc+debug/c6768c00774d4a6685fb166b5322995d/dpdk/mk/rte.app.mk:454: testpmd] Error 1
make[4]: *** [/root/CENTOS82-64_K4.18.0_GCC8.3.1/x86_64-native-linuxapp-gcc+debug/c6768c00774d4a6685fb166b5322995d/dpdk/mk/rte.subdir.mk:37: test-pmd] Error 2
  CC test_table_acl.o
  CC test_flow_classify.o
  CC test_rwlock.o
--
  LD test
/root/CENTOS82-64_K4.18.0_GCC8.3.1/x86_64-native-linuxapp-gcc+debug/c6768c00774d4a6685fb166b5322995d/dpdk/x86_64-native-linuxapp-gcc/lib/librte_pmd_qat.a(qat_sym_frame.o): In function `qat_sym_get_qp':
qat_sym_frame.c:(.text.experimental+0x16): undefined reference to `rte_cryptodev_get_qp_status'
collect2: error: ld returned 1 exit status
make[5]: *** [/root/CENTOS82-64_K4.18.0_GCC8.3.1/x86_64-native-linuxapp-gcc+debug/c6768c00774d4a6685fb166b5322995d/dpdk/mk/rte.app.mk:454: test] Error 1
make[4]: *** [/root/CENTOS82-64_K4.18.0_GCC8.3.1/x86_64-native-linuxapp-gcc+debug/c6768c00774d4a6685fb166b5322995d/dpdk/mk/rte.subdir.mk:37: test] Error 2
make[3]: *** [/root/CENTOS82-64_K4.18.0_GCC8.3.1/x86_64-native-linuxapp-gcc+debug/c6768c00774d4a6685fb166b5322995d/dpdk/mk/rte.sdkbuild.mk:53: app] Error 2
make[2]: *** [/root/CENTOS82-64_K4.18.0_GCC8.3.1/x86_64-native-linuxapp-gcc+debug/c6768c00774d4a6685fb166b5322995d/dpdk/mk/rte.sdkroot.mk:99: all] Error 2
make[1]: *** [/root/CENTOS82-64_K4.18.0_GCC8.3.1/x86_64-native-linuxapp-gcc+debug/c6768c00774d4a6685fb166b5322995d/dpdk/mk/rte.sdkinstall.mk:61: pre_install] Error 2
make: *** [/root/CENTOS82-64_K4.18.0_GCC8.3.1/x86_64-native-linuxapp-gcc+debug/c6768c00774d4a6685fb166b5322995d/dpdk/mk/rte.sdkroot.mk:77: install] Error 2


*Makefile Build Failed #7:
OS: FC32-64
Target: x86_64-native-linuxapp-gcc
qat_sym_frame.c:(.text.experimental+0x14): undefined reference to `rte_cryptodev_get_qp_status'
  CC test_per_lcore.o
  CC test_atomic.o
collect2: error: ld returned 1 exit status
make[5]: *** [/root/FC32-64_K5.6.0_GCC10.0.1/x86_64-native-linuxapp-gcc/c6768c00774d4a6685fb166b5322995d/dpdk/mk/rte.app.mk:454: dpdk-procinfo] Error 1
make[4]: *** [/root/FC32-64_K5.6.0_GCC10.0.1/x86_64-native-linuxapp-gcc/c6768c00774d4a6685fb166b5322995d/dpdk/mk/rte.subdir.mk:37: proc-info] Error 2
make[4]: *** Waiting for unfinished jobs....
  CC parameters.o
  CC test_barrier.o
--
  LD testpmd
/usr/bin/ld: /root/FC32-64_K5.6.0_GCC10.0.1/x86_64-native-linuxapp-gcc/c6768c00774d4a6685fb166b5322995d/dpdk/x86_64-native-linuxapp-gcc/lib/librte_pmd_qat.a(qat_sym_frame.o): in function `qat_sym_get_qp':
qat_sym_frame.c:(.text.experimental+0x14): undefined reference to `rte_cryptodev_get_qp_status'
collect2: error: ld returned 1 exit status
make[5]: *** [/root/FC32-64_K5.6.0_GCC10.0.1/x86_64-native-linuxapp-gcc/c6768c00774d4a6685fb166b5322995d/dpdk/mk/rte.app.mk:454: testpmd] Error 1
make[4]: *** [/root/FC32-64_K5.6.0_GCC10.0.1/x86_64-native-linuxapp-gcc/c6768c00774d4a6685fb166b5322995d/dpdk/mk/rte.subdir.mk:37: test-pmd] Error 2
  CC test_ring_peek_stress.o
  CC test_ring_rts_stress.o
  CC test_ring_stress.o
--
  LD test
/usr/bin/ld: /root/FC32-64_K5.6.0_GCC10.0.1/x86_64-native-linuxapp-gcc/c6768c00774d4a6685fb166b5322995d/dpdk/x86_64-native-linuxapp-gcc/lib/librte_pmd_qat.a(qat_sym_frame.o): in function `qat_sym_get_qp':
qat_sym_frame.c:(.text.experimental+0x14): undefined reference to `rte_cryptodev_get_qp_status'
collect2: error: ld returned 1 exit status
make[5]: *** [/root/FC32-64_K5.6.0_GCC10.0.1/x86_64-native-linuxapp-gcc/c6768c00774d4a6685fb166b5322995d/dpdk/mk/rte.app.mk:454: test] Error 1
make[4]: *** [/root/FC32-64_K5.6.0_GCC10.0.1/x86_64-native-linuxapp-gcc/c6768c00774d4a6685fb166b5322995d/dpdk/mk/rte.subdir.mk:37: test] Error 2
make[3]: *** [/root/FC32-64_K5.6.0_GCC10.0.1/x86_64-native-linuxapp-gcc/c6768c00774d4a6685fb166b5322995d/dpdk/mk/rte.sdkbuild.mk:53: app] Error 2
make[2]: *** [/root/FC32-64_K5.6.0_GCC10.0.1/x86_64-native-linuxapp-gcc/c6768c00774d4a6685fb166b5322995d/dpdk/mk/rte.sdkroot.mk:99: all] Error 2
make[1]: *** [/root/FC32-64_K5.6.0_GCC10.0.1/x86_64-native-linuxapp-gcc/c6768c00774d4a6685fb166b5322995d/dpdk/mk/rte.sdkinstall.mk:61: pre_install] Error 2
make: *** [/root/FC32-64_K5.6.0_GCC10.0.1/x86_64-native-linuxapp-gcc/c6768c00774d4a6685fb166b5322995d/dpdk/mk/rte.sdkroot.mk:77: install] Error 2


*Makefile Build Failed #8:
OS: FC32-64
Target: x86_64-native-linuxapp-clang
  CC resource.o
/usr/bin/ld: /root/FC32-64_K5.6.0_Clang10.0.0/x86_64-native-linuxapp-clang/c6768c00774d4a6685fb166b5322995d/dpdk/x86_64-native-linuxapp-clang/lib/librte_pmd_qat.a(qat_sym_frame.o): in function `qat_sym_get_qp':
qat_sym_frame.c:(.text.experimental+0xe): undefined reference to `rte_cryptodev_get_qp_status'
clang-10: error: linker command failed with exit code 1 (use -v to see invocation)
make[5]: *** [/root/FC32-64_K5.6.0_Clang10.0.0/x86_64-native-linuxapp-clang/c6768c00774d4a6685fb166b5322995d/dpdk/mk/rte.app.mk:454: dpdk-procinfo] Error 1
make[4]: *** [/root/FC32-64_K5.6.0_Clang10.0.0/x86_64-native-linuxapp-clang/c6768c00774d4a6685fb166b5322995d/dpdk/mk/rte.subdir.mk:37: proc-info] Error 2
make[4]: *** Waiting for unfinished jobs....
  CC test_resource.o
  CC test_prefetch.o
--
  LD testpmd
/usr/bin/ld: /root/FC32-64_K5.6.0_Clang10.0.0/x86_64-native-linuxapp-clang/c6768c00774d4a6685fb166b5322995d/dpdk/x86_64-native-linuxapp-clang/lib/librte_pmd_qat.a(qat_sym_frame.o): in function `qat_sym_get_qp':
qat_sym_frame.c:(.text.experimental+0xe): undefined reference to `rte_cryptodev_get_qp_status'
clang-10: error: linker command failed with exit code 1 (use -v to see invocation)
make[5]: *** [/root/FC32-64_K5.6.0_Clang10.0.0/x86_64-native-linuxapp-clang/c6768c00774d4a6685fb166b5322995d/dpdk/mk/rte.app.mk:454: testpmd] Error 1
make[4]: *** [/root/FC32-64_K5.6.0_Clang10.0.0/x86_64-native-linuxapp-clang/c6768c00774d4a6685fb166b5322995d/dpdk/mk/rte.subdir.mk:37: test-pmd] Error 2
  CC test_ring_peek_stress.o
  CC test_ring_rts_stress.o
  CC test_ring_stress.o
--
  LD test
/usr/bin/ld: /root/FC32-64_K5.6.0_Clang10.0.0/x86_64-native-linuxapp-clang/c6768c00774d4a6685fb166b5322995d/dpdk/x86_64-native-linuxapp-clang/lib/librte_pmd_qat.a(qat_sym_frame.o): in function `qat_sym_get_qp':
qat_sym_frame.c:(.text.experimental+0xe): undefined reference to `rte_cryptodev_get_qp_status'
clang-10: error: linker command failed with exit code 1 (use -v to see invocation)
make[5]: *** [/root/FC32-64_K5.6.0_Clang10.0.0/x86_64-native-linuxapp-clang/c6768c00774d4a6685fb166b5322995d/dpdk/mk/rte.app.mk:454: test] Error 1
make[4]: *** [/root/FC32-64_K5.6.0_Clang10.0.0/x86_64-native-linuxapp-clang/c6768c00774d4a6685fb166b5322995d/dpdk/mk/rte.subdir.mk:37: test] Error 2
make[3]: *** [/root/FC32-64_K5.6.0_Clang10.0.0/x86_64-native-linuxapp-clang/c6768c00774d4a6685fb166b5322995d/dpdk/mk/rte.sdkbuild.mk:53: app] Error 2
make[2]: *** [/root/FC32-64_K5.6.0_Clang10.0.0/x86_64-native-linuxapp-clang/c6768c00774d4a6685fb166b5322995d/dpdk/mk/rte.sdkroot.mk:99: all] Error 2
make[1]: *** [/root/FC32-64_K5.6.0_Clang10.0.0/x86_64-native-linuxapp-clang/c6768c00774d4a6685fb166b5322995d/dpdk/mk/rte.sdkinstall.mk:61: pre_install] Error 2
make: *** [/root/FC32-64_K5.6.0_Clang10.0.0/x86_64-native-linuxapp-clang/c6768c00774d4a6685fb166b5322995d/dpdk/mk/rte.sdkroot.mk:77: install] Error 2


*Makefile Build Failed #9:
OS: FreeBSD1201-64
Target: x86_64-native-bsdapp-gcc
awk -f /usr/src/sys/tools/makeobjops.awk /usr/src/sys/dev/pci/pci_if.m -h
awk -f /usr/src/sys/tools/makeobjops.awk /usr/src/sys/kern/bus_if.m -h
Warning: Object directory not changed from original /root/FreeBSD1201-64_K12.1_GCC9.2.0/x86_64-native-bsdapp-gcc/c6768c00774d4a6685fb166b5322995d/dpdk/x86_64-native-bsdapp-gcc/build/kernel/freebsd/nic_uio
cc  -Winline -Wall -Werror -include /root/FreeBSD1201-64_K12.1_GCC9.2.0/x86_64-native-bsdapp-gcc/c6768c00774d4a6685fb166b5322995d/dpdk/x86_64-native-bsdapp-gcc/include/rte_config.h  -Werror -D_KERNEL -DKLD_MODULE -nostdinc  -I/root/FreeBSD1201-64_K12.1_GCC9.2.0/x86_64-native-bsdapp-gcc/c6768c00774d4a6685fb166b5322995d/dpdk/kernel/freebsd/nic_uio -I/root/FreeBSD1201-64_K12.1_GCC9.2.0/x86_64-native-bsdapp-gcc/c6768c00774d4a6685fb166b5322995d/dpdk/x86_64-native-bsdapp-gcc/include -I. -I/usr/src/sys -I/usr/src/sys/contrib/ck/include -fno-common  -fno-omit-frame-pointer -mno-omit-leaf-frame-pointer -fdebug-prefix-map=./machine=/usr/src/sys/amd64/include -fdebug-prefix-map=./x86=/usr/src/sys/x86/include   -MD  -MF.depend.nic_uio.o -MTnic_uio.o -mcmodel=kernel -mno-red-zone -mno-mmx -mno-sse -msoft-float  -fno-asynchronous-unwind-tables -ffreestanding -fwrapv -fstack-protector -Wall -Wredundant-decls -Wnested-externs -Wstrict-prototypes -Wmissing-prototypes -Wpointer-arith -Wcast-qual -Wundef -Wno-pointer-sign -D__printf__=__freebsd_kprintf__ -Wmissing-include-dirs -fdiagnostics-show-option -Wno-unknown-pragmas -Wno-error-tautological-compare -Wno-error-empty-body -Wno-error-parentheses-equality -Wno-error-unused-function -Wno-error-pointer-sign -Wno-error-shift-negative-value -Wno-address-of-packed-member  -mno-aes -mno-avx  -std=iso9899:1999 -c nic_uio.c -o nic_uio.o
Warning: Object directory not changed from original /root/FreeBSD1201-64_K12.1_GCC9.2.0/x86_64-native-bsdapp-gcc/c6768c00774d4a6685fb166b5322995d/dpdk/x86_64-native-bsdapp-gcc/build/kernel/freebsd/contigmem
cc  -Winline -Wall -Werror -include /root/FreeBSD1201-64_K12.1_GCC9.2.0/x86_64-native-bsdapp-gcc/c6768c00774d4a6685fb166b5322995d/dpdk/x86_64-native-bsdapp-gcc/include/rte_config.h  -Werror -D_KERNEL -DKLD_MODULE -nostdinc  -I/root/FreeBSD1201-64_K12.1_GCC9.2.0/x86_64-native-bsdapp-gcc/c6768c00774d4a6685fb166b5322995d/dpdk/kernel/freebsd/contigmem -I/root/FreeBSD1201-64_K12.1_GCC9.2.0/x86_64-native-bsdapp-gcc/c6768c00774d4a6685fb166b5322995d/dpdk/x86_64-native-bsdapp-gcc/include -I. -I/usr/src/sys -I/usr/src/sys/contrib/ck/include -fno-common  -fno-omit-frame-pointer -mno-omit-leaf-frame-pointer -fdebug-prefix-map=./machine=/usr/src/sys/amd64/include -fdebug-prefix-map=./x86=/usr/src/sys/x86/include   -MD  -MF.depend.contigmem.o -MTcontigmem.o -mcmodel=kernel -mno-red-zone -mno-mmx -mno-sse -msoft-float  -fno-asynchronous-unwind-tables -ffreestanding -fwrapv -fstack-protector -Wall -Wredundant-decls -Wnested-externs -Wstrict-prototypes -Wmissing-prototypes -Wpointer-arith -Wcast-qual -Wundef -Wno-pointer-sign -D__printf__=__freebsd_kprintf__ -Wmissing-include-dirs -fdiagnostics-show-option -Wno-unknown-pragmas -Wno-error-tautological-compare -Wno-error-empty-body -Wno-error-parentheses-equality -Wno-error-unused-function -Wno-error-pointer-sign -Wno-error-shift-negative-value -Wno-address-of-packed-member  -mno-aes -mno-avx  -std=iso9899:1999 -c contigmem.c -o contigmem.o
== Build drivers/common
ld -m elf_x86_64_fbsd -L/root/FreeBSD1201-64_K12.1_GCC9.2.0/x86_64-native-bsdapp-gcc/c6768c00774d4a6685fb166b5322995d/dpdk/x86_64-native-bsdapp-gcc/lib -d -warn-common --build-id=sha1 -r -d -o nic_uio.ko nic_uio.o
ld -m elf_x86_64_fbsd -L/root/FreeBSD1201-64_K12.1_GCC9.2.0/x86_64-native-bsdapp-gcc/c6768c00774d4a6685fb166b5322995d/dpdk/x86_64-native-bsdapp-gcc/lib -d -warn-common --build-id=sha1 -r -d -o contigmem.ko contigmem.o
--
  CC test_per_lcore.o
/usr/local/bin/ld: /root/FreeBSD1201-64_K12.1_GCC9.2.0/x86_64-native-bsdapp-gcc/c6768c00774d4a6685fb166b5322995d/dpdk/x86_64-native-bsdapp-gcc/lib/librte_pmd_qat.a(qat_sym_frame.o): in function `qat_sym_get_qp':
qat_sym_frame.c:(.text.experimental+0x16): undefined reference to `rte_cryptodev_get_qp_status'
collect2: error: ld returned 1 exit status
gmake[5]: *** [/root/FreeBSD1201-64_K12.1_GCC9.2.0/x86_64-native-bsdapp-gcc/c6768c00774d4a6685fb166b5322995d/dpdk/mk/rte.app.mk:454: dpdk-pdump] Error 1
gmake[4]: *** [/root/FreeBSD1201-64_K12.1_GCC9.2.0/x86_64-native-bsdapp-gcc/c6768c00774d4a6685fb166b5322995d/dpdk/mk/rte.subdir.mk:37: pdump] Error 2
gmake[4]: *** Waiting for unfinished jobs....
  CC test_atomic.o
  CC test_barrier.o
--
  LD testpmd
/usr/local/bin/ld: /root/FreeBSD1201-64_K12.1_GCC9.2.0/x86_64-native-bsdapp-gcc/c6768c00774d4a6685fb166b5322995d/dpdk/x86_64-native-bsdapp-gcc/lib/librte_pmd_qat.a(qat_sym_frame.o): in function `qat_sym_get_qp':
qat_sym_frame.c:(.text.experimental+0x16): undefined reference to `rte_cryptodev_get_qp_status'
collect2: error: ld returned 1 exit status
gmake[5]: *** [/root/FreeBSD1201-64_K12.1_GCC9.2.0/x86_64-native-bsdapp-gcc/c6768c00774d4a6685fb166b5322995d/dpdk/mk/rte.app.mk:454: testpmd] Error 1
gmake[4]: *** [/root/FreeBSD1201-64_K12.1_GCC9.2.0/x86_64-native-bsdapp-gcc/c6768c00774d4a6685fb166b5322995d/dpdk/mk/rte.subdir.mk:37: test-pmd] Error 2
  CC test_ring_peek_stress.o
  CC test_ring_rts_stress.o
  CC test_ring_stress.o
--
  LD test
/usr/local/bin/ld: /root/FreeBSD1201-64_K12.1_GCC9.2.0/x86_64-native-bsdapp-gcc/c6768c00774d4a6685fb166b5322995d/dpdk/x86_64-native-bsdapp-gcc/lib/librte_pmd_qat.a(qat_sym_frame.o): in function `qat_sym_get_qp':
qat_sym_frame.c:(.text.experimental+0x16): undefined reference to `rte_cryptodev_get_qp_status'
collect2: error: ld returned 1 exit status
gmake[5]: *** [/root/FreeBSD1201-64_K12.1_GCC9.2.0/x86_64-native-bsdapp-gcc/c6768c00774d4a6685fb166b5322995d/dpdk/mk/rte.app.mk:454: test] Error 1
gmake[4]: *** [/root/FreeBSD1201-64_K12.1_GCC9.2.0/x86_64-native-bsdapp-gcc/c6768c00774d4a6685fb166b5322995d/dpdk/mk/rte.subdir.mk:37: test] Error 2
gmake[3]: *** [/root/FreeBSD1201-64_K12.1_GCC9.2.0/x86_64-native-bsdapp-gcc/c6768c00774d4a6685fb166b5322995d/dpdk/mk/rte.sdkbuild.mk:53: app] Error 2
gmake[2]: *** [/root/FreeBSD1201-64_K12.1_GCC9.2.0/x86_64-native-bsdapp-gcc/c6768c00774d4a6685fb166b5322995d/dpdk/mk/rte.sdkroot.mk:99: all] Error 2
gmake[1]: *** [/root/FreeBSD1201-64_K12.1_GCC9.2.0/x86_64-native-bsdapp-gcc/c6768c00774d4a6685fb166b5322995d/dpdk/mk/rte.sdkinstall.mk:61: pre_install] Error 2
gmake: *** [/root/FreeBSD1201-64_K12.1_GCC9.2.0/x86_64-native-bsdapp-gcc/c6768c00774d4a6685fb166b5322995d/dpdk/mk/rte.sdkroot.mk:77: install] Error 2


*Makefile Build Failed #10:
OS: FreeBSD1201-64
Target: x86_64-native-bsdapp-clang
awk -f /usr/src/sys/tools/makeobjops.awk /usr/src/sys/kern/bus_if.m -h
awk -f /usr/src/sys/tools/makeobjops.awk /usr/src/sys/dev/pci/pci_if.m -h
Warning: Object directory not changed from original /root/FreeBSD1201-64_K12.1_Clang8.0.1/x86_64-native-bsdapp-clang/c6768c00774d4a6685fb166b5322995d/dpdk/x86_64-native-bsdapp-clang/build/kernel/freebsd/contigmem
cc  -Winline -Wall -Werror -include /root/FreeBSD1201-64_K12.1_Clang8.0.1/x86_64-native-bsdapp-clang/c6768c00774d4a6685fb166b5322995d/dpdk/x86_64-native-bsdapp-clang/include/rte_config.h  -Werror -D_KERNEL -DKLD_MODULE -nostdinc  -I/root/FreeBSD1201-64_K12.1_Clang8.0.1/x86_64-native-bsdapp-clang/c6768c00774d4a6685fb166b5322995d/dpdk/kernel/freebsd/contigmem -I/root/FreeBSD1201-64_K12.1_Clang8.0.1/x86_64-native-bsdapp-clang/c6768c00774d4a6685fb166b5322995d/dpdk/x86_64-native-bsdapp-clang/include -I. -I/usr/src/sys -I/usr/src/sys/contrib/ck/include -fno-common  -fno-omit-frame-pointer -mno-omit-leaf-frame-pointer -fdebug-prefix-map=./machine=/usr/src/sys/amd64/include -fdebug-prefix-map=./x86=/usr/src/sys/x86/include   -MD  -MF.depend.contigmem.o -MTcontigmem.o -mcmodel=kernel -mno-red-zone -mno-mmx -mno-sse -msoft-float  -fno-asynchronous-unwind-tables -ffreestanding -fwrapv -fstack-protector -Wall -Wredundant-decls -Wnested-externs -Wstrict-prototypes -Wmissing-prototypes -Wpointer-arith -Wcast-qual -Wundef -Wno-pointer-sign -D__printf__=__freebsd_kprintf__ -Wmissing-include-dirs -fdiagnostics-show-option -Wno-unknown-pragmas -Wno-error-tautological-compare -Wno-error-empty-body -Wno-error-parentheses-equality -Wno-error-unused-function -Wno-error-pointer-sign -Wno-error-shift-negative-value -Wno-address-of-packed-member  -mno-aes -mno-avx  -std=iso9899:1999 -c contigmem.c -o contigmem.o
Warning: Object directory not changed from original /root/FreeBSD1201-64_K12.1_Clang8.0.1/x86_64-native-bsdapp-clang/c6768c00774d4a6685fb166b5322995d/dpdk/x86_64-native-bsdapp-clang/build/kernel/freebsd/nic_uio
cc  -Winline -Wall -Werror -include /root/FreeBSD1201-64_K12.1_Clang8.0.1/x86_64-native-bsdapp-clang/c6768c00774d4a6685fb166b5322995d/dpdk/x86_64-native-bsdapp-clang/include/rte_config.h  -Werror -D_KERNEL -DKLD_MODULE -nostdinc  -I/root/FreeBSD1201-64_K12.1_Clang8.0.1/x86_64-native-bsdapp-clang/c6768c00774d4a6685fb166b5322995d/dpdk/kernel/freebsd/nic_uio -I/root/FreeBSD1201-64_K12.1_Clang8.0.1/x86_64-native-bsdapp-clang/c6768c00774d4a6685fb166b5322995d/dpdk/x86_64-native-bsdapp-clang/include -I. -I/usr/src/sys -I/usr/src/sys/contrib/ck/include -fno-common  -fno-omit-frame-pointer -mno-omit-leaf-frame-pointer -fdebug-prefix-map=./machine=/usr/src/sys/amd64/include -fdebug-prefix-map=./x86=/usr/src/sys/x86/include   -MD  -MF.depend.nic_uio.o -MTnic_uio.o -mcmodel=kernel -mno-red-zone -mno-mmx -mno-sse -msoft-float  -fno-asynchronous-unwind-tables -ffreestanding -fwrapv -fstack-protector -Wall -Wredundant-decls -Wnested-externs -Wstrict-prototypes -Wmissing-prototypes -Wpointer-arith -Wcast-qual -Wundef -Wno-pointer-sign -D__printf__=__freebsd_kprintf__ -Wmissing-include-dirs -fdiagnostics-show-option -Wno-unknown-pragmas -Wno-error-tautological-compare -Wno-error-empty-body -Wno-error-parentheses-equality -Wno-error-unused-function -Wno-error-pointer-sign -Wno-error-shift-negative-value -Wno-address-of-packed-member  -mno-aes -mno-avx  -std=iso9899:1999 -c nic_uio.c -o nic_uio.o
== Build drivers/common
== Build drivers/common/cpt
ld -m elf_x86_64_fbsd -L/root/FreeBSD1201-64_K12.1_Clang8.0.1/x86_64-native-bsdapp-clang/c6768c00774d4a6685fb166b5322995d/dpdk/x86_64-native-bsdapp-clang/lib -d -warn-common --build-id=sha1 -r -d -o contigmem.ko contigmem.o
--
  CC commands.o
  LD dpdk-pdump
  CC test.o
ld: error: undefined symbol: rte_cryptodev_get_qp_status
>>> referenced by qat_sym_frame.c
>>>               qat_sym_frame.o:(qat_sym_get_qp) in archive /root/FreeBSD1201-64_K12.1_Clang8.0.1/x86_64-native-bsdapp-clang/c6768c00774d4a6685fb166b5322995d/dpdk/x86_64-native-bsdapp-clang/lib/librte_pmd_qat.a
clang: error: linker command failed with exit code 1 (use -v to see invocation)
gmake[5]: *** [/root/FreeBSD1201-64_K12.1_Clang8.0.1/x86_64-native-bsdapp-clang/c6768c00774d4a6685fb166b5322995d/dpdk/mk/rte.app.mk:454: dpdk-pdump] Error 1
gmake[4]: *** [/root/FreeBSD1201-64_K12.1_Clang8.0.1/x86_64-native-bsdapp-clang/c6768c00774d4a6685fb166b5322995d/dpdk/mk/rte.subdir.mk:37: pdump] Error 2
gmake[4]: *** Waiting for unfinished jobs....
  CC parameters.o
  CC resource.o
--
  CC test_ring_hts_stress.o
  CC test_ring_perf.o
  LD testpmd
ld: error: undefined symbol: rte_cryptodev_get_qp_status
>>> referenced by qat_sym_frame.c
>>>               qat_sym_frame.o:(qat_sym_get_qp) in archive /root/FreeBSD1201-64_K12.1_Clang8.0.1/x86_64-native-bsdapp-clang/c6768c00774d4a6685fb166b5322995d/dpdk/x86_64-native-bsdapp-clang/lib/librte_pmd_qat.a
clang: error: linker command failed with exit code 1 (use -v to see invocation)
gmake[5]: *** [/root/FreeBSD1201-64_K12.1_Clang8.0.1/x86_64-native-bsdapp-clang/c6768c00774d4a6685fb166b5322995d/dpdk/mk/rte.app.mk:454: testpmd] Error 1
gmake[4]: *** [/root/FreeBSD1201-64_K12.1_Clang8.0.1/x86_64-native-bsdapp-clang/c6768c00774d4a6685fb166b5322995d/dpdk/mk/rte.subdir.mk:37: test-pmd] Error 2
  CC test_ring_peek_stress.o
  CC test_ring_rts_stress.o
  CC test_ring_stress.o
--
  CC test_ipsec_sad.o
  MKRES test_resource_c.res.o
  LD test
ld: error: undefined symbol: rte_cryptodev_get_qp_status
>>> referenced by qat_sym_frame.c
>>>               qat_sym_frame.o:(qat_sym_get_qp) in archive /root/FreeBSD1201-64_K12.1_Clang8.0.1/x86_64-native-bsdapp-clang/c6768c00774d4a6685fb166b5322995d/dpdk/x86_64-native-bsdapp-clang/lib/librte_pmd_qat.a
clang: error: linker command failed with exit code 1 (use -v to see invocation)
gmake[5]: *** [/root/FreeBSD1201-64_K12.1_Clang8.0.1/x86_64-native-bsdapp-clang/c6768c00774d4a6685fb166b5322995d/dpdk/mk/rte.app.mk:454: test] Error 1
gmake[4]: *** [/root/FreeBSD1201-64_K12.1_Clang8.0.1/x86_64-native-bsdapp-clang/c6768c00774d4a6685fb166b5322995d/dpdk/mk/rte.subdir.mk:37: test] Error 2
gmake[3]: *** [/root/FreeBSD1201-64_K12.1_Clang8.0.1/x86_64-native-bsdapp-clang/c6768c00774d4a6685fb166b5322995d/dpdk/mk/rte.sdkbuild.mk:53: app] Error 2
gmake[2]: *** [/root/FreeBSD1201-64_K12.1_Clang8.0.1/x86_64-native-bsdapp-clang/c6768c00774d4a6685fb166b5322995d/dpdk/mk/rte.sdkroot.mk:99: all] Error 2
gmake[1]: *** [/root/FreeBSD1201-64_K12.1_Clang8.0.1/x86_64-native-bsdapp-clang/c6768c00774d4a6685fb166b5322995d/dpdk/mk/rte.sdkinstall.mk:61: pre_install] Error 2
gmake: *** [/root/FreeBSD1201-64_K12.1_Clang8.0.1/x86_64-native-bsdapp-clang/c6768c00774d4a6685fb166b5322995d/dpdk/mk/rte.sdkroot.mk:77: install] Error 2


*Makefile Build Failed #11:
OS: FreeBSD1201-64
Target: x86_64-native-bsdapp-gcc+shared
awk -f /usr/src/sys/tools/makeobjops.awk /usr/src/sys/kern/bus_if.m -h
Warning: Object directory not changed from original /root/FreeBSD1201-64_K12.1_GCC7.3.0/x86_64-native-bsdapp-gcc+shared/c6768c00774d4a6685fb166b5322995d/dpdk/x86_64-native-bsdapp-gcc/build/kernel/freebsd/contigmem
awk -f /usr/src/sys/tools/makeobjops.awk /usr/src/sys/dev/pci/pci_if.m -h
cc  -Winline -Wall -Werror -include /root/FreeBSD1201-64_K12.1_GCC7.3.0/x86_64-native-bsdapp-gcc+shared/c6768c00774d4a6685fb166b5322995d/dpdk/x86_64-native-bsdapp-gcc/include/rte_config.h  -Werror -D_KERNEL -DKLD_MODULE -nostdinc  -I/root/FreeBSD1201-64_K12.1_GCC7.3.0/x86_64-native-bsdapp-gcc+shared/c6768c00774d4a6685fb166b5322995d/dpdk/kernel/freebsd/contigmem -I/root/FreeBSD1201-64_K12.1_GCC7.3.0/x86_64-native-bsdapp-gcc+shared/c6768c00774d4a6685fb166b5322995d/dpdk/x86_64-native-bsdapp-gcc/include -I. -I/usr/src/sys -I/usr/src/sys/contrib/ck/include -fno-common  -fno-omit-frame-pointer -mno-omit-leaf-frame-pointer -fdebug-prefix-map=./machine=/usr/src/sys/amd64/include -fdebug-prefix-map=./x86=/usr/src/sys/x86/include   -MD  -MF.depend.contigmem.o -MTcontigmem.o -mcmodel=kernel -mno-red-zone -mno-mmx -mno-sse -msoft-float  -fno-asynchronous-unwind-tables -ffreestanding -fwrapv -fstack-protector -Wall -Wredundant-decls -Wnested-externs -Wstrict-prototypes -Wmissing-prototypes -Wpointer-arith -Wcast-qual -Wundef -Wno-pointer-sign -D__printf__=__freebsd_kprintf__ -Wmissing-include-dirs -fdiagnostics-show-option -Wno-unknown-pragmas -Wno-error-tautological-compare -Wno-error-empty-body -Wno-error-parentheses-equality -Wno-error-unused-function -Wno-error-pointer-sign -Wno-error-shift-negative-value -Wno-address-of-packed-member  -mno-aes -mno-avx  -std=iso9899:1999 -c contigmem.c -o contigmem.o
Warning: Object directory not changed from original /root/FreeBSD1201-64_K12.1_GCC7.3.0/x86_64-native-bsdapp-gcc+shared/c6768c00774d4a6685fb166b5322995d/dpdk/x86_64-native-bsdapp-gcc/build/kernel/freebsd/nic_uio
cc  -Winline -Wall -Werror -include /root/FreeBSD1201-64_K12.1_GCC7.3.0/x86_64-native-bsdapp-gcc+shared/c6768c00774d4a6685fb166b5322995d/dpdk/x86_64-native-bsdapp-gcc/include/rte_config.h  -Werror -D_KERNEL -DKLD_MODULE -nostdinc  -I/root/FreeBSD1201-64_K12.1_GCC7.3.0/x86_64-native-bsdapp-gcc+shared/c6768c00774d4a6685fb166b5322995d/dpdk/kernel/freebsd/nic_uio -I/root/FreeBSD1201-64_K12.1_GCC7.3.0/x86_64-native-bsdapp-gcc+shared/c6768c00774d4a6685fb166b5322995d/dpdk/x86_64-native-bsdapp-gcc/include -I. -I/usr/src/sys -I/usr/src/sys/contrib/ck/include -fno-common  -fno-omit-frame-pointer -mno-omit-leaf-frame-pointer -fdebug-prefix-map=./machine=/usr/src/sys/amd64/include -fdebug-prefix-map=./x86=/usr/src/sys/x86/include   -MD  -MF.depend.nic_uio.o -MTnic_uio.o -mcmodel=kernel -mno-red-zone -mno-mmx -mno-sse -msoft-float  -fno-asynchronous-unwind-tables -ffreestanding -fwrapv -fstack-protector -Wall -Wredundant-decls -Wnested-externs -Wstrict-prototypes -Wmissing-prototypes -Wpointer-arith -Wcast-qual -Wundef -Wno-pointer-sign -D__printf__=__freebsd_kprintf__ -Wmissing-include-dirs -fdiagnostics-show-option -Wno-unknown-pragmas -Wno-error-tautological-compare -Wno-error-empty-body -Wno-error-parentheses-equality -Wno-error-unused-function -Wno-error-pointer-sign -Wno-error-shift-negative-value -Wno-address-of-packed-member  -mno-aes -mno-avx  -std=iso9899:1999 -c nic_uio.c -o nic_uio.o
ld -m elf_x86_64_fbsd -L/root/FreeBSD1201-64_K12.1_GCC7.3.0/x86_64-native-bsdapp-gcc+shared/c6768c00774d4a6685fb166b5322995d/dpdk/x86_64-native-bsdapp-gcc/lib -d -warn-common --build-id=sha1 -r -d -o contigmem.ko contigmem.o
ld -m elf_x86_64_fbsd -L/root/FreeBSD1201-64_K12.1_GCC7.3.0/x86_64-native-bsdapp-gcc+shared/c6768c00774d4a6685fb166b5322995d/dpdk/x86_64-native-bsdapp-gcc/lib -d -warn-common --build-id=sha1 -r -d -o nic_uio.ko nic_uio.o
:> export_syms
--
  LD librte_pmd_qat.so.20.0.3
/usr/local/bin/ld: qat_sym_frame.o: in function `qat_sym_get_qp':
qat_sym_frame.c:(.text.experimental+0x16): undefined reference to `rte_cryptodev_get_qp_status'
collect2: error: ld returned 1 exit status
gmake[5]: *** [/root/FreeBSD1201-64_K12.1_GCC7.3.0/x86_64-native-bsdapp-gcc+shared/c6768c00774d4a6685fb166b5322995d/dpdk/mk/rte.lib.mk:100: librte_pmd_qat.so.20.0.3] Error 1
gmake[4]: *** [/root/FreeBSD1201-64_K12.1_GCC7.3.0/x86_64-native-bsdapp-gcc+shared/c6768c00774d4a6685fb166b5322995d/dpdk/mk/rte.subdir.mk:35: common/qat] Error 2
gmake[4]: *** Waiting for unfinished jobs....
  CC em_rxtx.o
== Build drivers/net/enic
--
  CC medford2_nic.o
  LD librte_pmd_sfc_efx.so.20.0.3
  INSTALL-LIB librte_pmd_sfc_efx.so.20.0.3
gmake[3]: *** [/root/FreeBSD1201-64_K12.1_GCC7.3.0/x86_64-native-bsdapp-gcc+shared/c6768c00774d4a6685fb166b5322995d/dpdk/mk/rte.sdkbuild.mk:51: drivers] Error 2
gmake[2]: *** [/root/FreeBSD1201-64_K12.1_GCC7.3.0/x86_64-native-bsdapp-gcc+shared/c6768c00774d4a6685fb166b5322995d/dpdk/mk/rte.sdkroot.mk:99: all] Error 2
gmake[1]: *** [/root/FreeBSD1201-64_K12.1_GCC7.3.0/x86_64-native-bsdapp-gcc+shared/c6768c00774d4a6685fb166b5322995d/dpdk/mk/rte.sdkinstall.mk:61: pre_install] Error 2
gmake: *** [/root/FreeBSD1201-64_K12.1_GCC7.3.0/x86_64-native-bsdapp-gcc+shared/c6768c00774d4a6685fb166b5322995d/dpdk/mk/rte.sdkroot.mk:77: install] Error 2


*Makefile Build Failed #12:
OS: FreeBSD1201-64
Target: x86_64-native-bsdapp-gcc+debug
awk -f /usr/src/sys/tools/makeobjops.awk /usr/src/sys/kern/bus_if.m -h
awk -f /usr/src/sys/tools/makeobjops.awk /usr/src/sys/dev/pci/pci_if.m -h
Warning: Object directory not changed from original /root/FreeBSD1201-64_K12.1_GCC7.3.0/x86_64-native-bsdapp-gcc+debug/c6768c00774d4a6685fb166b5322995d/dpdk/x86_64-native-bsdapp-gcc/build/kernel/freebsd/contigmem
cc  -Winline -Wall -Werror -include /root/FreeBSD1201-64_K12.1_GCC7.3.0/x86_64-native-bsdapp-gcc+debug/c6768c00774d4a6685fb166b5322995d/dpdk/x86_64-native-bsdapp-gcc/include/rte_config.h  -Werror -D_KERNEL -DKLD_MODULE -nostdinc  -I/root/FreeBSD1201-64_K12.1_GCC7.3.0/x86_64-native-bsdapp-gcc+debug/c6768c00774d4a6685fb166b5322995d/dpdk/kernel/freebsd/contigmem -I/root/FreeBSD1201-64_K12.1_GCC7.3.0/x86_64-native-bsdapp-gcc+debug/c6768c00774d4a6685fb166b5322995d/dpdk/x86_64-native-bsdapp-gcc/include -I. -I/usr/src/sys -I/usr/src/sys/contrib/ck/include -fno-common  -fno-omit-frame-pointer -mno-omit-leaf-frame-pointer -fdebug-prefix-map=./machine=/usr/src/sys/amd64/include -fdebug-prefix-map=./x86=/usr/src/sys/x86/include   -MD  -MF.depend.contigmem.o -MTcontigmem.o -mcmodel=kernel -mno-red-zone -mno-mmx -mno-sse -msoft-float  -fno-asynchronous-unwind-tables -ffreestanding -fwrapv -fstack-protector -Wall -Wredundant-decls -Wnested-externs -Wstrict-prototypes -Wmissing-prototypes -Wpointer-arith -Wcast-qual -Wundef -Wno-pointer-sign -D__printf__=__freebsd_kprintf__ -Wmissing-include-dirs -fdiagnostics-show-option -Wno-unknown-pragmas -Wno-error-tautological-compare -Wno-error-empty-body -Wno-error-parentheses-equality -Wno-error-unused-function -Wno-error-pointer-sign -Wno-error-shift-negative-value -Wno-address-of-packed-member  -mno-aes -mno-avx  -std=iso9899:1999 -c contigmem.c -o contigmem.o
Warning: Object directory not changed from original /root/FreeBSD1201-64_K12.1_GCC7.3.0/x86_64-native-bsdapp-gcc+debug/c6768c00774d4a6685fb166b5322995d/dpdk/x86_64-native-bsdapp-gcc/build/kernel/freebsd/nic_uio
cc  -Winline -Wall -Werror -include /root/FreeBSD1201-64_K12.1_GCC7.3.0/x86_64-native-bsdapp-gcc+debug/c6768c00774d4a6685fb166b5322995d/dpdk/x86_64-native-bsdapp-gcc/include/rte_config.h  -Werror -D_KERNEL -DKLD_MODULE -nostdinc  -I/root/FreeBSD1201-64_K12.1_GCC7.3.0/x86_64-native-bsdapp-gcc+debug/c6768c00774d4a6685fb166b5322995d/dpdk/kernel/freebsd/nic_uio -I/root/FreeBSD1201-64_K12.1_GCC7.3.0/x86_64-native-bsdapp-gcc+debug/c6768c00774d4a6685fb166b5322995d/dpdk/x86_64-native-bsdapp-gcc/include -I. -I/usr/src/sys -I/usr/src/sys/contrib/ck/include -fno-common  -fno-omit-frame-pointer -mno-omit-leaf-frame-pointer -fdebug-prefix-map=./machine=/usr/src/sys/amd64/include -fdebug-prefix-map=./x86=/usr/src/sys/x86/include   -MD  -MF.depend.nic_uio.o -MTnic_uio.o -mcmodel=kernel -mno-red-zone -mno-mmx -mno-sse -msoft-float  -fno-asynchronous-unwind-tables -ffreestanding -fwrapv -fstack-protector -Wall -Wredundant-decls -Wnested-externs -Wstrict-prototypes -Wmissing-prototypes -Wpointer-arith -Wcast-qual -Wundef -Wno-pointer-sign -D__printf__=__freebsd_kprintf__ -Wmissing-include-dirs -fdiagnostics-show-option -Wno-unknown-pragmas -Wno-error-tautological-compare -Wno-error-empty-body -Wno-error-parentheses-equality -Wno-error-unused-function -Wno-error-pointer-sign -Wno-error-shift-negative-value -Wno-address-of-packed-member  -mno-aes -mno-avx  -std=iso9899:1999 -c nic_uio.c -o nic_uio.o
== Build drivers/common
ld -m elf_x86_64_fbsd -L/root/FreeBSD1201-64_K12.1_GCC7.3.0/x86_64-native-bsdapp-gcc+debug/c6768c00774d4a6685fb166b5322995d/dpdk/x86_64-native-bsdapp-gcc/lib -d -warn-common --build-id=sha1 -r -d -o contigmem.ko contigmem.o
ld -m elf_x86_64_fbsd -L/root/FreeBSD1201-64_K12.1_GCC7.3.0/x86_64-native-bsdapp-gcc+debug/c6768c00774d4a6685fb166b5322995d/dpdk/x86_64-native-bsdapp-gcc/lib -d -warn-common --build-id=sha1 -r -d -o nic_uio.ko nic_uio.o
--
  CC test_per_lcore.o
/usr/local/bin/ld: /root/FreeBSD1201-64_K12.1_GCC7.3.0/x86_64-native-bsdapp-gcc+debug/c6768c00774d4a6685fb166b5322995d/dpdk/x86_64-native-bsdapp-gcc/lib/librte_pmd_qat.a(qat_sym_frame.o): in function `qat_sym_get_qp':
qat_sym_frame.c:(.text.experimental+0x16): undefined reference to `rte_cryptodev_get_qp_status'
collect2: error: ld returned 1 exit status
gmake[5]: *** [/root/FreeBSD1201-64_K12.1_GCC7.3.0/x86_64-native-bsdapp-gcc+debug/c6768c00774d4a6685fb166b5322995d/dpdk/mk/rte.app.mk:454: dpdk-pdump] Error 1
gmake[4]: *** [/root/FreeBSD1201-64_K12.1_GCC7.3.0/x86_64-native-bsdapp-gcc+debug/c6768c00774d4a6685fb166b5322995d/dpdk/mk/rte.subdir.mk:37: pdump] Error 2
gmake[4]: *** Waiting for unfinished jobs....
  CC test_atomic.o
  CC test_barrier.o
--
  CC test_table_acl.o
/usr/local/bin/ld: /root/FreeBSD1201-64_K12.1_GCC7.3.0/x86_64-native-bsdapp-gcc+debug/c6768c00774d4a6685fb166b5322995d/dpdk/x86_64-native-bsdapp-gcc/lib/librte_pmd_qat.a(qat_sym_frame.o): in function `qat_sym_get_qp':
qat_sym_frame.c:(.text.experimental+0x16): undefined reference to `rte_cryptodev_get_qp_status'
collect2: error: ld returned 1 exit status
gmake[5]: *** [/root/FreeBSD1201-64_K12.1_GCC7.3.0/x86_64-native-bsdapp-gcc+debug/c6768c00774d4a6685fb166b5322995d/dpdk/mk/rte.app.mk:454: testpmd] Error 1
gmake[4]: *** [/root/FreeBSD1201-64_K12.1_GCC7.3.0/x86_64-native-bsdapp-gcc+debug/c6768c00774d4a6685fb166b5322995d/dpdk/mk/rte.subdir.mk:37: test-pmd] Error 2
  CC test_flow_classify.o
  CC test_rwlock.o
  CC test_stack.o
--
  LD test
/usr/local/bin/ld: /root/FreeBSD1201-64_K12.1_GCC7.3.0/x86_64-native-bsdapp-gcc+debug/c6768c00774d4a6685fb166b5322995d/dpdk/x86_64-native-bsdapp-gcc/lib/librte_pmd_qat.a(qat_sym_frame.o): in function `qat_sym_get_qp':
qat_sym_frame.c:(.text.experimental+0x16): undefined reference to `rte_cryptodev_get_qp_status'
collect2: error: ld returned 1 exit status
gmake[5]: *** [/root/FreeBSD1201-64_K12.1_GCC7.3.0/x86_64-native-bsdapp-gcc+debug/c6768c00774d4a6685fb166b5322995d/dpdk/mk/rte.app.mk:454: test] Error 1
gmake[4]: *** [/root/FreeBSD1201-64_K12.1_GCC7.3.0/x86_64-native-bsdapp-gcc+debug/c6768c00774d4a6685fb166b5322995d/dpdk/mk/rte.subdir.mk:37: test] Error 2
gmake[3]: *** [/root/FreeBSD1201-64_K12.1_GCC7.3.0/x86_64-native-bsdapp-gcc+debug/c6768c00774d4a6685fb166b5322995d/dpdk/mk/rte.sdkbuild.mk:53: app] Error 2
gmake[2]: *** [/root/FreeBSD1201-64_K12.1_GCC7.3.0/x86_64-native-bsdapp-gcc+debug/c6768c00774d4a6685fb166b5322995d/dpdk/mk/rte.sdkroot.mk:99: all] Error 2
gmake[1]: *** [/root/FreeBSD1201-64_K12.1_GCC7.3.0/x86_64-native-bsdapp-gcc+debug/c6768c00774d4a6685fb166b5322995d/dpdk/mk/rte.sdkinstall.mk:61: pre_install] Error 2
gmake: *** [/root/FreeBSD1201-64_K12.1_GCC7.3.0/x86_64-native-bsdapp-gcc+debug/c6768c00774d4a6685fb166b5322995d/dpdk/mk/rte.sdkroot.mk:77: install] Error 2


*Makefile Build Failed #13:
OS: RHEL82-64
Target: x86_64-native-linuxapp-gcc
  CC test_atomic.o
/root/RHEL82-64_K4.18.0_GCC8.3.1/x86_64-native-linuxapp-gcc/c6768c00774d4a6685fb166b5322995d/dpdk/x86_64-native-linuxapp-gcc/lib/librte_pmd_qat.a(qat_sym_frame.o): In function `qat_sym_get_qp':
qat_sym_frame.c:(.text.experimental+0x16): undefined reference to `rte_cryptodev_get_qp_status'
collect2: error: ld returned 1 exit status
make[5]: *** [/root/RHEL82-64_K4.18.0_GCC8.3.1/x86_64-native-linuxapp-gcc/c6768c00774d4a6685fb166b5322995d/dpdk/mk/rte.app.mk:454: dpdk-procinfo] Error 1
make[4]: *** [/root/RHEL82-64_K4.18.0_GCC8.3.1/x86_64-native-linuxapp-gcc/c6768c00774d4a6685fb166b5322995d/dpdk/mk/rte.subdir.mk:37: proc-info] Error 2
make[4]: *** Waiting for unfinished jobs....
  CC test_barrier.o
  CC test_malloc.o
--
  LD testpmd
/root/RHEL82-64_K4.18.0_GCC8.3.1/x86_64-native-linuxapp-gcc/c6768c00774d4a6685fb166b5322995d/dpdk/x86_64-native-linuxapp-gcc/lib/librte_pmd_qat.a(qat_sym_frame.o): In function `qat_sym_get_qp':
qat_sym_frame.c:(.text.experimental+0x16): undefined reference to `rte_cryptodev_get_qp_status'
collect2: error: ld returned 1 exit status
make[5]: *** [/root/RHEL82-64_K4.18.0_GCC8.3.1/x86_64-native-linuxapp-gcc/c6768c00774d4a6685fb166b5322995d/dpdk/mk/rte.app.mk:454: testpmd] Error 1
make[4]: *** [/root/RHEL82-64_K4.18.0_GCC8.3.1/x86_64-native-linuxapp-gcc/c6768c00774d4a6685fb166b5322995d/dpdk/mk/rte.subdir.mk:37: test-pmd] Error 2
  CC test_table_acl.o
  CC test_flow_classify.o
  CC test_rwlock.o
--
  LD test
/root/RHEL82-64_K4.18.0_GCC8.3.1/x86_64-native-linuxapp-gcc/c6768c00774d4a6685fb166b5322995d/dpdk/x86_64-native-linuxapp-gcc/lib/librte_pmd_qat.a(qat_sym_frame.o): In function `qat_sym_get_qp':
qat_sym_frame.c:(.text.experimental+0x16): undefined reference to `rte_cryptodev_get_qp_status'
collect2: error: ld returned 1 exit status
make[5]: *** [/root/RHEL82-64_K4.18.0_GCC8.3.1/x86_64-native-linuxapp-gcc/c6768c00774d4a6685fb166b5322995d/dpdk/mk/rte.app.mk:454: test] Error 1
make[4]: *** [/root/RHEL82-64_K4.18.0_GCC8.3.1/x86_64-native-linuxapp-gcc/c6768c00774d4a6685fb166b5322995d/dpdk/mk/rte.subdir.mk:37: test] Error 2
make[3]: *** [/root/RHEL82-64_K4.18.0_GCC8.3.1/x86_64-native-linuxapp-gcc/c6768c00774d4a6685fb166b5322995d/dpdk/mk/rte.sdkbuild.mk:53: app] Error 2
make[2]: *** [/root/RHEL82-64_K4.18.0_GCC8.3.1/x86_64-native-linuxapp-gcc/c6768c00774d4a6685fb166b5322995d/dpdk/mk/rte.sdkroot.mk:99: all] Error 2
make[1]: *** [/root/RHEL82-64_K4.18.0_GCC8.3.1/x86_64-native-linuxapp-gcc/c6768c00774d4a6685fb166b5322995d/dpdk/mk/rte.sdkinstall.mk:61: pre_install] Error 2
make: *** [/root/RHEL82-64_K4.18.0_GCC8.3.1/x86_64-native-linuxapp-gcc/c6768c00774d4a6685fb166b5322995d/dpdk/mk/rte.sdkroot.mk:77: install] Error 2


*Makefile Build Failed #14:
OS: SUSE15-64
Target: x86_64-native-linuxapp-clang
  CC test_resource.o
  CC test_prefetch.o
  CC test_byteorder.o
clang-5.0.1: error: linker command failed with exit code 1 (use -v to see invocation)
make[5]: *** [/root/SUSE15-64_K4.12.14_Clang5.0.1/x86_64-native-linuxapp-clang/c6768c00774d4a6685fb166b5322995d/dpdk/mk/rte.app.mk:454: dpdk-procinfo] Error 1
make[4]: *** [/root/SUSE15-64_K4.12.14_Clang5.0.1/x86_64-native-linuxapp-clang/c6768c00774d4a6685fb166b5322995d/dpdk/mk/rte.subdir.mk:35: proc-info] Error 2
make[4]: *** Waiting for unfinished jobs....
  CC parameters.o
  CC test_per_lcore.o
--
  LD testpmd
/root/SUSE15-64_K4.12.14_Clang5.0.1/x86_64-native-linuxapp-clang/c6768c00774d4a6685fb166b5322995d/dpdk/x86_64-native-linuxapp-clang/lib/librte_pmd_qat.a(qat_sym_frame.o): In function `qat_sym_get_qp':
/root/SUSE15-64_K4.12.14_Clang5.0.1/x86_64-native-linuxapp-clang/c6768c00774d4a6685fb166b5322995d/dpdk/drivers/crypto/qat/qat_sym_frame.c:(.text.experimental+0xe): undefined reference to `rte_cryptodev_get_qp_status'
clang-5.0.1: error: linker command failed with exit code 1 (use -v to see invocation)
make[5]: *** [/root/SUSE15-64_K4.12.14_Clang5.0.1/x86_64-native-linuxapp-clang/c6768c00774d4a6685fb166b5322995d/dpdk/mk/rte.app.mk:454: testpmd] Error 1
make[4]: *** [/root/SUSE15-64_K4.12.14_Clang5.0.1/x86_64-native-linuxapp-clang/c6768c00774d4a6685fb166b5322995d/dpdk/mk/rte.subdir.mk:35: test-pmd] Error 2
  CC test_ring_peek_stress.o
  CC test_ring_rts_stress.o
  CC test_ring_stress.o
--
  LD test
/root/SUSE15-64_K4.12.14_Clang5.0.1/x86_64-native-linuxapp-clang/c6768c00774d4a6685fb166b5322995d/dpdk/x86_64-native-linuxapp-clang/lib/librte_pmd_qat.a(qat_sym_frame.o): In function `qat_sym_get_qp':
/root/SUSE15-64_K4.12.14_Clang5.0.1/x86_64-native-linuxapp-clang/c6768c00774d4a6685fb166b5322995d/dpdk/drivers/crypto/qat/qat_sym_frame.c:(.text.experimental+0xe): undefined reference to `rte_cryptodev_get_qp_status'
clang-5.0.1: error: linker command failed with exit code 1 (use -v to see invocation)
make[5]: *** [/root/SUSE15-64_K4.12.14_Clang5.0.1/x86_64-native-linuxapp-clang/c6768c00774d4a6685fb166b5322995d/dpdk/mk/rte.app.mk:454: test] Error 1
make[4]: *** [/root/SUSE15-64_K4.12.14_Clang5.0.1/x86_64-native-linuxapp-clang/c6768c00774d4a6685fb166b5322995d/dpdk/mk/rte.subdir.mk:35: test] Error 2
make[3]: *** [/root/SUSE15-64_K4.12.14_Clang5.0.1/x86_64-native-linuxapp-clang/c6768c00774d4a6685fb166b5322995d/dpdk/mk/rte.sdkbuild.mk:53: app] Error 2
make[2]: *** [/root/SUSE15-64_K4.12.14_Clang5.0.1/x86_64-native-linuxapp-clang/c6768c00774d4a6685fb166b5322995d/dpdk/mk/rte.sdkroot.mk:99: all] Error 2
make[1]: *** [/root/SUSE15-64_K4.12.14_Clang5.0.1/x86_64-native-linuxapp-clang/c6768c00774d4a6685fb166b5322995d/dpdk/mk/rte.sdkinstall.mk:61: pre_install] Error 2
make: *** [/root/SUSE15-64_K4.12.14_Clang5.0.1/x86_64-native-linuxapp-clang/c6768c00774d4a6685fb166b5322995d/dpdk/mk/rte.sdkroot.mk:77: install] Error 2


*Makefile Build Failed #15:
OS: SUSE15-64
Target: x86_64-native-linuxapp-gcc
  CC test_barrier.o
/root/SUSE15-64_K4.12.14_GCC7.3.1/x86_64-native-linuxapp-gcc/c6768c00774d4a6685fb166b5322995d/dpdk/x86_64-native-linuxapp-gcc/lib/librte_pmd_qat.a(qat_sym_frame.o): In function `qat_sym_get_qp':
qat_sym_frame.c:(.text.experimental+0x16): undefined reference to `rte_cryptodev_get_qp_status'
collect2: error: ld returned 1 exit status
make[5]: *** [/root/SUSE15-64_K4.12.14_GCC7.3.1/x86_64-native-linuxapp-gcc/c6768c00774d4a6685fb166b5322995d/dpdk/mk/rte.app.mk:454: dpdk-procinfo] Error 1
make[4]: *** [/root/SUSE15-64_K4.12.14_GCC7.3.1/x86_64-native-linuxapp-gcc/c6768c00774d4a6685fb166b5322995d/dpdk/mk/rte.subdir.mk:35: proc-info] Error 2
make[4]: *** Waiting for unfinished jobs....
  CC test_malloc.o
  CC test_cycles.o
--
  LD testpmd
/root/SUSE15-64_K4.12.14_GCC7.3.1/x86_64-native-linuxapp-gcc/c6768c00774d4a6685fb166b5322995d/dpdk/x86_64-native-linuxapp-gcc/lib/librte_pmd_qat.a(qat_sym_frame.o): In function `qat_sym_get_qp':
qat_sym_frame.c:(.text.experimental+0x16): undefined reference to `rte_cryptodev_get_qp_status'
collect2: error: ld returned 1 exit status
make[5]: *** [/root/SUSE15-64_K4.12.14_GCC7.3.1/x86_64-native-linuxapp-gcc/c6768c00774d4a6685fb166b5322995d/dpdk/mk/rte.app.mk:454: testpmd] Error 1
make[4]: *** [/root/SUSE15-64_K4.12.14_GCC7.3.1/x86_64-native-linuxapp-gcc/c6768c00774d4a6685fb166b5322995d/dpdk/mk/rte.subdir.mk:35: test-pmd] Error 2
  CC test_ring_peek_stress.o
  CC test_ring_rts_stress.o
  CC test_ring_stress.o
--
  LD test
/root/SUSE15-64_K4.12.14_GCC7.3.1/x86_64-native-linuxapp-gcc/c6768c00774d4a6685fb166b5322995d/dpdk/x86_64-native-linuxapp-gcc/lib/librte_pmd_qat.a(qat_sym_frame.o): In function `qat_sym_get_qp':
qat_sym_frame.c:(.text.experimental+0x16): undefined reference to `rte_cryptodev_get_qp_status'
collect2: error: ld returned 1 exit status
make[5]: *** [/root/SUSE15-64_K4.12.14_GCC7.3.1/x86_64-native-linuxapp-gcc/c6768c00774d4a6685fb166b5322995d/dpdk/mk/rte.app.mk:454: test] Error 1
make[4]: *** [/root/SUSE15-64_K4.12.14_GCC7.3.1/x86_64-native-linuxapp-gcc/c6768c00774d4a6685fb166b5322995d/dpdk/mk/rte.subdir.mk:35: test] Error 2
make[3]: *** [/root/SUSE15-64_K4.12.14_GCC7.3.1/x86_64-native-linuxapp-gcc/c6768c00774d4a6685fb166b5322995d/dpdk/mk/rte.sdkbuild.mk:53: app] Error 2
make[2]: *** [/root/SUSE15-64_K4.12.14_GCC7.3.1/x86_64-native-linuxapp-gcc/c6768c00774d4a6685fb166b5322995d/dpdk/mk/rte.sdkroot.mk:99: all] Error 2
make[1]: *** [/root/SUSE15-64_K4.12.14_GCC7.3.1/x86_64-native-linuxapp-gcc/c6768c00774d4a6685fb166b5322995d/dpdk/mk/rte.sdkinstall.mk:61: pre_install] Error 2
make: *** [/root/SUSE15-64_K4.12.14_GCC7.3.1/x86_64-native-linuxapp-gcc/c6768c00774d4a6685fb166b5322995d/dpdk/mk/rte.sdkroot.mk:77: install] Error 2


*Makefile Build Failed #16:
OS: UB1804-64
Target: x86_64-native-linuxapp-gcc
  CC test_barrier.o
/root/UB1804-64_K4.15.0_GCC7.3.0/x86_64-native-linuxapp-gcc/c6768c00774d4a6685fb166b5322995d/dpdk/x86_64-native-linuxapp-gcc/lib/librte_pmd_qat.a(qat_sym_frame.o): In function `qat_sym_get_qp':
qat_sym_frame.c:(.text.experimental+0x16): undefined reference to `rte_cryptodev_get_qp_status'
collect2: error: ld returned 1 exit status
/root/UB1804-64_K4.15.0_GCC7.3.0/x86_64-native-linuxapp-gcc/c6768c00774d4a6685fb166b5322995d/dpdk/mk/rte.app.mk:452: recipe for target 'dpdk-procinfo' failed
make[5]: *** [dpdk-procinfo] Error 1
/root/UB1804-64_K4.15.0_GCC7.3.0/x86_64-native-linuxapp-gcc/c6768c00774d4a6685fb166b5322995d/dpdk/mk/rte.subdir.mk:35: recipe for target 'proc-info' failed
make[4]: *** [proc-info] Error 2
make[4]: *** Waiting for unfinished jobs....
  CC test_malloc.o
  CC test_cycles.o
--
  LD testpmd
/root/UB1804-64_K4.15.0_GCC7.3.0/x86_64-native-linuxapp-gcc/c6768c00774d4a6685fb166b5322995d/dpdk/x86_64-native-linuxapp-gcc/lib/librte_pmd_qat.a(qat_sym_frame.o): In function `qat_sym_get_qp':
qat_sym_frame.c:(.text.experimental+0x16): undefined reference to `rte_cryptodev_get_qp_status'
collect2: error: ld returned 1 exit status
/root/UB1804-64_K4.15.0_GCC7.3.0/x86_64-native-linuxapp-gcc/c6768c00774d4a6685fb166b5322995d/dpdk/mk/rte.app.mk:452: recipe for target 'testpmd' failed
make[5]: *** [testpmd] Error 1
/root/UB1804-64_K4.15.0_GCC7.3.0/x86_64-native-linuxapp-gcc/c6768c00774d4a6685fb166b5322995d/dpdk/mk/rte.subdir.mk:35: recipe for target 'test-pmd' failed
make[4]: *** [test-pmd] Error 2
  CC test_ring_peek_stress.o
  CC test_ring_rts_stress.o
  CC test_ring_stress.o
--
  LD test
/root/UB1804-64_K4.15.0_GCC7.3.0/x86_64-native-linuxapp-gcc/c6768c00774d4a6685fb166b5322995d/dpdk/x86_64-native-linuxapp-gcc/lib/librte_pmd_qat.a(qat_sym_frame.o): In function `qat_sym_get_qp':
qat_sym_frame.c:(.text.experimental+0x16): undefined reference to `rte_cryptodev_get_qp_status'
collect2: error: ld returned 1 exit status
/root/UB1804-64_K4.15.0_GCC7.3.0/x86_64-native-linuxapp-gcc/c6768c00774d4a6685fb166b5322995d/dpdk/mk/rte.app.mk:452: recipe for target 'test' failed
make[5]: *** [test] Error 1
/root/UB1804-64_K4.15.0_GCC7.3.0/x86_64-native-linuxapp-gcc/c6768c00774d4a6685fb166b5322995d/dpdk/mk/rte.subdir.mk:35: recipe for target 'test' failed
make[4]: *** [test] Error 2
/root/UB1804-64_K4.15.0_GCC7.3.0/x86_64-native-linuxapp-gcc/c6768c00774d4a6685fb166b5322995d/dpdk/mk/rte.sdkbuild.mk:51: recipe for target 'app' failed
make[3]: *** [app] Error 2
/root/UB1804-64_K4.15.0_GCC7.3.0/x86_64-native-linuxapp-gcc/c6768c00774d4a6685fb166b5322995d/dpdk/mk/rte.sdkroot.mk:98: recipe for target 'all' failed
make[2]: *** [all] Error 2
/root/UB1804-64_K4.15.0_GCC7.3.0/x86_64-native-linuxapp-gcc/c6768c00774d4a6685fb166b5322995d/dpdk/mk/rte.sdkinstall.mk:60: recipe for target 'pre_install' failed
make[1]: *** [pre_install] Error 2
/root/UB1804-64_K4.15.0_GCC7.3.0/x86_64-native-linuxapp-gcc/c6768c00774d4a6685fb166b5322995d/dpdk/mk/rte.sdkroot.mk:77: recipe for target 'install' failed
make: *** [install] Error 2


*Makefile Build Failed #17:
OS: UB2004-64
Target: x86_64-native-linuxapp-clang
/usr/bin/ld: /root/UB2004-64_K5.4.0_Clang10.0.0/x86_64-native-linuxapp-clang/c6768c00774d4a6685fb166b5322995d/dpdk/x86_64-native-linuxapp-clang/lib/librte_pmd_qat.a(qat_sym_frame.o): in function `qat_sym_get_qp':
qat_sym_frame.c:(.text.experimental+0xe): undefined reference to `rte_cryptodev_get_qp_status'
  CC test_atomic.o
clang: error: linker command failed with exit code 1 (use -v to see invocation)
make[5]: *** [/root/UB2004-64_K5.4.0_Clang10.0.0/x86_64-native-linuxapp-clang/c6768c00774d4a6685fb166b5322995d/dpdk/mk/rte.app.mk:454: dpdk-procinfo] Error 1
make[4]: *** [/root/UB2004-64_K5.4.0_Clang10.0.0/x86_64-native-linuxapp-clang/c6768c00774d4a6685fb166b5322995d/dpdk/mk/rte.subdir.mk:35: proc-info] Error 2
make[4]: *** Waiting for unfinished jobs....
  CC parameters.o
  CC test_barrier.o
--
  LD testpmd
/usr/bin/ld: /root/UB2004-64_K5.4.0_Clang10.0.0/x86_64-native-linuxapp-clang/c6768c00774d4a6685fb166b5322995d/dpdk/x86_64-native-linuxapp-clang/lib/librte_pmd_qat.a(qat_sym_frame.o): in function `qat_sym_get_qp':
qat_sym_frame.c:(.text.experimental+0xe): undefined reference to `rte_cryptodev_get_qp_status'
clang: error: linker command failed with exit code 1 (use -v to see invocation)
make[5]: *** [/root/UB2004-64_K5.4.0_Clang10.0.0/x86_64-native-linuxapp-clang/c6768c00774d4a6685fb166b5322995d/dpdk/mk/rte.app.mk:454: testpmd] Error 1
make[4]: *** [/root/UB2004-64_K5.4.0_Clang10.0.0/x86_64-native-linuxapp-clang/c6768c00774d4a6685fb166b5322995d/dpdk/mk/rte.subdir.mk:35: test-pmd] Error 2
  CC test_ring_peek_stress.o
  CC test_ring_rts_stress.o
  CC test_ring_stress.o
--
  LD test
/usr/bin/ld: /root/UB2004-64_K5.4.0_Clang10.0.0/x86_64-native-linuxapp-clang/c6768c00774d4a6685fb166b5322995d/dpdk/x86_64-native-linuxapp-clang/lib/librte_pmd_qat.a(qat_sym_frame.o): in function `qat_sym_get_qp':
qat_sym_frame.c:(.text.experimental+0xe): undefined reference to `rte_cryptodev_get_qp_status'
clang: error: linker command failed with exit code 1 (use -v to see invocation)
make[5]: *** [/root/UB2004-64_K5.4.0_Clang10.0.0/x86_64-native-linuxapp-clang/c6768c00774d4a6685fb166b5322995d/dpdk/mk/rte.app.mk:454: test] Error 1
make[4]: *** [/root/UB2004-64_K5.4.0_Clang10.0.0/x86_64-native-linuxapp-clang/c6768c00774d4a6685fb166b5322995d/dpdk/mk/rte.subdir.mk:35: test] Error 2
make[3]: *** [/root/UB2004-64_K5.4.0_Clang10.0.0/x86_64-native-linuxapp-clang/c6768c00774d4a6685fb166b5322995d/dpdk/mk/rte.sdkbuild.mk:53: app] Error 2
make[2]: *** [/root/UB2004-64_K5.4.0_Clang10.0.0/x86_64-native-linuxapp-clang/c6768c00774d4a6685fb166b5322995d/dpdk/mk/rte.sdkroot.mk:99: all] Error 2
make[1]: *** [/root/UB2004-64_K5.4.0_Clang10.0.0/x86_64-native-linuxapp-clang/c6768c00774d4a6685fb166b5322995d/dpdk/mk/rte.sdkinstall.mk:61: pre_install] Error 2
make: *** [/root/UB2004-64_K5.4.0_Clang10.0.0/x86_64-native-linuxapp-clang/c6768c00774d4a6685fb166b5322995d/dpdk/mk/rte.sdkroot.mk:77: install] Error 2


*Makefile Build Failed #18:
OS: UB2004-64
Target: x86_64-native-linuxapp-gcc
/usr/bin/ld: /root/UB2004-64_K5.4.0_GCC9.3.0/x86_64-native-linuxapp-gcc/c6768c00774d4a6685fb166b5322995d/dpdk/x86_64-native-linuxapp-gcc/lib/librte_pmd_qat.a(qat_sym_frame.o): in function `qat_sym_get_qp':
qat_sym_frame.c:(.text.experimental+0x18): undefined reference to `rte_cryptodev_get_qp_status'
  CC test_barrier.o
collect2: error: ld returned 1 exit status
make[5]: *** [/root/UB2004-64_K5.4.0_GCC9.3.0/x86_64-native-linuxapp-gcc/c6768c00774d4a6685fb166b5322995d/dpdk/mk/rte.app.mk:454: dpdk-procinfo] Error 1
make[4]: *** [/root/UB2004-64_K5.4.0_GCC9.3.0/x86_64-native-linuxapp-gcc/c6768c00774d4a6685fb166b5322995d/dpdk/mk/rte.subdir.mk:37: proc-info] Error 2
make[4]: *** Waiting for unfinished jobs....
  CC test_malloc.o
  CC test_cycles.o
--
/usr/bin/ld: /root/UB2004-64_K5.4.0_GCC9.3.0/x86_64-native-linuxapp-gcc/c6768c00774d4a6685fb166b5322995d/dpdk/x86_64-native-linuxapp-gcc/lib/librte_pmd_qat.a(qat_sym_frame.o): in function `qat_sym_get_qp':
qat_sym_frame.c:(.text.experimental+0x18): undefined reference to `rte_cryptodev_get_qp_status'
  CC test_ring_perf.o
collect2: error: ld returned 1 exit status
make[5]: *** [/root/UB2004-64_K5.4.0_GCC9.3.0/x86_64-native-linuxapp-gcc/c6768c00774d4a6685fb166b5322995d/dpdk/mk/rte.app.mk:454: testpmd] Error 1
make[4]: *** [/root/UB2004-64_K5.4.0_GCC9.3.0/x86_64-native-linuxapp-gcc/c6768c00774d4a6685fb166b5322995d/dpdk/mk/rte.subdir.mk:37: test-pmd] Error 2
  CC test_ring_peek_stress.o
  CC test_ring_rts_stress.o
  CC test_ring_stress.o
--
  LD test
/usr/bin/ld: /root/UB2004-64_K5.4.0_GCC9.3.0/x86_64-native-linuxapp-gcc/c6768c00774d4a6685fb166b5322995d/dpdk/x86_64-native-linuxapp-gcc/lib/librte_pmd_qat.a(qat_sym_frame.o): in function `qat_sym_get_qp':
qat_sym_frame.c:(.text.experimental+0x18): undefined reference to `rte_cryptodev_get_qp_status'
collect2: error: ld returned 1 exit status
make[5]: *** [/root/UB2004-64_K5.4.0_GCC9.3.0/x86_64-native-linuxapp-gcc/c6768c00774d4a6685fb166b5322995d/dpdk/mk/rte.app.mk:454: test] Error 1
make[4]: *** [/root/UB2004-64_K5.4.0_GCC9.3.0/x86_64-native-linuxapp-gcc/c6768c00774d4a6685fb166b5322995d/dpdk/mk/rte.subdir.mk:37: test] Error 2
make[3]: *** [/root/UB2004-64_K5.4.0_GCC9.3.0/x86_64-native-linuxapp-gcc/c6768c00774d4a6685fb166b5322995d/dpdk/mk/rte.sdkbuild.mk:53: app] Error 2
make[2]: *** [/root/UB2004-64_K5.4.0_GCC9.3.0/x86_64-native-linuxapp-gcc/c6768c00774d4a6685fb166b5322995d/dpdk/mk/rte.sdkroot.mk:99: all] Error 2
make[1]: *** [/root/UB2004-64_K5.4.0_GCC9.3.0/x86_64-native-linuxapp-gcc/c6768c00774d4a6685fb166b5322995d/dpdk/mk/rte.sdkinstall.mk:61: pre_install] Error 2
make: *** [/root/UB2004-64_K5.4.0_GCC9.3.0/x86_64-native-linuxapp-gcc/c6768c00774d4a6685fb166b5322995d/dpdk/mk/rte.sdkroot.mk:77: install] Error 2


*Makefile Build Failed #19:
OS: UB2004-64
Target: x86_64-native-linuxapp-icc
  CC test_atomic.o
ld: /root/UB2004-64_K5.4.0_ICC19.1.0/x86_64-native-linuxapp-icc/c6768c00774d4a6685fb166b5322995d/dpdk/x86_64-native-linuxapp-icc/lib/librte_pmd_qat.a(qat_sym_frame.o): in function `qat_sym_get_qp':
qat_sym_frame.c:(.text.experimental+0x16): undefined reference to `rte_cryptodev_get_qp_status'
make[5]: *** [/root/UB2004-64_K5.4.0_ICC19.1.0/x86_64-native-linuxapp-icc/c6768c00774d4a6685fb166b5322995d/dpdk/mk/rte.app.mk:454: dpdk-procinfo] Error 1
make[4]: *** [/root/UB2004-64_K5.4.0_ICC19.1.0/x86_64-native-linuxapp-icc/c6768c00774d4a6685fb166b5322995d/dpdk/mk/rte.subdir.mk:37: proc-info] Error 2
make[4]: *** Waiting for unfinished jobs....
  CC test_barrier.o
  CC test_malloc.o
--
  LD testpmd
ld: /root/UB2004-64_K5.4.0_ICC19.1.0/x86_64-native-linuxapp-icc/c6768c00774d4a6685fb166b5322995d/dpdk/x86_64-native-linuxapp-icc/lib/librte_pmd_qat.a(qat_sym_frame.o): in function `qat_sym_get_qp':
qat_sym_frame.c:(.text.experimental+0x16): undefined reference to `rte_cryptodev_get_qp_status'
make[5]: *** [/root/UB2004-64_K5.4.0_ICC19.1.0/x86_64-native-linuxapp-icc/c6768c00774d4a6685fb166b5322995d/dpdk/mk/rte.app.mk:454: testpmd] Error 1
make[4]: *** [/root/UB2004-64_K5.4.0_ICC19.1.0/x86_64-native-linuxapp-icc/c6768c00774d4a6685fb166b5322995d/dpdk/mk/rte.subdir.mk:37: test-pmd] Error 2
  CC test_ring_peek_stress.o
  CC test_ring_rts_stress.o
  CC test_ring_stress.o
--
  LD test
ld: /root/UB2004-64_K5.4.0_ICC19.1.0/x86_64-native-linuxapp-icc/c6768c00774d4a6685fb166b5322995d/dpdk/x86_64-native-linuxapp-icc/lib/librte_pmd_qat.a(qat_sym_frame.o): in function `qat_sym_get_qp':
qat_sym_frame.c:(.text.experimental+0x16): undefined reference to `rte_cryptodev_get_qp_status'
make[5]: *** [/root/UB2004-64_K5.4.0_ICC19.1.0/x86_64-native-linuxapp-icc/c6768c00774d4a6685fb166b5322995d/dpdk/mk/rte.app.mk:454: test] Error 1
make[4]: *** [/root/UB2004-64_K5.4.0_ICC19.1.0/x86_64-native-linuxapp-icc/c6768c00774d4a6685fb166b5322995d/dpdk/mk/rte.subdir.mk:37: test] Error 2
make[3]: *** [/root/UB2004-64_K5.4.0_ICC19.1.0/x86_64-native-linuxapp-icc/c6768c00774d4a6685fb166b5322995d/dpdk/mk/rte.sdkbuild.mk:53: app] Error 2
make[2]: *** [/root/UB2004-64_K5.4.0_ICC19.1.0/x86_64-native-linuxapp-icc/c6768c00774d4a6685fb166b5322995d/dpdk/mk/rte.sdkroot.mk:99: all] Error 2
make[1]: *** [/root/UB2004-64_K5.4.0_ICC19.1.0/x86_64-native-linuxapp-icc/c6768c00774d4a6685fb166b5322995d/dpdk/mk/rte.sdkinstall.mk:61: pre_install] Error 2
make: *** [/root/UB2004-64_K5.4.0_ICC19.1.0/x86_64-native-linuxapp-icc/c6768c00774d4a6685fb166b5322995d/dpdk/mk/rte.sdkroot.mk:77: install] Error 2
DPDK STV team

^ permalink raw reply	[flat|nested] 2+ messages in thread

end of thread, other threads:[~2020-06-28 14:04 UTC | newest]

Thread overview: 2+ messages (download: mbox.gz / follow: Atom feed)
-- links below jump to the message on this page --
2020-06-28 14:04 [dpdk-test-report] |FAILURE| pw(72184) [v2, 1/3] crypto/qat: add data-path APIs sys_stv
  -- strict thread matches above, loose matches on Subject: below --
2020-06-26  5:28 sys_stv

automatic DPDK test reports

This inbox may be cloned and mirrored by anyone:

	git clone --mirror https://inbox.dpdk.org/test-report/0 test-report/git/0.git

	# If you have public-inbox 1.1+ installed, you may
	# initialize and index your mirror using the following commands:
	public-inbox-init -V2 test-report test-report/ https://inbox.dpdk.org/test-report \
		test-report@dpdk.org
	public-inbox-index test-report

Example config snippet for mirrors.
Newsgroup available over NNTP:
	nntp://inbox.dpdk.org/inbox.dpdk.test-report


AGPL code for this site: git clone https://public-inbox.org/public-inbox.git