automatic DPDK test reports
 help / color / mirror / Atom feed
* [dpdk-test-report]  |FAILURE| pw(72522) [v3, 12/13] drivers/baseband: use log register macro
@ 2020-07-01 11:10 sys_stv
  0 siblings, 0 replies; 3+ messages in thread
From: sys_stv @ 2020-07-01 11:10 UTC (permalink / raw)
  To: test-report

[-- Attachment #1: Type: text/plain, Size: 421 bytes --]


Test-Label: Intel-compilation
Test-Status: FAILURE
http://dpdk.org/patch/72522

_apply issues_

Submitter: Jerin Jacob <jerinj@marvell.com>
Date: 2020-07-01 06:48:27
Reply_mail: 20200701064828.4097247-13-jerinj@marvell.com

DPDK git baseline:
	Repo:dpdk, CommitID: 949c97ae310af049075c8745208e8795b9071d9c

Apply patchset failed, the failed patch is:                            http://dpdk.org/patch/72513
DPDK STV team

^ permalink raw reply	[flat|nested] 3+ messages in thread

* [dpdk-test-report]  |FAILURE| pw(72522) [v3, 12/13] drivers/baseband: use log register macro
@ 2020-07-02  4:12 sys_stv
  0 siblings, 0 replies; 3+ messages in thread
From: sys_stv @ 2020-07-02  4:12 UTC (permalink / raw)
  To: test-report

[-- Attachment #1: Type: text/plain, Size: 421 bytes --]


Test-Label: Intel-compilation
Test-Status: FAILURE
http://dpdk.org/patch/72522

_apply issues_

Submitter: Jerin Jacob <jerinj@marvell.com>
Date: 2020-07-01 06:48:27
Reply_mail: 20200701064828.4097247-13-jerinj@marvell.com

DPDK git baseline:
	Repo:dpdk, CommitID: 949c97ae310af049075c8745208e8795b9071d9c

Apply patchset failed, the failed patch is:                            http://dpdk.org/patch/72513
DPDK STV team

^ permalink raw reply	[flat|nested] 3+ messages in thread

* [dpdk-test-report]  |FAILURE| pw(72522) [v3, 12/13] drivers/baseband: use log register macro
@ 2020-07-02  4:01 sys_stv
  0 siblings, 0 replies; 3+ messages in thread
From: sys_stv @ 2020-07-02  4:01 UTC (permalink / raw)
  To: test-report

[-- Attachment #1: Type: text/plain, Size: 38387 bytes --]


Test-Label: Intel-compilation
Test-Status: FAILURE
http://dpdk.org/patch/72522

_Compilation issues_

Submitter: Jerin Jacob <jerinj@marvell.com>
Date: 2020-07-01 06:48:27
Reply_mail: 20200701064828.4097247-13-jerinj@marvell.com

DPDK git baseline: Repo:dpdk, CommitID: 949c97ae310af049075c8745208e8795b9071d9c


Meson build Summary: 8 Builds Done, 7 Successful, 1 Failures, 0 Blocked

Makefile build Summary: 20 Builds Done, 16 Successful, 4 Failures, 0 Blocked

                +==============================================+===========+==========+
                |                   Makefile                   |   Meson   | Document |
+----------------+------+-------+------+------------+-----------+-----------+----------+
| os             | gcc  | clang | icc  | gcc+shared | gcc+debug | gcc/clang | pdf/html |
+----------------+------+-------+------+------------+-----------+-----------+----------+
| CENTOS82-64    | pass | pass  | pass | pass       | pass      | pass      |          |
| RHEL82-64      | pass |       |      |            |           |           |          |
| UB1804-64      | pass |       |      |            |           |           |          |
| FC32-64        | pass | pass  |      |            |           | pass      |          |
| CENTOS77-64    | pass |       |      |            |           |           |          |
| UB2004-64      | pass | pass  | pass |            |           | pass      | pass     |
| WIN10-64       |      |       |      |            |           | pass      |          |
| UB2004-32      | pass |       |      |            |           |           |          |
| UB1804-32      |      |       |      |            |           | pass      |          |
| FreeBSD1201-64 | FAIL | FAIL  |      | FAIL       | FAIL      | FAIL      |          |
| SUSE15-64      | pass | pass  |      |            |           | pass      |          |
+----------------+------+-------+------+------------+-----------+-----------+----------+
Test environment and configuration as below:

** Makefile build **


OS: CENTOS82-64
	Kernel Version: 4.18.0-193.el8.x86_64
	CPU info: Intel(R) Xeon(R) Platinum 8280M CPU @ 2.70GHz
	GCC Version: gcc (GCC) 8.3.1 20191121 (Red Hat 8.3.1-5)
	Clang Version: 9.0.1 (Red Hat 9.0.1-2.module_el8.2.0+309+0c7b6b03)
	x86_64-native-linuxapp-gcc
	x86_64-native-linuxapp-clang
	x86_64-native-linuxapp-icc
	x86_64-native-linuxapp-gcc+shared
	x86_64-native-linuxapp-gcc+debug


OS: RHEL82-64
	Kernel Version: 4.18.0-193.el8.x86_64
	CPU info: Intel(R) Xeon(R) Platinum 8280M CPU @ 2.70GHz
	GCC Version: gcc (GCC) 8.3.1 20191121 (Red Hat 8.3.1-5)
	Clang Version: 8.0.1 (Red Hat 8.0.1-1.module_el8.1.0+215+a01033fb)
	x86_64-native-linuxapp-gcc


OS: UB1804-64
	Kernel Version: 4.15.0-29-generic
	CPU info: Intel(R) Xeon(R) Platinum 8180 CPU @ 2.50GHz
	GCC Version: gcc (Ubuntu 7.5.0-3ubuntu1~18.04) 7.5.0
	Clang Version: 6.0.0-1ubuntu2 (tags/RELEASE_600/final)
	x86_64-native-linuxapp-gcc


OS: FC32-64
	Kernel Version: 5.6.0-0.rc7.git0.2.fc32.x86_64
	CPU info: Intel(R) Xeon(R) Platinum 8280M CPU @ 2.70GHz
	GCC Version: gcc (GCC) 10.0.1 20200311 (Red Hat 10.0.1-0.9)
	Clang Version: 10.0.0 (Fedora 10.0.0-0.3.rc4.fc32)
	x86_64-native-linuxapp-gcc
	x86_64-native-linuxapp-clang


OS: CENTOS77-64
	Kernel Version: 3.10.0-1062.9.1.el7.x86_64
	CPU info: Intel(R) Xeon(R) Platinum 8280M CPU @ 2.70GHz
	GCC Version: gcc (GCC) 4.8.5 20150623 (Red Hat 4.8.5-39)
	Clang Version: 3.4.2 (tags/RELEASE_34/dot2-final)
	x86_64-native-linuxapp-gcc


OS: UB2004-64
	Kernel Version: 5.4.0-26-generic
	CPU info: Intel(R) Xeon(R) Platinum 8180 CPU @ 2.50GHz
	GCC Version: gcc (Ubuntu 10-20200416-0ubuntu1) 10.0.1 20200416 (experimental) [master revision 3c3f12e2a76:dcee354ce56:44b326839d864fc10c459916abcc97f35a9ac3de]
	Clang Version: 10.0.0-4ubuntu1
	x86_64-native-linuxapp-clang
	x86_64-native-linuxapp-gcc
	x86_64-native-linuxapp-icc


OS: UB2004-32
	Kernel Version: 5.4.0-26-generic
	CPU info: Intel(R) Xeon(R) Platinum 8180 CPU @ 2.50GHz
	GCC Version: gcc (Ubuntu 9.3.0-10ubuntu2) 9.3.0
	Clang Version: 10.0.0-4ubuntu1
	i686-native-linuxapp-gcc


OS: FreeBSD1201-64
	Kernel Version: 12.1-RELEASE
	CPU info: Intel(R) Xeon(R) CPU E5-2699 v3 @ 2.30GHz (2294.74-MHz K8-class CPU)
	GCC Version: gcc (FreeBSD Ports Collection) 9.2.0
	Clang Version: 8.0.1 (tags/RELEASE_801/final 366581) (based on LLVM 8.0.1)
	x86_64-native-bsdapp-gcc
	x86_64-native-bsdapp-clang
	x86_64-native-bsdapp-gcc+shared
	x86_64-native-bsdapp-gcc+debug


OS: SUSE15-64
	Kernel Version: 4.12.14-lp150.11-default
	CPU info: Intel(R) Xeon(R) CPU E5-2699 v4 @ 2.20GHz
	GCC Version: gcc (SUSE Linux) 7.3.1 20180323 [gcc-7-branch revision 258812]
	Clang Version: 5.0.1 (tags/RELEASE_501/final 312548)
	x86_64-native-linuxapp-clang
	x86_64-native-linuxapp-gcc

** Meson build **


OS: CENTOS82-64
	Kernel Version: 4.18.0-193.el8.x86_64
	CPU info: Intel(R) Xeon(R) CPU E5-2699 v4 @ 2.20GHz
	GCC Version: gcc (GCC) 8.3.1 20191121 (Red Hat 8.3.1-5)
	Clang Version: 9.0.1 (Red Hat 9.0.1-2.module_el8.2.0+309+0c7b6b03)
	./build-gcc-static
	./build-gcc-shared
	./build-clang-static
	./build-clang-shared
	./build-x86-default


OS: UB2004-64
	Kernel Version: 5.4.0-26-generic
	CPU info: Intel(R) Xeon(R) Platinum 8180 CPU @ 2.50GHz
	GCC Version: gcc (Ubuntu 9.3.0-10ubuntu2) 9.3.0
	Clang Version: 10.0.0-4ubuntu1
	x86_64-native-linuxapp-doc
	./build-gcc-static
	./build-gcc-shared
	./build-clang-static
	./build-clang-shared
	./build-x86-default


OS: FC32-64
	Kernel Version: 5.6.0-0.rc7.git0.2.fc32.x86_64
	CPU info: Intel(R) Xeon(R) CPU E5-2699 v4 @ 2.20GHz
	GCC Version: gcc (GCC) 10.0.1 20200311 (Red Hat 10.0.1-0.9)
	Clang Version: 10.0.0 (Fedora 10.0.0-0.3.rc4.fc32)
	./build-gcc-static
	./build-gcc-shared
	./build-clang-static
	./build-clang-shared
	./build-x86-default


OS: WIN10-64
	Kernel Version: N/A
	CPU info: N/A
	GCC Version: N/A
	Clang Version: Clang 8.0.0
	x86_64-windows-clang


OS: UB1804-32
	Kernel Version: 4.15.0-20-generic
	CPU info: Intel(R) Xeon(R) CPU E5-2699 v4 @ 2.20GHz
	GCC Version: gcc (Ubuntu 7.5.0-3ubuntu1~18.04) 7.5.0
	Clang Version: 6.0.0-1ubuntu2 (tags/RELEASE_600/final)
	./build-gcc-static
	./build-gcc-shared
	./build-clang-static
	./build-clang-shared
	./build-x86-default


OS: FreeBSD1201-64
	Kernel Version: 12.1-RELEASE
	CPU info: Intel(R) Xeon(R) CPU E5-2699 v4 @ 2.20GHz (2194.97-MHz K8-class CPU)
	GCC Version: gcc (FreeBSD Ports Collection) 9.2.0
	Clang Version: 8.0.1 (tags/RELEASE_801/final 366581) (based on LLVM 8.0.1)
	./build-gcc-static
	./build-gcc-shared
	./build-clang-static
	./build-clang-shared
	./build-x86-default


OS: SUSE15-64
	Kernel Version: 4.12.14-lp150.12.82-default
	CPU info: Intel(R) Xeon(R) CPU E5-2699 v4 @ 2.20GHz
	GCC Version: gcc (SUSE Linux) 7.4.1 20190905 [gcc-7-branch revision 275407]
	Clang Version: 5.0.1 (tags/RELEASE_501/final 312548)
	./build-gcc-static
	./build-gcc-shared
	./build-clang-static
	./build-clang-shared
	./build-x86-default



*Meson Build Failed #1:
OS: FreeBSD1201-64
Target:./build-gcc-static
FAILED: drivers/a715181@@tmp_rte_pmd_bnxt@sta/net_bnxt_tf_core_stack.c.o 
gcc -Idrivers/a715181@@tmp_rte_pmd_bnxt@sta -Idrivers -I../drivers -Idrivers/net/bnxt -I../drivers/net/bnxt -I../drivers/net/bnxt/tf_ulp -I../drivers/net/bnxt/tf_core -Ilib/librte_ethdev -I../lib/librte_ethdev -I. -I.. -Iconfig -I../config -Ilib/librte_eal/include -I../lib/librte_eal/include -Ilib/librte_eal/freebsd/include -I../lib/librte_eal/freebsd/include -Ilib/librte_eal/x86/include -I../lib/librte_eal/x86/include -Ilib/librte_eal/common -I../lib/librte_eal/common -Ilib/librte_eal -I../lib/librte_eal -Ilib/librte_kvargs -I../lib/librte_kvargs -Ilib/librte_metrics -I../lib/librte_metrics -Ilib/librte_telemetry -I../lib/librte_telemetry -Ilib/librte_net -I../lib/librte_net -Ilib/librte_mbuf -I../lib/librte_mbuf -Ilib/librte_mempool -I../lib/librte_mempool -Ilib/librte_ring -I../lib/librte_ring -Ilib/librte_meter -I../lib/librte_meter -Idrivers/bus/pci -I../drivers/bus/pci -I../drivers/bus/pci/bsd -Ilib/librte_pci -I../lib/librte_pci -Idrivers/bus/vdev -I../drivers/bus/vdev -fdiagnostics-color=always -pipe -D_FILE_OFFSET_BITS=64 -Wall -Winvalid-pch -Werror -O2 -g -include rte_config.h -Wextra -Wcast-qual -Wdeprecated -Wformat-nonliteral -Wformat-security -Wmissing-declarations -Wmissing-prototypes -Wnested-externs -Wold-style-definition -Wpointer-arith -Wsign-compare -Wstrict-prototypes -Wundef -Wwrite-strings -Wno-address-of-packed-member -Wno-packed-not-aligned -Wno-missing-field-initializers -D_GNU_SOURCE -D__BSD_VISIBLE -fPIC -march=native -DALLOW_EXPERIMENTAL_API -DALLOW_INTERNAL_API -Wno-format-truncation -MD -MQ 'drivers/a715181@@tmp_rte_pmd_bnxt@sta/net_bnxt_tf_core_stack.c.o' -MF 'drivers/a715181@@tmp_rte_pmd_bnxt@sta/net_bnxt_tf_core_stack.c.o.d' -o 'drivers/a715181@@tmp_rte_pmd_bnxt@sta/net_bnxt_tf_core_stack.c.o' -c ../drivers/net/bnxt/tf_core/stack.c
../drivers/net/bnxt/tf_core/stack.c: In function 'stack_pop':
../drivers/net/bnxt/tf_core/stack.c:84:11: error: 'ENODATA' undeclared (first use in this function)
   84 |   return -ENODATA;
      |           ^~~~~~~
../drivers/net/bnxt/tf_core/stack.c:84:11: note: each undeclared identifier is reported only once for each function it appears in
[701/1765] Compiling C object 'drivers/a715181@@tmp_rte_pmd_bnxt@sta/net_bnxt_bnxt_vnic.c.o'
[702/1765] Compiling C object 'drivers/a715181@@tmp_rte_pmd_bnxt@sta/net_bnxt_bnxt_reps.c.o'
[703/1765] Compiling C object 'drivers/a715181@@tmp_rte_pmd_bnxt@sta/net_bnxt_tf_core_tf_msg.c.o'
FAILED: drivers/a715181@@tmp_rte_pmd_bnxt@sta/net_bnxt_tf_core_tf_msg.c.o 
gcc -Idrivers/a715181@@tmp_rte_pmd_bnxt@sta -Idrivers -I../drivers -Idrivers/net/bnxt -I../drivers/net/bnxt -I../drivers/net/bnxt/tf_ulp -I../drivers/net/bnxt/tf_core -Ilib/librte_ethdev -I../lib/librte_ethdev -I. -I.. -Iconfig -I../config -Ilib/librte_eal/include -I../lib/librte_eal/include -Ilib/librte_eal/freebsd/include -I../lib/librte_eal/freebsd/include -Ilib/librte_eal/x86/include -I../lib/librte_eal/x86/include -Ilib/librte_eal/common -I../lib/librte_eal/common -Ilib/librte_eal -I../lib/librte_eal -Ilib/librte_kvargs -I../lib/librte_kvargs -Ilib/librte_metrics -I../lib/librte_metrics -Ilib/librte_telemetry -I../lib/librte_telemetry -Ilib/librte_net -I../lib/librte_net -Ilib/librte_mbuf -I../lib/librte_mbuf -Ilib/librte_mempool -I../lib/librte_mempool -Ilib/librte_ring -I../lib/librte_ring -Ilib/librte_meter -I../lib/librte_meter -Idrivers/bus/pci -I../drivers/bus/pci -I../drivers/bus/pci/bsd -Ilib/librte_pci -I../lib/librte_pci -Idrivers/bus/vdev -I../drivers/bus/vdev -fdiagnostics-color=always -pipe -D_FILE_OFFSET_BITS=64 -Wall -Winvalid-pch -Werror -O2 -g -include rte_config.h -Wextra -Wcast-qual -Wdeprecated -Wformat-nonliteral -Wformat-security -Wmissing-declarations -Wmissing-prototypes -Wnested-externs -Wold-style-definition -Wpointer-arith -Wsign-compare -Wstrict-prototypes -Wundef -Wwrite-strings -Wno-address-of-packed-member -Wno-packed-not-aligned -Wno-missing-field-initializers -D_GNU_SOURCE -D__BSD_VISIBLE -fPIC -march=native -DALLOW_EXPERIMENTAL_API -DALLOW_INTERNAL_API -Wno-format-truncation -MD -MQ 'drivers/a715181@@tmp_rte_pmd_bnxt@sta/net_bnxt_tf_core_tf_msg.c.o' -MF 'drivers/a715181@@tmp_rte_pmd_bnxt@sta/net_bnxt_tf_core_tf_msg.c.o.d' -o 'drivers/a715181@@tmp_rte_pmd_bnxt@sta/net_bnxt_tf_core_tf_msg.c.o' -c ../drivers/net/bnxt/tf_core/tf_msg.c
In file included from ../drivers/net/bnxt/tf_core/tf_msg.c:19:
../drivers/net/bnxt/tf_core/tf_em.h:45: error: "PAGE_SIZE" redefined [-Werror]
   45 | #define PAGE_SIZE TF_EM_PAGE_SIZE_2M
      | 
In file included from /usr/include/sys/param.h:141,
                 from /usr/include/pthread_np.h:36,
                 from ../lib/librte_eal/freebsd/include/rte_os.h:14,
                 from ../lib/librte_eal/include/rte_common.h:28,
                 from ../drivers/net/bnxt/tf_core/tf_msg.h:9,
                 from ../drivers/net/bnxt/tf_core/tf_msg.c:13:
/usr/include/machine/param.h:101: note: this is the location of the previous definition
  101 | #define PAGE_SIZE (1<<PAGE_SHIFT) /* bytes/page */
      | 
cc1: all warnings being treated as errors
[704/1765] Compiling C object 'drivers/a715181@@tmp_rte_pmd_bnxt@sta/net_bnxt_tf_core_tf_core.c.o'
[705/1765] Compiling C object 'drivers/a715181@@tmp_rte_pmd_bnxt@sta/net_bnxt_tf_core_tf_em_common.c.o'
FAILED: drivers/a715181@@tmp_rte_pmd_bnxt@sta/net_bnxt_tf_core_tf_em_common.c.o 
gcc -Idrivers/a715181@@tmp_rte_pmd_bnxt@sta -Idrivers -I../drivers -Idrivers/net/bnxt -I../drivers/net/bnxt -I../drivers/net/bnxt/tf_ulp -I../drivers/net/bnxt/tf_core -Ilib/librte_ethdev -I../lib/librte_ethdev -I. -I.. -Iconfig -I../config -Ilib/librte_eal/include -I../lib/librte_eal/include -Ilib/librte_eal/freebsd/include -I../lib/librte_eal/freebsd/include -Ilib/librte_eal/x86/include -I../lib/librte_eal/x86/include -Ilib/librte_eal/common -I../lib/librte_eal/common -Ilib/librte_eal -I../lib/librte_eal -Ilib/librte_kvargs -I../lib/librte_kvargs -Ilib/librte_metrics -I../lib/librte_metrics -Ilib/librte_telemetry -I../lib/librte_telemetry -Ilib/librte_net -I../lib/librte_net -Ilib/librte_mbuf -I../lib/librte_mbuf -Ilib/librte_mempool -I../lib/librte_mempool -Ilib/librte_ring -I../lib/librte_ring -Ilib/librte_meter -I../lib/librte_meter -Idrivers/bus/pci -I../drivers/bus/pci -I../drivers/bus/pci/bsd -Ilib/librte_pci -I../lib/librte_pci -Idrivers/bus/vdev -I../drivers/bus/vdev -fdiagnostics-color=always -pipe -D_FILE_OFFSET_BITS=64 -Wall -Winvalid-pch -Werror -O2 -g -include rte_config.h -Wextra -Wcast-qual -Wdeprecated -Wformat-nonliteral -Wformat-security -Wmissing-declarations -Wmissing-prototypes -Wnested-externs -Wold-style-definition -Wpointer-arith -Wsign-compare -Wstrict-prototypes -Wundef -Wwrite-strings -Wno-address-of-packed-member -Wno-packed-not-aligned -Wno-missing-field-initializers -D_GNU_SOURCE -D__BSD_VISIBLE -fPIC -march=native -DALLOW_EXPERIMENTAL_API -DALLOW_INTERNAL_API -Wno-format-truncation -MD -MQ 'drivers/a715181@@tmp_rte_pmd_bnxt@sta/net_bnxt_tf_core_tf_em_common.c.o' -MF 'drivers/a715181@@tmp_rte_pmd_bnxt@sta/net_bnxt_tf_core_tf_em_common.c.o.d' -o 'drivers/a715181@@tmp_rte_pmd_bnxt@sta/net_bnxt_tf_core_tf_em_common.c.o' -c ../drivers/net/bnxt/tf_core/tf_em_common.c
In file included from ../drivers/net/bnxt/tf_core/tf_em_common.c:16:
../drivers/net/bnxt/tf_core/tf_em.h:45: error: "PAGE_SIZE" redefined [-Werror]
   45 | #define PAGE_SIZE TF_EM_PAGE_SIZE_2M
      | 
In file included from /usr/include/sys/param.h:141,
                 from ../drivers/net/bnxt/tf_core/tf_em_common.c:8:
/usr/include/machine/param.h:101: note: this is the location of the previous definition
  101 | #define PAGE_SIZE (1<<PAGE_SHIFT) /* bytes/page */
      | 
cc1: all warnings being treated as errors
[706/1765] Compiling C object 'drivers/a715181@@tmp_rte_pmd_bnxt@sta/net_bnxt_bnxt_hwrm.c.o'
[707/1765] Compiling C object 'drivers/a715181@@tmp_rte_pmd_bnx2x@sta/net_bnx2x_bnx2x.c.o'
[708/1765] Compiling C object 'drivers/a715181@@tmp_rte_pmd_bnx2x@sta/net_bnx2x_elink.c.o'
[709/1765] Compiling C object 'lib/76b5a35@@rte_pipeline@sta/librte_pipeline_rte_table_action.c.o'
ninja: build stopped: subcommand failed



*Makefile Build Failed #1:
OS: FreeBSD1201-64
Target: x86_64-native-bsdapp-gcc
awk -f /usr/src/sys/tools/makeobjops.awk /usr/src/sys/kern/bus_if.m -h
awk -f /usr/src/sys/tools/makeobjops.awk /usr/src/sys/dev/pci/pci_if.m -h
Warning: Object directory not changed from original /root/FreeBSD1201-64_K12.1_GCC9.2.0/x86_64-native-bsdapp-gcc/71ed6ce4b017420787506a2a0d2320b3/dpdk/x86_64-native-bsdapp-gcc/build/kernel/freebsd/contigmem
cc  -Winline -Wall -Werror -include /root/FreeBSD1201-64_K12.1_GCC9.2.0/x86_64-native-bsdapp-gcc/71ed6ce4b017420787506a2a0d2320b3/dpdk/x86_64-native-bsdapp-gcc/include/rte_config.h  -Werror -D_KERNEL -DKLD_MODULE -nostdinc  -I/root/FreeBSD1201-64_K12.1_GCC9.2.0/x86_64-native-bsdapp-gcc/71ed6ce4b017420787506a2a0d2320b3/dpdk/kernel/freebsd/contigmem -I/root/FreeBSD1201-64_K12.1_GCC9.2.0/x86_64-native-bsdapp-gcc/71ed6ce4b017420787506a2a0d2320b3/dpdk/x86_64-native-bsdapp-gcc/include -I. -I/usr/src/sys -I/usr/src/sys/contrib/ck/include -fno-common  -fno-omit-frame-pointer -mno-omit-leaf-frame-pointer -fdebug-prefix-map=./machine=/usr/src/sys/amd64/include -fdebug-prefix-map=./x86=/usr/src/sys/x86/include   -MD  -MF.depend.contigmem.o -MTcontigmem.o -mcmodel=kernel -mno-red-zone -mno-mmx -mno-sse -msoft-float  -fno-asynchronous-unwind-tables -ffreestanding -fwrapv -fstack-protector -Wall -Wredundant-decls -Wnested-externs -Wstrict-prototypes -Wmissing-prototypes -Wpointer-arith -Wcast-qual -Wundef -Wno-pointer-sign -D__printf__=__freebsd_kprintf__ -Wmissing-include-dirs -fdiagnostics-show-option -Wno-unknown-pragmas -Wno-error-tautological-compare -Wno-error-empty-body -Wno-error-parentheses-equality -Wno-error-unused-function -Wno-error-pointer-sign -Wno-error-shift-negative-value -Wno-address-of-packed-member  -mno-aes -mno-avx  -std=iso9899:1999 -c contigmem.c -o contigmem.o
Warning: Object directory not changed from original /root/FreeBSD1201-64_K12.1_GCC9.2.0/x86_64-native-bsdapp-gcc/71ed6ce4b017420787506a2a0d2320b3/dpdk/x86_64-native-bsdapp-gcc/build/kernel/freebsd/nic_uio
cc  -Winline -Wall -Werror -include /root/FreeBSD1201-64_K12.1_GCC9.2.0/x86_64-native-bsdapp-gcc/71ed6ce4b017420787506a2a0d2320b3/dpdk/x86_64-native-bsdapp-gcc/include/rte_config.h  -Werror -D_KERNEL -DKLD_MODULE -nostdinc  -I/root/FreeBSD1201-64_K12.1_GCC9.2.0/x86_64-native-bsdapp-gcc/71ed6ce4b017420787506a2a0d2320b3/dpdk/kernel/freebsd/nic_uio -I/root/FreeBSD1201-64_K12.1_GCC9.2.0/x86_64-native-bsdapp-gcc/71ed6ce4b017420787506a2a0d2320b3/dpdk/x86_64-native-bsdapp-gcc/include -I. -I/usr/src/sys -I/usr/src/sys/contrib/ck/include -fno-common  -fno-omit-frame-pointer -mno-omit-leaf-frame-pointer -fdebug-prefix-map=./machine=/usr/src/sys/amd64/include -fdebug-prefix-map=./x86=/usr/src/sys/x86/include   -MD  -MF.depend.nic_uio.o -MTnic_uio.o -mcmodel=kernel -mno-red-zone -mno-mmx -mno-sse -msoft-float  -fno-asynchronous-unwind-tables -ffreestanding -fwrapv -fstack-protector -Wall -Wredundant-decls -Wnested-externs -Wstrict-prototypes -Wmissing-prototypes -Wpointer-arith -Wcast-qual -Wundef -Wno-pointer-sign -D__printf__=__freebsd_kprintf__ -Wmissing-include-dirs -fdiagnostics-show-option -Wno-unknown-pragmas -Wno-error-tautological-compare -Wno-error-empty-body -Wno-error-parentheses-equality -Wno-error-unused-function -Wno-error-pointer-sign -Wno-error-shift-negative-value -Wno-address-of-packed-member  -mno-aes -mno-avx  -std=iso9899:1999 -c nic_uio.c -o nic_uio.o
ld -m elf_x86_64_fbsd -L/root/FreeBSD1201-64_K12.1_GCC9.2.0/x86_64-native-bsdapp-gcc/71ed6ce4b017420787506a2a0d2320b3/dpdk/x86_64-native-bsdapp-gcc/lib -d -warn-common --build-id=sha1 -r -d -o contigmem.ko contigmem.o
ld -m elf_x86_64_fbsd -L/root/FreeBSD1201-64_K12.1_GCC9.2.0/x86_64-native-bsdapp-gcc/71ed6ce4b017420787506a2a0d2320b3/dpdk/x86_64-native-bsdapp-gcc/lib -d -warn-common --build-id=sha1 -r -d -o nic_uio.ko nic_uio.o
:> export_syms
--
  CC tf_core/stack.o
  CC tf_core/ll.o
/root/FreeBSD1201-64_K12.1_GCC9.2.0/x86_64-native-bsdapp-gcc/71ed6ce4b017420787506a2a0d2320b3/dpdk/drivers/net/bnxt/tf_core/stack.c: In function 'stack_pop':
/root/FreeBSD1201-64_K12.1_GCC9.2.0/x86_64-native-bsdapp-gcc/71ed6ce4b017420787506a2a0d2320b3/dpdk/drivers/net/bnxt/tf_core/stack.c:84:11: error: 'ENODATA' undeclared (first use in this function)
   84 |   return -ENODATA;
      |           ^~~~~~~
/root/FreeBSD1201-64_K12.1_GCC9.2.0/x86_64-native-bsdapp-gcc/71ed6ce4b017420787506a2a0d2320b3/dpdk/drivers/net/bnxt/tf_core/stack.c:84:11: note: each undeclared identifier is reported only once for each function it appears in
gmake[6]: *** [/root/FreeBSD1201-64_K12.1_GCC9.2.0/x86_64-native-bsdapp-gcc/71ed6ce4b017420787506a2a0d2320b3/dpdk/mk/internal/rte.compile-pre.mk:116: tf_core/stack.o] Error 1
gmake[6]: *** Waiting for unfinished jobs....
  CC efx_evb.o
  CC efx_filter.o
--
  CC efx_intr.o
  CC efx_lic.o
  CC efx_mac.o
gmake[5]: *** [/root/FreeBSD1201-64_K12.1_GCC9.2.0/x86_64-native-bsdapp-gcc/71ed6ce4b017420787506a2a0d2320b3/dpdk/mk/rte.subdir.mk:35: bnxt] Error 2
gmake[5]: *** Waiting for unfinished jobs....
  CC efx_mcdi.o
  CC efx_mon.o
--
  CC medford2_nic.o
  AR librte_pmd_sfc_efx.a
  INSTALL-LIB librte_pmd_sfc_efx.a
gmake[4]: *** [/root/FreeBSD1201-64_K12.1_GCC9.2.0/x86_64-native-bsdapp-gcc/71ed6ce4b017420787506a2a0d2320b3/dpdk/mk/rte.subdir.mk:35: net] Error 2
gmake[3]: *** [/root/FreeBSD1201-64_K12.1_GCC9.2.0/x86_64-native-bsdapp-gcc/71ed6ce4b017420787506a2a0d2320b3/dpdk/mk/rte.sdkbuild.mk:51: drivers] Error 2
gmake[2]: *** [/root/FreeBSD1201-64_K12.1_GCC9.2.0/x86_64-native-bsdapp-gcc/71ed6ce4b017420787506a2a0d2320b3/dpdk/mk/rte.sdkroot.mk:115: all] Error 2
gmake[1]: *** [/root/FreeBSD1201-64_K12.1_GCC9.2.0/x86_64-native-bsdapp-gcc/71ed6ce4b017420787506a2a0d2320b3/dpdk/mk/rte.sdkinstall.mk:61: pre_install] Error 2
gmake: *** [/root/FreeBSD1201-64_K12.1_GCC9.2.0/x86_64-native-bsdapp-gcc/71ed6ce4b017420787506a2a0d2320b3/dpdk/mk/rte.sdkroot.mk:92: install] Error 2


*Makefile Build Failed #2:
OS: FreeBSD1201-64
Target: x86_64-native-bsdapp-clang
awk -f /usr/src/sys/tools/makeobjops.awk /usr/src/sys/kern/bus_if.m -h
awk -f /usr/src/sys/tools/makeobjops.awk /usr/src/sys/dev/pci/pci_if.m -h
Warning: Object directory not changed from original /root/FreeBSD1201-64_K12.1_Clang8.0.1/x86_64-native-bsdapp-clang/71ed6ce4b017420787506a2a0d2320b3/dpdk/x86_64-native-bsdapp-clang/build/kernel/freebsd/contigmem
cc  -Winline -Wall -Werror -include /root/FreeBSD1201-64_K12.1_Clang8.0.1/x86_64-native-bsdapp-clang/71ed6ce4b017420787506a2a0d2320b3/dpdk/x86_64-native-bsdapp-clang/include/rte_config.h  -Werror -D_KERNEL -DKLD_MODULE -nostdinc  -I/root/FreeBSD1201-64_K12.1_Clang8.0.1/x86_64-native-bsdapp-clang/71ed6ce4b017420787506a2a0d2320b3/dpdk/kernel/freebsd/contigmem -I/root/FreeBSD1201-64_K12.1_Clang8.0.1/x86_64-native-bsdapp-clang/71ed6ce4b017420787506a2a0d2320b3/dpdk/x86_64-native-bsdapp-clang/include -I. -I/usr/src/sys -I/usr/src/sys/contrib/ck/include -fno-common  -fno-omit-frame-pointer -mno-omit-leaf-frame-pointer -fdebug-prefix-map=./machine=/usr/src/sys/amd64/include -fdebug-prefix-map=./x86=/usr/src/sys/x86/include   -MD  -MF.depend.contigmem.o -MTcontigmem.o -mcmodel=kernel -mno-red-zone -mno-mmx -mno-sse -msoft-float  -fno-asynchronous-unwind-tables -ffreestanding -fwrapv -fstack-protector -Wall -Wredundant-decls -Wnested-externs -Wstrict-prototypes -Wmissing-prototypes -Wpointer-arith -Wcast-qual -Wundef -Wno-pointer-sign -D__printf__=__freebsd_kprintf__ -Wmissing-include-dirs -fdiagnostics-show-option -Wno-unknown-pragmas -Wno-error-tautological-compare -Wno-error-empty-body -Wno-error-parentheses-equality -Wno-error-unused-function -Wno-error-pointer-sign -Wno-error-shift-negative-value -Wno-address-of-packed-member  -mno-aes -mno-avx  -std=iso9899:1999 -c contigmem.c -o contigmem.o
Warning: Object directory not changed from original /root/FreeBSD1201-64_K12.1_Clang8.0.1/x86_64-native-bsdapp-clang/71ed6ce4b017420787506a2a0d2320b3/dpdk/x86_64-native-bsdapp-clang/build/kernel/freebsd/nic_uio
cc  -Winline -Wall -Werror -include /root/FreeBSD1201-64_K12.1_Clang8.0.1/x86_64-native-bsdapp-clang/71ed6ce4b017420787506a2a0d2320b3/dpdk/x86_64-native-bsdapp-clang/include/rte_config.h  -Werror -D_KERNEL -DKLD_MODULE -nostdinc  -I/root/FreeBSD1201-64_K12.1_Clang8.0.1/x86_64-native-bsdapp-clang/71ed6ce4b017420787506a2a0d2320b3/dpdk/kernel/freebsd/nic_uio -I/root/FreeBSD1201-64_K12.1_Clang8.0.1/x86_64-native-bsdapp-clang/71ed6ce4b017420787506a2a0d2320b3/dpdk/x86_64-native-bsdapp-clang/include -I. -I/usr/src/sys -I/usr/src/sys/contrib/ck/include -fno-common  -fno-omit-frame-pointer -mno-omit-leaf-frame-pointer -fdebug-prefix-map=./machine=/usr/src/sys/amd64/include -fdebug-prefix-map=./x86=/usr/src/sys/x86/include   -MD  -MF.depend.nic_uio.o -MTnic_uio.o -mcmodel=kernel -mno-red-zone -mno-mmx -mno-sse -msoft-float  -fno-asynchronous-unwind-tables -ffreestanding -fwrapv -fstack-protector -Wall -Wredundant-decls -Wnested-externs -Wstrict-prototypes -Wmissing-prototypes -Wpointer-arith -Wcast-qual -Wundef -Wno-pointer-sign -D__printf__=__freebsd_kprintf__ -Wmissing-include-dirs -fdiagnostics-show-option -Wno-unknown-pragmas -Wno-error-tautological-compare -Wno-error-empty-body -Wno-error-parentheses-equality -Wno-error-unused-function -Wno-error-pointer-sign -Wno-error-shift-negative-value -Wno-address-of-packed-member  -mno-aes -mno-avx  -std=iso9899:1999 -c nic_uio.c -o nic_uio.o
== Build drivers/common
== Build drivers/common/octeontx
== Build drivers/common/cpt
--
  CC efx_nvram.o
/root/FreeBSD1201-64_K12.1_Clang8.0.1/x86_64-native-bsdapp-clang/71ed6ce4b017420787506a2a0d2320b3/dpdk/drivers/net/bnxt/tf_core/stack.c:84:11  CC tf_core/tf_core.o
  CC tf_core/tf_rm.o
: error: use of undeclared identifier 'ENODATA'
                return -ENODATA;  CC tf_core/tfp.o

                        ^
1 error generated.
gmake[6]: *** [/root/FreeBSD1201-64_K12.1_Clang8.0.1/x86_64-native-bsdapp-clang/71ed6ce4b017420787506a2a0d2320b3/dpdk/mk/internal/rte.compile-pre.mk:116: tf_core/stack.o] Error 1
gmake[6]: *** Waiting for unfinished jobs....
  CC efx_phy.o
  CC efx_port.o
--
  CC efx_vpd.o
  CC efx_tx.o
  CC mcdi_mon.o
gmake[5]: *** [/root/FreeBSD1201-64_K12.1_Clang8.0.1/x86_64-native-bsdapp-clang/71ed6ce4b017420787506a2a0d2320b3/dpdk/mk/rte.subdir.mk:35: bnxt] Error 2
gmake[5]: *** Waiting for unfinished jobs....
  CC siena_mac.o
  CC siena_mcdi.o
--
  CC medford2_nic.o
  AR librte_pmd_sfc_efx.a
  INSTALL-LIB librte_pmd_sfc_efx.a
gmake[4]: *** [/root/FreeBSD1201-64_K12.1_Clang8.0.1/x86_64-native-bsdapp-clang/71ed6ce4b017420787506a2a0d2320b3/dpdk/mk/rte.subdir.mk:35: net] Error 2
gmake[3]: *** [/root/FreeBSD1201-64_K12.1_Clang8.0.1/x86_64-native-bsdapp-clang/71ed6ce4b017420787506a2a0d2320b3/dpdk/mk/rte.sdkbuild.mk:51: drivers] Error 2
gmake[2]: *** [/root/FreeBSD1201-64_K12.1_Clang8.0.1/x86_64-native-bsdapp-clang/71ed6ce4b017420787506a2a0d2320b3/dpdk/mk/rte.sdkroot.mk:115: all] Error 2
gmake[1]: *** [/root/FreeBSD1201-64_K12.1_Clang8.0.1/x86_64-native-bsdapp-clang/71ed6ce4b017420787506a2a0d2320b3/dpdk/mk/rte.sdkinstall.mk:61: pre_install] Error 2
gmake: *** [/root/FreeBSD1201-64_K12.1_Clang8.0.1/x86_64-native-bsdapp-clang/71ed6ce4b017420787506a2a0d2320b3/dpdk/mk/rte.sdkroot.mk:92: install] Error 2


*Makefile Build Failed #3:
OS: FreeBSD1201-64
Target: x86_64-native-bsdapp-gcc+shared
awk -f /usr/src/sys/tools/makeobjops.awk /usr/src/sys/kern/bus_if.m -h
awk -f /usr/src/sys/tools/makeobjops.awk /usr/src/sys/dev/pci/pci_if.m -h
Warning: Object directory not changed from original /root/FreeBSD1201-64_K12.1_GCC7.3.0/x86_64-native-bsdapp-gcc+shared/71ed6ce4b017420787506a2a0d2320b3/dpdk/x86_64-native-bsdapp-gcc/build/kernel/freebsd/contigmem
cc  -Winline -Wall -Werror -include /root/FreeBSD1201-64_K12.1_GCC7.3.0/x86_64-native-bsdapp-gcc+shared/71ed6ce4b017420787506a2a0d2320b3/dpdk/x86_64-native-bsdapp-gcc/include/rte_config.h  -Werror -D_KERNEL -DKLD_MODULE -nostdinc  -I/root/FreeBSD1201-64_K12.1_GCC7.3.0/x86_64-native-bsdapp-gcc+shared/71ed6ce4b017420787506a2a0d2320b3/dpdk/kernel/freebsd/contigmem -I/root/FreeBSD1201-64_K12.1_GCC7.3.0/x86_64-native-bsdapp-gcc+shared/71ed6ce4b017420787506a2a0d2320b3/dpdk/x86_64-native-bsdapp-gcc/include -I. -I/usr/src/sys -I/usr/src/sys/contrib/ck/include -fno-common  -fno-omit-frame-pointer -mno-omit-leaf-frame-pointer -fdebug-prefix-map=./machine=/usr/src/sys/amd64/include -fdebug-prefix-map=./x86=/usr/src/sys/x86/include   -MD  -MF.depend.contigmem.o -MTcontigmem.o -mcmodel=kernel -mno-red-zone -mno-mmx -mno-sse -msoft-float  -fno-asynchronous-unwind-tables -ffreestanding -fwrapv -fstack-protector -Wall -Wredundant-decls -Wnested-externs -Wstrict-prototypes -Wmissing-prototypes -Wpointer-arith -Wcast-qual -Wundef -Wno-pointer-sign -D__printf__=__freebsd_kprintf__ -Wmissing-include-dirs -fdiagnostics-show-option -Wno-unknown-pragmas -Wno-error-tautological-compare -Wno-error-empty-body -Wno-error-parentheses-equality -Wno-error-unused-function -Wno-error-pointer-sign -Wno-error-shift-negative-value -Wno-address-of-packed-member  -mno-aes -mno-avx  -std=iso9899:1999 -c contigmem.c -o contigmem.o
Warning: Object directory not changed from original /root/FreeBSD1201-64_K12.1_GCC7.3.0/x86_64-native-bsdapp-gcc+shared/71ed6ce4b017420787506a2a0d2320b3/dpdk/x86_64-native-bsdapp-gcc/build/kernel/freebsd/nic_uio
cc  -Winline -Wall -Werror -include /root/FreeBSD1201-64_K12.1_GCC7.3.0/x86_64-native-bsdapp-gcc+shared/71ed6ce4b017420787506a2a0d2320b3/dpdk/x86_64-native-bsdapp-gcc/include/rte_config.h  -Werror -D_KERNEL -DKLD_MODULE -nostdinc  -I/root/FreeBSD1201-64_K12.1_GCC7.3.0/x86_64-native-bsdapp-gcc+shared/71ed6ce4b017420787506a2a0d2320b3/dpdk/kernel/freebsd/nic_uio -I/root/FreeBSD1201-64_K12.1_GCC7.3.0/x86_64-native-bsdapp-gcc+shared/71ed6ce4b017420787506a2a0d2320b3/dpdk/x86_64-native-bsdapp-gcc/include -I. -I/usr/src/sys -I/usr/src/sys/contrib/ck/include -fno-common  -fno-omit-frame-pointer -mno-omit-leaf-frame-pointer -fdebug-prefix-map=./machine=/usr/src/sys/amd64/include -fdebug-prefix-map=./x86=/usr/src/sys/x86/include   -MD  -MF.depend.nic_uio.o -MTnic_uio.o -mcmodel=kernel -mno-red-zone -mno-mmx -mno-sse -msoft-float  -fno-asynchronous-unwind-tables -ffreestanding -fwrapv -fstack-protector -Wall -Wredundant-decls -Wnested-externs -Wstrict-prototypes -Wmissing-prototypes -Wpointer-arith -Wcast-qual -Wundef -Wno-pointer-sign -D__printf__=__freebsd_kprintf__ -Wmissing-include-dirs -fdiagnostics-show-option -Wno-unknown-pragmas -Wno-error-tautological-compare -Wno-error-empty-body -Wno-error-parentheses-equality -Wno-error-unused-function -Wno-error-pointer-sign -Wno-error-shift-negative-value -Wno-address-of-packed-member  -mno-aes -mno-avx  -std=iso9899:1999 -c nic_uio.c -o nic_uio.o
== Build drivers/common
ld -m elf_x86_64_fbsd -L/root/FreeBSD1201-64_K12.1_GCC7.3.0/x86_64-native-bsdapp-gcc+shared/71ed6ce4b017420787506a2a0d2320b3/dpdk/x86_64-native-bsdapp-gcc/lib -d -warn-common --build-id=sha1 -r -d -o contigmem.ko contigmem.o
:> export_syms
--
  CC otx2_ethdev.o.pmd.o
  CC tf_core/stack.o
/root/FreeBSD1201-64_K12.1_GCC7.3.0/x86_64-native-bsdapp-gcc+shared/71ed6ce4b017420787506a2a0d2320b3/dpdk/drivers/net/bnxt/tf_core/stack.c: In function 'stack_pop':
/root/FreeBSD1201-64_K12.1_GCC7.3.0/x86_64-native-bsdapp-gcc+shared/71ed6ce4b017420787506a2a0d2320b3/dpdk/drivers/net/bnxt/tf_core/stack.c:84:11: error: 'ENODATA' undeclared (first use in this function)
   84 |   return -ENODATA;
      |           ^~~~~~~
/root/FreeBSD1201-64_K12.1_GCC7.3.0/x86_64-native-bsdapp-gcc+shared/71ed6ce4b017420787506a2a0d2320b3/dpdk/drivers/net/bnxt/tf_core/stack.c:84:11: note: each undeclared identifier is reported only once for each function it appears in
gmake[6]: *** [/root/FreeBSD1201-64_K12.1_GCC7.3.0/x86_64-native-bsdapp-gcc+shared/71ed6ce4b017420787506a2a0d2320b3/dpdk/mk/internal/rte.compile-pre.mk:116: tf_core/stack.o] Error 1
gmake[6]: *** Waiting for unfinished jobs....
  LD otx2_ethdev.o
  CC otx2_ethdev_irq.o
--
  CC efx_intr.o
  CC efx_lic.o
  CC efx_mac.o
gmake[5]: *** [/root/FreeBSD1201-64_K12.1_GCC7.3.0/x86_64-native-bsdapp-gcc+shared/71ed6ce4b017420787506a2a0d2320b3/dpdk/mk/rte.subdir.mk:35: bnxt] Error 2
gmake[5]: *** Waiting for unfinished jobs....
  CC otx2_ethdev_sec.o
  CC efx_mcdi.o
--
  CC medford2_nic.o
  LD librte_pmd_sfc_efx.so.20.0.3
  INSTALL-LIB librte_pmd_sfc_efx.so.20.0.3
gmake[4]: *** [/root/FreeBSD1201-64_K12.1_GCC7.3.0/x86_64-native-bsdapp-gcc+shared/71ed6ce4b017420787506a2a0d2320b3/dpdk/mk/rte.subdir.mk:35: net] Error 2
gmake[3]: *** [/root/FreeBSD1201-64_K12.1_GCC7.3.0/x86_64-native-bsdapp-gcc+shared/71ed6ce4b017420787506a2a0d2320b3/dpdk/mk/rte.sdkbuild.mk:51: drivers] Error 2
gmake[2]: *** [/root/FreeBSD1201-64_K12.1_GCC7.3.0/x86_64-native-bsdapp-gcc+shared/71ed6ce4b017420787506a2a0d2320b3/dpdk/mk/rte.sdkroot.mk:115: all] Error 2
gmake[1]: *** [/root/FreeBSD1201-64_K12.1_GCC7.3.0/x86_64-native-bsdapp-gcc+shared/71ed6ce4b017420787506a2a0d2320b3/dpdk/mk/rte.sdkinstall.mk:61: pre_install] Error 2
gmake: *** [/root/FreeBSD1201-64_K12.1_GCC7.3.0/x86_64-native-bsdapp-gcc+shared/71ed6ce4b017420787506a2a0d2320b3/dpdk/mk/rte.sdkroot.mk:92: install] Error 2


*Makefile Build Failed #4:
OS: FreeBSD1201-64
Target: x86_64-native-bsdapp-gcc+debug
awk -f /usr/src/sys/tools/makeobjops.awk /usr/src/sys/kern/bus_if.m -h
awk -f /usr/src/sys/tools/makeobjops.awk /usr/src/sys/dev/pci/pci_if.m -h
Warning: Object directory not changed from original /root/FreeBSD1201-64_K12.1_GCC7.3.0/x86_64-native-bsdapp-gcc+debug/71ed6ce4b017420787506a2a0d2320b3/dpdk/x86_64-native-bsdapp-gcc/build/kernel/freebsd/contigmem
cc  -Winline -Wall -Werror -include /root/FreeBSD1201-64_K12.1_GCC7.3.0/x86_64-native-bsdapp-gcc+debug/71ed6ce4b017420787506a2a0d2320b3/dpdk/x86_64-native-bsdapp-gcc/include/rte_config.h  -Werror -D_KERNEL -DKLD_MODULE -nostdinc  -I/root/FreeBSD1201-64_K12.1_GCC7.3.0/x86_64-native-bsdapp-gcc+debug/71ed6ce4b017420787506a2a0d2320b3/dpdk/kernel/freebsd/contigmem -I/root/FreeBSD1201-64_K12.1_GCC7.3.0/x86_64-native-bsdapp-gcc+debug/71ed6ce4b017420787506a2a0d2320b3/dpdk/x86_64-native-bsdapp-gcc/include -I. -I/usr/src/sys -I/usr/src/sys/contrib/ck/include -fno-common  -fno-omit-frame-pointer -mno-omit-leaf-frame-pointer -fdebug-prefix-map=./machine=/usr/src/sys/amd64/include -fdebug-prefix-map=./x86=/usr/src/sys/x86/include   -MD  -MF.depend.contigmem.o -MTcontigmem.o -mcmodel=kernel -mno-red-zone -mno-mmx -mno-sse -msoft-float  -fno-asynchronous-unwind-tables -ffreestanding -fwrapv -fstack-protector -Wall -Wredundant-decls -Wnested-externs -Wstrict-prototypes -Wmissing-prototypes -Wpointer-arith -Wcast-qual -Wundef -Wno-pointer-sign -D__printf__=__freebsd_kprintf__ -Wmissing-include-dirs -fdiagnostics-show-option -Wno-unknown-pragmas -Wno-error-tautological-compare -Wno-error-empty-body -Wno-error-parentheses-equality -Wno-error-unused-function -Wno-error-pointer-sign -Wno-error-shift-negative-value -Wno-address-of-packed-member  -mno-aes -mno-avx  -std=iso9899:1999 -c contigmem.c -o contigmem.o
Warning: Object directory not changed from original /root/FreeBSD1201-64_K12.1_GCC7.3.0/x86_64-native-bsdapp-gcc+debug/71ed6ce4b017420787506a2a0d2320b3/dpdk/x86_64-native-bsdapp-gcc/build/kernel/freebsd/nic_uio
cc  -Winline -Wall -Werror -include /root/FreeBSD1201-64_K12.1_GCC7.3.0/x86_64-native-bsdapp-gcc+debug/71ed6ce4b017420787506a2a0d2320b3/dpdk/x86_64-native-bsdapp-gcc/include/rte_config.h  -Werror -D_KERNEL -DKLD_MODULE -nostdinc  -I/root/FreeBSD1201-64_K12.1_GCC7.3.0/x86_64-native-bsdapp-gcc+debug/71ed6ce4b017420787506a2a0d2320b3/dpdk/kernel/freebsd/nic_uio -I/root/FreeBSD1201-64_K12.1_GCC7.3.0/x86_64-native-bsdapp-gcc+debug/71ed6ce4b017420787506a2a0d2320b3/dpdk/x86_64-native-bsdapp-gcc/include -I. -I/usr/src/sys -I/usr/src/sys/contrib/ck/include -fno-common  -fno-omit-frame-pointer -mno-omit-leaf-frame-pointer -fdebug-prefix-map=./machine=/usr/src/sys/amd64/include -fdebug-prefix-map=./x86=/usr/src/sys/x86/include   -MD  -MF.depend.nic_uio.o -MTnic_uio.o -mcmodel=kernel -mno-red-zone -mno-mmx -mno-sse -msoft-float  -fno-asynchronous-unwind-tables -ffreestanding -fwrapv -fstack-protector -Wall -Wredundant-decls -Wnested-externs -Wstrict-prototypes -Wmissing-prototypes -Wpointer-arith -Wcast-qual -Wundef -Wno-pointer-sign -D__printf__=__freebsd_kprintf__ -Wmissing-include-dirs -fdiagnostics-show-option -Wno-unknown-pragmas -Wno-error-tautological-compare -Wno-error-empty-body -Wno-error-parentheses-equality -Wno-error-unused-function -Wno-error-pointer-sign -Wno-error-shift-negative-value -Wno-address-of-packed-member  -mno-aes -mno-avx  -std=iso9899:1999 -c nic_uio.c -o nic_uio.o
== Build drivers/common
ld -m elf_x86_64_fbsd -L/root/FreeBSD1201-64_K12.1_GCC7.3.0/x86_64-native-bsdapp-gcc+debug/71ed6ce4b017420787506a2a0d2320b3/dpdk/x86_64-native-bsdapp-gcc/lib -d -warn-common --build-id=sha1 -r -d -o contigmem.ko contigmem.o
ld -m elf_x86_64_fbsd -L/root/FreeBSD1201-64_K12.1_GCC7.3.0/x86_64-native-bsdapp-gcc+debug/71ed6ce4b017420787506a2a0d2320b3/dpdk/x86_64-native-bsdapp-gcc/lib -d -warn-common --build-id=sha1 -r -d -o nic_uio.ko nic_uio.o
--
  CC tf_core/stack.o
  CC tf_core/ll.o
/root/FreeBSD1201-64_K12.1_GCC7.3.0/x86_64-native-bsdapp-gcc+debug/71ed6ce4b017420787506a2a0d2320b3/dpdk/drivers/net/bnxt/tf_core/stack.c: In function 'stack_pop':
/root/FreeBSD1201-64_K12.1_GCC7.3.0/x86_64-native-bsdapp-gcc+debug/71ed6ce4b017420787506a2a0d2320b3/dpdk/drivers/net/bnxt/tf_core/stack.c:84:11: error: 'ENODATA' undeclared (first use in this function)
   84 |   return -ENODATA;
      |           ^~~~~~~
/root/FreeBSD1201-64_K12.1_GCC7.3.0/x86_64-native-bsdapp-gcc+debug/71ed6ce4b017420787506a2a0d2320b3/dpdk/drivers/net/bnxt/tf_core/stack.c:84:11: note: each undeclared identifier is reported only once for each function it appears in
  CC tf_core/rand.o
gmake[6]: *** [/root/FreeBSD1201-64_K12.1_GCC7.3.0/x86_64-native-bsdapp-gcc+debug/71ed6ce4b017420787506a2a0d2320b3/dpdk/mk/internal/rte.compile-pre.mk:114: tf_core/stack.o] Error 1
gmake[6]: *** Waiting for unfinished jobs....
  CC efx_hash.o
  CC efx_filter.o
--
  CC efx_lic.o
  CC efx_mcdi.o
  CC efx_mon.o
gmake[5]: *** [/root/FreeBSD1201-64_K12.1_GCC7.3.0/x86_64-native-bsdapp-gcc+debug/71ed6ce4b017420787506a2a0d2320b3/dpdk/mk/rte.subdir.mk:35: bnxt] Error 2
gmake[5]: *** Waiting for unfinished jobs....
  CC efx_nic.o
  CC efx_nvram.o
--
  CC medford2_nic.o
  AR librte_pmd_sfc_efx.a
  INSTALL-LIB librte_pmd_sfc_efx.a
gmake[4]: *** [/root/FreeBSD1201-64_K12.1_GCC7.3.0/x86_64-native-bsdapp-gcc+debug/71ed6ce4b017420787506a2a0d2320b3/dpdk/mk/rte.subdir.mk:35: net] Error 2
gmake[3]: *** [/root/FreeBSD1201-64_K12.1_GCC7.3.0/x86_64-native-bsdapp-gcc+debug/71ed6ce4b017420787506a2a0d2320b3/dpdk/mk/rte.sdkbuild.mk:51: drivers] Error 2
gmake[2]: *** [/root/FreeBSD1201-64_K12.1_GCC7.3.0/x86_64-native-bsdapp-gcc+debug/71ed6ce4b017420787506a2a0d2320b3/dpdk/mk/rte.sdkroot.mk:115: all] Error 2
gmake[1]: *** [/root/FreeBSD1201-64_K12.1_GCC7.3.0/x86_64-native-bsdapp-gcc+debug/71ed6ce4b017420787506a2a0d2320b3/dpdk/mk/rte.sdkinstall.mk:61: pre_install] Error 2
gmake: *** [/root/FreeBSD1201-64_K12.1_GCC7.3.0/x86_64-native-bsdapp-gcc+debug/71ed6ce4b017420787506a2a0d2320b3/dpdk/mk/rte.sdkroot.mk:92: install] Error 2
DPDK STV team

^ permalink raw reply	[flat|nested] 3+ messages in thread

end of thread, other threads:[~2020-07-02  4:13 UTC | newest]

Thread overview: 3+ messages (download: mbox.gz / follow: Atom feed)
-- links below jump to the message on this page --
2020-07-01 11:10 [dpdk-test-report] |FAILURE| pw(72522) [v3, 12/13] drivers/baseband: use log register macro sys_stv
2020-07-02  4:01 sys_stv
2020-07-02  4:12 sys_stv

automatic DPDK test reports

This inbox may be cloned and mirrored by anyone:

	git clone --mirror https://inbox.dpdk.org/test-report/0 test-report/git/0.git

	# If you have public-inbox 1.1+ installed, you may
	# initialize and index your mirror using the following commands:
	public-inbox-init -V2 test-report test-report/ https://inbox.dpdk.org/test-report \
		test-report@dpdk.org
	public-inbox-index test-report

Example config snippet for mirrors.
Newsgroup available over NNTP:
	nntp://inbox.dpdk.org/inbox.dpdk.test-report


AGPL code for this site: git clone https://public-inbox.org/public-inbox.git