automatic DPDK test reports
 help / color / mirror / Atom feed
* [dpdk-test-report]  |FAILURE| pw(72641) [v3, 04/27] librte_power: change reference to rte_master_lcore
@ 2020-07-02  0:51 sys_stv
  0 siblings, 0 replies; only message in thread
From: sys_stv @ 2020-07-02  0:51 UTC (permalink / raw)
  To: test-report

[-- Attachment #1: Type: text/plain, Size: 48296 bytes --]


Test-Label: Intel-compilation
Test-Status: FAILURE
http://dpdk.org/patch/72641

_Compilation issues_

Submitter: Stephen Hemminger <stephen@networkplumber.org>
Date: 2020-07-01 19:46:27
Reply_mail: 20200701194650.10705-5-stephen@networkplumber.org

DPDK git baseline: Repo:dpdk, CommitID: b98447077b0609750c10b84b7b2e7be0c8504fad


Meson build Summary: 8 Builds Done, 2 Successful, 6 Failures, 0 Blocked

Makefile build Summary: 20 Builds Done, 13 Successful, 7 Failures, 0 Blocked

                +==============================================+===========+==========+
                |                   Makefile                   |   Meson   | Document |
+----------------+------+-------+------+------------+-----------+-----------+----------+
| os             | gcc  | clang | icc  | gcc+shared | gcc+debug | gcc/clang | pdf/html |
+----------------+------+-------+------+------------+-----------+-----------+----------+
| CENTOS82-64    | pass | pass  | pass | FAIL       | pass      | FAIL      |          |
| RHEL82-64      | pass |       |      |            |           |           |          |
| UB1804-64      | pass |       |      |            |           |           |          |
| FC32-64        | pass | pass  |      |            |           | FAIL      |          |
| CENTOS77-64    | pass |       |      |            |           |           |          |
| UB2004-64      | pass | pass  | FAIL |            |           | FAIL      | pass     |
| WIN10-64       |      |       |      |            |           | pass      |          |
| UB2004-32      | FAIL |       |      |            |           |           |          |
| UB1804-32      |      |       |      |            |           | FAIL      |          |
| FreeBSD1201-64 | FAIL | FAIL  |      | FAIL       | FAIL      | FAIL      |          |
| SUSE15-64      | pass | pass  |      |            |           | FAIL      |          |
+----------------+------+-------+------+------------+-----------+-----------+----------+
Test environment and configuration as below:

** Makefile build **


OS: CENTOS82-64
	Kernel Version: 4.18.0-193.el8.x86_64
	CPU info: Intel(R) Xeon(R) Platinum 8280M CPU @ 2.70GHz
	GCC Version: gcc (GCC) 8.3.1 20191121 (Red Hat 8.3.1-5)
	Clang Version: 9.0.1 (Red Hat 9.0.1-2.module_el8.2.0+309+0c7b6b03)
	x86_64-native-linuxapp-gcc
	x86_64-native-linuxapp-clang
	x86_64-native-linuxapp-icc
	x86_64-native-linuxapp-gcc+shared
	x86_64-native-linuxapp-gcc+debug


OS: RHEL82-64
	Kernel Version: 4.18.0-193.el8.x86_64
	CPU info: Intel(R) Xeon(R) Platinum 8280M CPU @ 2.70GHz
	GCC Version: gcc (GCC) 8.3.1 20191121 (Red Hat 8.3.1-5)
	Clang Version: 8.0.1 (Red Hat 8.0.1-1.module_el8.1.0+215+a01033fb)
	x86_64-native-linuxapp-gcc


OS: UB1804-64
	Kernel Version: 4.15.0-29-generic
	CPU info: Intel(R) Xeon(R) Platinum 8180 CPU @ 2.50GHz
	GCC Version: gcc (Ubuntu 7.5.0-3ubuntu1~18.04) 7.5.0
	Clang Version: 6.0.0-1ubuntu2 (tags/RELEASE_600/final)
	x86_64-native-linuxapp-gcc


OS: FC32-64
	Kernel Version: 5.6.0-0.rc7.git0.2.fc32.x86_64
	CPU info: Intel(R) Xeon(R) Platinum 8280M CPU @ 2.70GHz
	GCC Version: gcc (GCC) 10.0.1 20200311 (Red Hat 10.0.1-0.9)
	Clang Version: 10.0.0 (Fedora 10.0.0-0.3.rc4.fc32)
	x86_64-native-linuxapp-gcc
	x86_64-native-linuxapp-clang


OS: CENTOS77-64
	Kernel Version: 3.10.0-1062.9.1.el7.x86_64
	CPU info: Intel(R) Xeon(R) Platinum 8280M CPU @ 2.70GHz
	GCC Version: gcc (GCC) 4.8.5 20150623 (Red Hat 4.8.5-39)
	Clang Version: 3.4.2 (tags/RELEASE_34/dot2-final)
	x86_64-native-linuxapp-gcc


OS: UB2004-64
	Kernel Version: 5.4.0-26-generic
	CPU info: Intel(R) Xeon(R) Platinum 8180 CPU @ 2.50GHz
	GCC Version: gcc (Ubuntu 10-20200416-0ubuntu1) 10.0.1 20200416 (experimental) [master revision 3c3f12e2a76:dcee354ce56:44b326839d864fc10c459916abcc97f35a9ac3de]
	Clang Version: 10.0.0-4ubuntu1
	x86_64-native-linuxapp-clang
	x86_64-native-linuxapp-gcc
	x86_64-native-linuxapp-icc


OS: UB2004-32
	Kernel Version: 5.4.0-26-generic
	CPU info: Intel(R) Xeon(R) Platinum 8180 CPU @ 2.50GHz
	GCC Version: gcc (Ubuntu 9.3.0-10ubuntu2) 9.3.0
	Clang Version: 10.0.0-4ubuntu1
	i686-native-linuxapp-gcc


OS: FreeBSD1201-64
	Kernel Version: 12.1-RELEASE
	CPU info: Intel(R) Xeon(R) CPU E5-2699 v3 @ 2.30GHz (2294.74-MHz K8-class CPU)
	GCC Version: gcc (FreeBSD Ports Collection) 9.2.0
	Clang Version: 8.0.1 (tags/RELEASE_801/final 366581) (based on LLVM 8.0.1)
	x86_64-native-bsdapp-gcc
	x86_64-native-bsdapp-clang
	x86_64-native-bsdapp-gcc+shared
	x86_64-native-bsdapp-gcc+debug


OS: SUSE15-64
	Kernel Version: 4.12.14-lp150.11-default
	CPU info: Intel(R) Xeon(R) CPU E5-2699 v4 @ 2.20GHz
	GCC Version: gcc (SUSE Linux) 7.3.1 20180323 [gcc-7-branch revision 258812]
	Clang Version: 5.0.1 (tags/RELEASE_501/final 312548)
	x86_64-native-linuxapp-clang
	x86_64-native-linuxapp-gcc

** Meson build **


OS: CENTOS82-64
	Kernel Version: 4.18.0-193.el8.x86_64
	CPU info: Intel(R) Xeon(R) CPU E5-2699 v4 @ 2.20GHz
	GCC Version: gcc (GCC) 8.3.1 20191121 (Red Hat 8.3.1-5)
	Clang Version: 9.0.1 (Red Hat 9.0.1-2.module_el8.2.0+309+0c7b6b03)
	./build-gcc-static
	./build-gcc-shared
	./build-clang-static
	./build-clang-shared
	./build-x86-default


OS: UB2004-64
	Kernel Version: 5.4.0-26-generic
	CPU info: Intel(R) Xeon(R) Platinum 8180 CPU @ 2.50GHz
	GCC Version: gcc (Ubuntu 9.3.0-10ubuntu2) 9.3.0
	Clang Version: 10.0.0-4ubuntu1
	x86_64-native-linuxapp-doc
	./build-gcc-static
	./build-gcc-shared
	./build-clang-static
	./build-clang-shared
	./build-x86-default


OS: FC32-64
	Kernel Version: 5.6.0-0.rc7.git0.2.fc32.x86_64
	CPU info: Intel(R) Xeon(R) CPU E5-2699 v4 @ 2.20GHz
	GCC Version: gcc (GCC) 10.0.1 20200311 (Red Hat 10.0.1-0.9)
	Clang Version: 10.0.0 (Fedora 10.0.0-0.3.rc4.fc32)
	./build-gcc-static
	./build-gcc-shared
	./build-clang-static
	./build-clang-shared
	./build-x86-default


OS: WIN10-64
	Kernel Version: N/A
	CPU info: N/A
	GCC Version: N/A
	Clang Version: Clang 8.0.0
	x86_64-windows-clang


OS: UB1804-32
	Kernel Version: 4.15.0-20-generic
	CPU info: Intel(R) Xeon(R) CPU E5-2699 v4 @ 2.20GHz
	GCC Version: gcc (Ubuntu 7.5.0-3ubuntu1~18.04) 7.5.0
	Clang Version: 6.0.0-1ubuntu2 (tags/RELEASE_600/final)
	./build-gcc-static
	./build-gcc-shared
	./build-clang-static
	./build-clang-shared
	./build-x86-default


OS: FreeBSD1201-64
	Kernel Version: 12.1-RELEASE
	CPU info: Intel(R) Xeon(R) CPU E5-2699 v4 @ 2.20GHz (2194.97-MHz K8-class CPU)
	GCC Version: gcc (FreeBSD Ports Collection) 9.2.0
	Clang Version: 8.0.1 (tags/RELEASE_801/final 366581) (based on LLVM 8.0.1)
	./build-gcc-static
	./build-gcc-shared
	./build-clang-static
	./build-clang-shared
	./build-x86-default


OS: SUSE15-64
	Kernel Version: 4.12.14-lp150.12.82-default
	CPU info: Intel(R) Xeon(R) CPU E5-2699 v4 @ 2.20GHz
	GCC Version: gcc (SUSE Linux) 7.4.1 20190905 [gcc-7-branch revision 275407]
	Clang Version: 5.0.1 (tags/RELEASE_501/final 312548)
	./build-gcc-static
	./build-gcc-shared
	./build-clang-static
	./build-clang-shared
	./build-x86-default



*Meson Build Failed #1:
OS: CENTOS82-64
Target:./build-gcc-static
FAILED: lib/librte_power.so.20.0.3 
gcc  -o lib/librte_power.so.20.0.3 'lib/76b5a35@@rte_power@sta/librte_power_rte_power.c.o' 'lib/76b5a35@@rte_power@sta/librte_power_power_acpi_cpufreq.c.o' 'lib/76b5a35@@rte_power@sta/librte_power_power_kvm_vm.c.o' 'lib/76b5a35@@rte_power@sta/librte_power_guest_channel.c.o' 'lib/76b5a35@@rte_power@sta/librte_power_rte_power_empty_poll.c.o' 'lib/76b5a35@@rte_power@sta/librte_power_power_pstate_cpufreq.c.o' -Wl,--as-needed -Wl,--no-undefined -shared -fPIC -Wl,--start-group -Wl,-soname,librte_power.so.20.0 -Wl,--no-as-needed -pthread -lm -ldl -lnuma lib/librte_eal.so.20.0.3 lib/librte_kvargs.so.20.0.3 lib/librte_telemetry.so.0.200.3 lib/librte_timer.so.20.0.3 -Wl,--end-group -Wl,--version-script=/root/CENTOS82-64_K4.18.0_GCC8.3.1/x86_64-native-linuxapp-gcc/3999f354db0243f6ab28f98f44074649/dpdk/lib/librte_power/rte_power_version.map '-Wl,-rpath,$ORIGIN/' -Wl,-rpath-link,/root/CENTOS82-64_K4.18.0_GCC8.3.1/x86_64-native-linuxapp-gcc/3999f354db0243f6ab28f98f44074649/dpdk/build-gcc-static/lib
lib/76b5a35@@rte_power@sta/librte_power_rte_power_empty_poll.c.o: In function `rte_power_empty_poll_stat_init':
/root/CENTOS82-64_K4.18.0_GCC8.3.1/x86_64-native-linuxapp-gcc/3999f354db0243f6ab28f98f44074649/dpdk/build-gcc-static/../lib/librte_power/rte_power_empty_poll.c:455: undefined reference to `rte_get_initial_lcore'
collect2: error: ld returned 1 exit status
[393/2359] Generating rawdev.sym_chk with a meson_exe.py custom command.
[394/2359] Generating pdump.sym_chk with a meson_exe.py custom command.
[395/2359] Generating symbol file 'lib/76b5a35@@rte_kni@sha/librte_kni.so.20.0.3.symbols'.
[396/2359] Generating reorder.sym_chk with a meson_exe.py custom command.
[397/2359] Generating stack.sym_chk with a meson_exe.py custom command.
[398/2359] Compiling C object 'lib/76b5a35@@rte_vhost@sta/librte_vhost_vdpa.c.o'.
[399/2359] Generating rib.sym_chk with a meson_exe.py custom command.
[400/2359] Generating security.sym_chk with a meson_exe.py custom command.
[401/2359] Compiling C object 'lib/76b5a35@@rte_vhost@sta/librte_vhost_iotlb.c.o'.
[402/2359] Compiling C object 'lib/76b5a35@@rte_vhost@sta/librte_vhost_socket.c.o'.
[403/2359] Compiling C object 'lib/76b5a35@@rte_sched@sta/librte_sched_rte_sched.c.o'.
ninja: build stopped: subcommand failed




*Meson Build Failed #2:
OS: FC32-64
Target:./build-gcc-static
FAILED: lib/librte_power.so.20.0.3 
gcc  -o lib/librte_power.so.20.0.3 'lib/76b5a35@@rte_power@sta/librte_power_rte_power.c.o' 'lib/76b5a35@@rte_power@sta/librte_power_power_acpi_cpufreq.c.o' 'lib/76b5a35@@rte_power@sta/librte_power_power_kvm_vm.c.o' 'lib/76b5a35@@rte_power@sta/librte_power_guest_channel.c.o' 'lib/76b5a35@@rte_power@sta/librte_power_rte_power_empty_poll.c.o' 'lib/76b5a35@@rte_power@sta/librte_power_power_pstate_cpufreq.c.o' -Wl,--as-needed -Wl,--no-undefined -shared -fPIC -Wl,--start-group -Wl,-soname,librte_power.so.20.0 -Wl,--no-as-needed -pthread -lm -ldl -lnuma lib/librte_eal.so.20.0.3 lib/librte_kvargs.so.20.0.3 lib/librte_telemetry.so.0.200.3 lib/librte_timer.so.20.0.3 -Wl,--end-group -Wl,--version-script=/root/FC32-64_K5.6.0_GCC10.0.1/x86_64-native-linuxapp-gcc/3999f354db0243f6ab28f98f44074649/dpdk/lib/librte_power/rte_power_version.map '-Wl,-rpath,$ORIGIN/' -Wl,-rpath-link,/root/FC32-64_K5.6.0_GCC10.0.1/x86_64-native-linuxapp-gcc/3999f354db0243f6ab28f98f44074649/dpdk/build-gcc-static/lib
/usr/bin/ld: lib/76b5a35@@rte_power@sta/librte_power_rte_power_empty_poll.c.o: in function `rte_power_empty_poll_stat_init':
/root/FC32-64_K5.6.0_GCC10.0.1/x86_64-native-linuxapp-gcc/3999f354db0243f6ab28f98f44074649/dpdk/build-gcc-static/../lib/librte_power/rte_power_empty_poll.c:455: undefined reference to `rte_get_initial_lcore'
collect2: error: ld returned 1 exit status
[399/2360] Generating pdump.sym_chk with a meson_exe.py custom command.
[400/2360] Generating stack.sym_chk with a meson_exe.py custom command.
[401/2360] Generating rib.sym_chk with a meson_exe.py custom command.
[402/2360] Generating symbol file 'lib/76b5a35@@rte_rawdev@sha/librte_rawdev.so.20.0.3.symbols'.
[403/2360] Generating security.sym_chk with a meson_exe.py custom command.
[404/2360] Generating symbol file 'lib/76b5a35@@rte_reorder@sha/librte_reorder.so.20.0.3.symbols'.
[405/2360] Compiling C object 'lib/76b5a35@@rte_vhost@sta/librte_vhost_iotlb.c.o'.
[406/2360] Compiling C object 'lib/76b5a35@@rte_sched@sta/librte_sched_rte_sched.c.o'.
[407/2360] Compiling C object 'lib/76b5a35@@rte_vhost@sta/librte_vhost_socket.c.o'.
ninja: build stopped: subcommand failed




*Meson Build Failed #3:
OS: FreeBSD1201-64
Target:./build-gcc-static
FAILED: lib/76b5a35@@rte_eal@sta/librte_eal_freebsd_eal.c.o 
gcc -Ilib/76b5a35@@rte_eal@sta -Ilib -I../lib -I. -I.. -Iconfig -I../config -Ilib/librte_eal/include -I../lib/librte_eal/include -Ilib/librte_eal/freebsd/include -I../lib/librte_eal/freebsd/include -Ilib/librte_eal/x86/include -I../lib/librte_eal/x86/include -Ilib/librte_eal/common -I../lib/librte_eal/common -Ilib/librte_eal -I../lib/librte_eal -Ilib/librte_kvargs -I../lib/librte_kvargs -Ilib/librte_metrics -I../lib/librte_metrics -Ilib/librte_telemetry -I../lib/librte_telemetry -fdiagnostics-color=always -pipe -D_FILE_OFFSET_BITS=64 -Wall -Winvalid-pch -Werror -O2 -g -include rte_config.h -Wextra -Wcast-qual -Wdeprecated -Wformat-nonliteral -Wformat-security -Wmissing-declarations -Wmissing-prototypes -Wnested-externs -Wold-style-definition -Wpointer-arith -Wsign-compare -Wstrict-prototypes -Wundef -Wwrite-strings -Wno-address-of-packed-member -Wno-packed-not-aligned -Wno-missing-field-initializers -D_GNU_SOURCE -D__BSD_VISIBLE -fPIC -march=native -DALLOW_EXPERIMENTAL_API -DALLOW_INTERNAL_API -Wno-format-truncation -DRTE_LIBEAL_USE_GETENTROPY -DHAVE_GETOPT_H -DHAVE_GETOPT -DHAVE_GETOPT_LONG -MD -MQ 'lib/76b5a35@@rte_eal@sta/librte_eal_freebsd_eal.c.o' -MF 'lib/76b5a35@@rte_eal@sta/librte_eal_freebsd_eal.c.o.d' -o 'lib/76b5a35@@rte_eal@sta/librte_eal_freebsd_eal.c.o' -c ../lib/librte_eal/freebsd/eal.c
../lib/librte_eal/freebsd/eal.c: In function 'eal_check_mem_on_local_socket':
../lib/librte_eal/freebsd/eal.c:625:1: error: version control conflict marker in file
  625 | <<<<<<< HEAD
      | ^~~~~~~
../lib/librte_eal/freebsd/eal.c:627:1: error: version control conflict marker in file
  627 | =======
      | ^~~~~~~
../lib/librte_eal/freebsd/eal.c:629:1: error: version control conflict marker in file
  629 | >>>>>>> 28604a3e5a3a... eal: rename terms used for DPDK lcores
      | ^~~~~~~
../lib/librte_eal/freebsd/eal.c:629:9: error: invalid suffix "a3e5a3a..." on integer constant
  629 | >>>>>>> 28604a3e5a3a... eal: rename terms used for DPDK lcores
      |         ^~~~~~~~~~~~~~~
../lib/librte_eal/freebsd/eal.c:623:27: error: unused variable 'config' [-Werror=unused-variable]
  623 |  const struct rte_config *config = rte_eal_get_configuration();
      |                           ^~~~~~
../lib/librte_eal/freebsd/eal.c:622:6: error: unused variable 'socket_id' [-Werror=unused-variable]
  622 |  int socket_id;
      |      ^~~~~~~~~
../lib/librte_eal/freebsd/eal.c: In function 'rte_eal_init':
../lib/librte_eal/freebsd/eal.c:852:1: error: version control conflict marker in file
  852 | <<<<<<< HEAD
      | ^~~~~~~
../lib/librte_eal/freebsd/eal.c:1079: error: unterminated argument list invoking macro "RTE_LOG"
 1079 | }
      | 
../lib/librte_eal/freebsd/eal.c:857:2: error: 'RTE_LOG' undeclared (first use in this function)
  857 |  RTE_LOG(DEBUG, EAL, "Master lcore %u is ready (tid=%p;cpuset=[%s%s])\n",
      |  ^~~~~~~
../lib/librte_eal/freebsd/eal.c:857:2: note: each undeclared identifier is reported only once for each function it appears in
../lib/librte_eal/freebsd/eal.c:857:9: error: expected ';' at end of input
  857 |  RTE_LOG(DEBUG, EAL, "Master lcore %u is ready (tid=%p;cpuset=[%s%s])\n",
      |         ^
      |         ;
......
 1079 | }
      |          
../lib/librte_eal/freebsd/eal.c:857:2: error: expected declaration or statement at end of input
  857 |  RTE_LOG(DEBUG, EAL, "Master lcore %u is ready (tid=%p;cpuset=[%s%s])\n",
      |  ^~~~~~~
../lib/librte_eal/freebsd/eal.c:671:27: error: unused variable 'config' [-Werror=unused-variable]
  671 |  const struct rte_config *config = rte_eal_get_configuration();
      |                           ^~~~~~
../lib/librte_eal/freebsd/eal.c:670:7: error: unused variable 'thread_name' [-Werror=unused-variable]
  670 |  char thread_name[RTE_MAX_THREAD_NAME_LEN];
      |       ^~~~~~~~~~~
../lib/librte_eal/freebsd/eal.c:667:12: error: variable 'thread_id' set but not used [-Werror=unused-but-set-variable]
  667 |  pthread_t thread_id;
      |            ^~~~~~~~~
../lib/librte_eal/freebsd/eal.c:666:6: error: unused variable 'i' [-Werror=unused-variable]
  666 |  int i, fctret, ret;
      |      ^
../lib/librte_eal/freebsd/eal.c:857:2: error: control reaches end of non-void function [-Werror=return-type]
  857 |  RTE_LOG(DEBUG, EAL, "Master lcore %u is ready (tid=%p;cpuset=[%s%s])\n",
      |  ^~~~~~~
At top level:
../lib/librte_eal/freebsd/eal.c:637:1: error: 'sync_func' defined but not used [-Werror=unused-function]
  637 | sync_func(__rte_unused void *arg)
      | ^~~~~~~~~
../lib/librte_eal/freebsd/eal.c:606:1: error: 'check_socket' defined but not used [-Werror=unused-function]
  606 | check_socket(const struct rte_memseg_list *msl, void *arg)
      | ^~~~~~~~~~~~
cc1: all warnings being treated as errors
[53/1748] Compiling C object 'lib/76b5a35@@rte_eal@sta/librte_eal_freebsd_eal_debug.c.o'
[54/1748] Compiling C object 'lib/76b5a35@@rte_eal@sta/librte_eal_common_rte_service.c.o'
[55/1748] Compiling C object 'lib/76b5a35@@rte_eal@sta/librte_eal_common_rte_random.c.o'
[56/1748] Compiling C object 'lib/76b5a35@@rte_eal@sta/librte_eal_freebsd_eal_alarm.c.o'
[57/1748] Generating telemetry.sym_chk with a meson_exe.py custom command
[58/1748] Generating symbol file 'lib/76b5a35@@rte_kvargs@sha/librte_kvargs.so.20.0.3.symbols'
WARNING: Symbol extracting has not been implemented for this platform. Relinking will always happen on source changes.
[59/1748] Compiling C object 'lib/76b5a35@@rte_eal@sta/librte_eal_common_malloc_heap.c.o'
[60/1748] Compiling C object 'lib/76b5a35@@rte_eal@sta/librte_eal_common_rte_malloc.c.o'
[61/1748] Compiling C object 'lib/76b5a35@@rte_eal@sta/librte_eal_common_eal_common_options.c.o'
ninja: build stopped: subcommand failed




*Meson Build Failed #4:
OS: SUSE15-64
Target:./build-gcc-static
FAILED: lib/librte_power.so.20.0.3 
gcc  -o lib/librte_power.so.20.0.3 'lib/76b5a35@@rte_power@sta/librte_power_rte_power.c.o' 'lib/76b5a35@@rte_power@sta/librte_power_power_acpi_cpufreq.c.o' 'lib/76b5a35@@rte_power@sta/librte_power_power_kvm_vm.c.o' 'lib/76b5a35@@rte_power@sta/librte_power_guest_channel.c.o' 'lib/76b5a35@@rte_power@sta/librte_power_rte_power_empty_poll.c.o' 'lib/76b5a35@@rte_power@sta/librte_power_power_pstate_cpufreq.c.o' -Wl,--no-undefined -Wl,--as-needed -shared -fPIC -Wl,--start-group -Wl,-soname,librte_power.so.20.0 -Wl,--no-as-needed -pthread -lm -ldl -lnuma lib/librte_eal.so.20.0.3 lib/librte_kvargs.so.20.0.3 lib/librte_telemetry.so.0.200.3 lib/librte_timer.so.20.0.3 -Wl,--end-group -Wl,--version-script=/root/SUSE15-64_K4.12.14_GCC7.3.1/x86_64-native-linuxapp-gcc/3999f354db0243f6ab28f98f44074649/dpdk/lib/librte_power/rte_power_version.map '-Wl,-rpath,$ORIGIN/' -Wl,-rpath-link,/root/SUSE15-64_K4.12.14_GCC7.3.1/x86_64-native-linuxapp-gcc/3999f354db0243f6ab28f98f44074649/dpdk/build-gcc-static/lib 
/usr/lib64/gcc/x86_64-suse-linux/7/../../../../x86_64-suse-linux/bin/ld: lib/76b5a35@@rte_power@sta/librte_power_rte_power_empty_poll.c.o: in function `rte_power_empty_poll_stat_init':
/root/SUSE15-64_K4.12.14_GCC7.3.1/x86_64-native-linuxapp-gcc/3999f354db0243f6ab28f98f44074649/dpdk/build-gcc-static/../lib/librte_power/rte_power_empty_poll.c:455: undefined reference to `rte_get_initial_lcore'
collect2: error: ld returned 1 exit status
[401/2254] Linking target lib/librte_pdump.so.20.0.3.
[402/2254] Generating stack.sym_chk with a meson_exe.py custom command.
[403/2254] Generating symbol file 'lib/76b5a35@@rte_rawdev@sha/librte_rawdev.so.20.0.3.symbols'.
[404/2254] Generating rib.sym_chk with a meson_exe.py custom command.
[405/2254] Compiling C object 'lib/76b5a35@@rte_vhost@sta/librte_vhost_iotlb.c.o'.
[406/2254] Generating security.sym_chk with a meson_exe.py custom command.
[407/2254] Compiling C object 'lib/76b5a35@@rte_vhost@sta/librte_vhost_socket.c.o'.
[408/2254] Generating symbol file 'lib/76b5a35@@rte_reorder@sha/librte_reorder.so.20.0.3.symbols'.
[409/2254] Compiling C object 'lib/76b5a35@@rte_sched@sta/librte_sched_rte_sched.c.o'.
ninja: build stopped: subcommand failed




*Meson Build Failed #5:
OS: UB1804-32
Target:./build-gcc-static
FAILED: lib/76b5a35@@rte_eal@sta/librte_eal_common_eal_common_dynmem.c.o 
gcc -Ilib/76b5a35@@rte_eal@sta -Ilib -I../lib -I. -I../ -Iconfig -I../config -Ilib/librte_eal/include -I../lib/librte_eal/include -Ilib/librte_eal/linux/include -I../lib/librte_eal/linux/include -Ilib/librte_eal/x86/include -I../lib/librte_eal/x86/include -Ilib/librte_eal/common -I../lib/librte_eal/common -Ilib/librte_eal -I../lib/librte_eal -Ilib/librte_kvargs -I../lib/librte_kvargs -Ilib/librte_telemetry/../librte_metrics -I../lib/librte_telemetry/../librte_metrics -Ilib/librte_telemetry -I../lib/librte_telemetry -fdiagnostics-color=always -pipe -D_FILE_OFFSET_BITS=64 -Wall -Winvalid-pch -Werror -O2 -g -include rte_config.h -Wextra -Wcast-qual -Wdeprecated -Wformat-nonliteral -Wformat-security -Wmissing-declarations -Wmissing-prototypes -Wnested-externs -Wold-style-definition -Wpointer-arith -Wsign-compare -Wstrict-prototypes -Wundef -Wwrite-strings -Wno-missing-field-initializers -Wno-pointer-to-int-cast -D_GNU_SOURCE -m32 -fPIC -march=native -DALLOW_EXPERIMENTAL_API -DALLOW_INTERNAL_API -Wno-format-truncation -DRTE_LIBEAL_USE_GETENTROPY -DHAVE_GETOPT_H -DHAVE_GETOPT -DHAVE_GETOPT_LONG -MD -MQ 'lib/76b5a35@@rte_eal@sta/librte_eal_common_eal_common_dynmem.c.o' -MF 'lib/76b5a35@@rte_eal@sta/librte_eal_common_eal_common_dynmem.c.o.d' -o 'lib/76b5a35@@rte_eal@sta/librte_eal_common_eal_common_dynmem.c.o' -c ../lib/librte_eal/common/eal_common_dynmem.c
../lib/librte_eal/common/eal_common_dynmem.c: In function ‘eal_dynmem_calc_num_pages_per_socket’:
../lib/librte_eal/common/eal_common_dynmem.c:440:33: error: ‘struct rte_config’ has no member named ‘master_lcore’; did you mean ‘initial_lcore’?
     rte_lcore_to_socket_id(cfg->master_lcore);
                                 ^~~~~~~~~~~~
                                 initial_lcore
[49/2100] Compiling C object 'lib/76b5a35@@rte_eal@sta/librte_eal_unix_eal_unix_timer.c.o'.
[50/2100] Compiling C object 'lib/76b5a35@@rte_eal@sta/librte_eal_common_malloc_mp.c.o'.
[51/2100] Compiling C object 'lib/76b5a35@@rte_eal@sta/librte_eal_unix_eal_unix_memory.c.o'.
[52/2100] Generating telemetry.sym_chk with a meson_exe.py custom command.
[53/2100] Generating symbol file 'lib/76b5a35@@rte_kvargs@sha/librte_kvargs.so.20.0.3.symbols'.
[54/2100] Compiling C object 'lib/76b5a35@@rte_eal@sta/librte_eal_common_rte_service.c.o'.
[55/2100] Compiling C object 'lib/76b5a35@@rte_eal@sta/librte_eal_common_rte_random.c.o'.
[56/2100] Compiling C object 'lib/76b5a35@@rte_eal@sta/librte_eal_common_eal_common_options.c.o'.
[57/2100] Compiling C object 'lib/76b5a35@@rte_eal@sta/librte_eal_common_malloc_heap.c.o'.
[58/2100] Compiling C object 'lib/76b5a35@@rte_eal@sta/librte_eal_common_rte_malloc.c.o'.
[59/2100] Compiling C object 'lib/76b5a35@@rte_eal@sta/librte_eal_linux_eal.c.o'.
ninja: build stopped: subcommand failed




*Meson Build Failed #6:
OS: UB2004-64
Target:./build-gcc-static
FAILED: lib/librte_power.so.20.0.3 
gcc  -o lib/librte_power.so.20.0.3 'lib/76b5a35@@rte_power@sta/librte_power_rte_power.c.o' 'lib/76b5a35@@rte_power@sta/librte_power_power_acpi_cpufreq.c.o' 'lib/76b5a35@@rte_power@sta/librte_power_power_kvm_vm.c.o' 'lib/76b5a35@@rte_power@sta/librte_power_guest_channel.c.o' 'lib/76b5a35@@rte_power@sta/librte_power_rte_power_empty_poll.c.o' 'lib/76b5a35@@rte_power@sta/librte_power_power_pstate_cpufreq.c.o' -Wl,--as-needed -Wl,--no-undefined -shared -fPIC -Wl,--start-group -Wl,-soname,librte_power.so.20.0 -Wl,--no-as-needed -pthread -lm -ldl -lnuma lib/librte_eal.so.20.0.3 lib/librte_kvargs.so.20.0.3 lib/librte_telemetry.so.0.200.3 lib/librte_timer.so.20.0.3 -Wl,--end-group -Wl,--version-script=/root/UB2004-64_K5.4.0_GCC9.3.0/x86_64-native-linuxapp-gcc/3999f354db0243f6ab28f98f44074649/dpdk/lib/librte_power/rte_power_version.map '-Wl,-rpath,$ORIGIN/' -Wl,-rpath-link,/root/UB2004-64_K5.4.0_GCC9.3.0/x86_64-native-linuxapp-gcc/3999f354db0243f6ab28f98f44074649/dpdk/build-gcc-static/lib
/usr/bin/ld: lib/76b5a35@@rte_power@sta/librte_power_rte_power_empty_poll.c.o: in function `rte_power_empty_poll_stat_init':
/root/UB2004-64_K5.4.0_GCC9.3.0/x86_64-native-linuxapp-gcc/3999f354db0243f6ab28f98f44074649/dpdk/build-gcc-static/../lib/librte_power/rte_power_empty_poll.c:455: undefined reference to `rte_get_initial_lcore'
collect2: error: ld returned 1 exit status
[394/2350] Generating rawdev.sym_chk with a meson_exe.py custom command.
[395/2350] Generating stack.sym_chk with a meson_exe.py custom command.
[396/2350] Generating pdump.sym_chk with a meson_exe.py custom command.
[397/2350] Compiling C object 'lib/76b5a35@@rte_security@sta/librte_security_rte_security.c.o'.
[398/2350] Compiling C object 'lib/76b5a35@@rte_vhost@sta/librte_vhost_vdpa.c.o'.
[399/2350] Generating rib.sym_chk with a meson_exe.py custom command.
[400/2350] Compiling C object 'lib/76b5a35@@rte_vhost@sta/librte_vhost_socket.c.o'.
[401/2350] Generating reorder.sym_chk with a meson_exe.py custom command.
[402/2350] Compiling C object 'lib/76b5a35@@rte_vhost@sta/librte_vhost_iotlb.c.o'.
[403/2350] Compiling C object 'lib/76b5a35@@rte_sched@sta/librte_sched_rte_sched.c.o'.
[404/2350] Compiling C object 'lib/76b5a35@@rte_vhost@sta/librte_vhost_vhost.c.o'.
ninja: build stopped: subcommand failed



*Makefile Build Failed #1:
OS: CENTOS82-64
Target: x86_64-native-linuxapp-gcc+shared
  LD librte_power.so.20.0.3
rte_power_empty_poll.o: In function `rte_power_empty_poll_stat_init':
rte_power_empty_poll.c:(.text.experimental+0x14d): undefined reference to `rte_get_initial_lcore'
collect2: error: ld returned 1 exit status
make[5]: *** [/root/CENTOS82-64_K4.18.0_GCC8.3.1/x86_64-native-linuxapp-gcc+shared/3999f354db0243f6ab28f98f44074649/dpdk/mk/rte.lib.mk:100: librte_power.so.20.0.3] Error 1
make[4]: *** [/root/CENTOS82-64_K4.18.0_GCC8.3.1/x86_64-native-linuxapp-gcc+shared/3999f354db0243f6ab28f98f44074649/dpdk/mk/rte.subdir.mk:35: librte_power] Error 2
make[4]: *** Waiting for unfinished jobs....
  LD librte_mempool.so.20.0.3
  INSTALL-LIB librte_mempool.so.20.0.3
--
make[5]: warning:  Clock skew detected.  Your build may be incomplete.
  LD librte_hash.so.20.0.3
  INSTALL-LIB librte_hash.so.20.0.3
make[3]: *** [/root/CENTOS82-64_K4.18.0_GCC8.3.1/x86_64-native-linuxapp-gcc+shared/3999f354db0243f6ab28f98f44074649/dpdk/mk/rte.sdkbuild.mk:53: lib] Error 2
make[2]: *** [/root/CENTOS82-64_K4.18.0_GCC8.3.1/x86_64-native-linuxapp-gcc+shared/3999f354db0243f6ab28f98f44074649/dpdk/mk/rte.sdkroot.mk:115: all] Error 2
make[1]: *** [/root/CENTOS82-64_K4.18.0_GCC8.3.1/x86_64-native-linuxapp-gcc+shared/3999f354db0243f6ab28f98f44074649/dpdk/mk/rte.sdkinstall.mk:61: pre_install] Error 2
make: *** [/root/CENTOS82-64_K4.18.0_GCC8.3.1/x86_64-native-linuxapp-gcc+shared/3999f354db0243f6ab28f98f44074649/dpdk/mk/rte.sdkroot.mk:92: install] Error 2


*Makefile Build Failed #2:
OS: FreeBSD1201-64
Target: x86_64-native-bsdapp-gcc
  CC eal_lcore.o
  CC eal_memalloc.o
/root/FreeBSD1201-64_K12.1_GCC9.2.0/x86_64-native-bsdapp-gcc/3999f354db0243f6ab28f98f44074649/dpdk/lib/librte_eal/freebsd/eal.c: In function 'eal_check_mem_on_local_socket':
/root/FreeBSD1201-64_K12.1_GCC9.2.0/x86_64-native-bsdapp-gcc/3999f354db0243f6ab28f98f44074649/dpdk/lib/librte_eal/freebsd/eal.c:625:1: error: version control conflict marker in file
  625 | <<<<<<< HEAD
      | ^~~~~~~
/root/FreeBSD1201-64_K12.1_GCC9.2.0/x86_64-native-bsdapp-gcc/3999f354db0243f6ab28f98f44074649/dpdk/lib/librte_eal/freebsd/eal.c:627:1: error: version control conflict marker in file
  627 | =======
      | ^~~~~~~
/root/FreeBSD1201-64_K12.1_GCC9.2.0/x86_64-native-bsdapp-gcc/3999f354db0243f6ab28f98f44074649/dpdk/lib/librte_eal/freebsd/eal.c:629:1: error: version control conflict marker in file
  629 | >>>>>>> 28604a3e5a3a... eal: rename terms used for DPDK lcores
      | ^~~~~~~
/root/FreeBSD1201-64_K12.1_GCC9.2.0/x86_64-native-bsdapp-gcc/3999f354db0243f6ab28f98f44074649/dpdk/lib/librte_eal/freebsd/eal.c:629:9: error: invalid suffix "a3e5a3a..." on integer constant
  629 | >>>>>>> 28604a3e5a3a... eal: rename terms used for DPDK lcores
      |         ^~~~~~~~~~~~~~~
/root/FreeBSD1201-64_K12.1_GCC9.2.0/x86_64-native-bsdapp-gcc/3999f354db0243f6ab28f98f44074649/dpdk/lib/librte_eal/freebsd/eal.c:623:27: warning: unused variable 'config' [-Wunused-variable]
--
  622 |  int socket_id;
      |      ^~~~~~~~~
/root/FreeBSD1201-64_K12.1_GCC9.2.0/x86_64-native-bsdapp-gcc/3999f354db0243f6ab28f98f44074649/dpdk/lib/librte_eal/freebsd/eal.c: In function 'rte_eal_init':
/root/FreeBSD1201-64_K12.1_GCC9.2.0/x86_64-native-bsdapp-gcc/3999f354db0243f6ab28f98f44074649/dpdk/lib/librte_eal/freebsd/eal.c:852:1: error: version control conflict marker in file
  852 | <<<<<<< HEAD
      | ^~~~~~~
/root/FreeBSD1201-64_K12.1_GCC9.2.0/x86_64-native-bsdapp-gcc/3999f354db0243f6ab28f98f44074649/dpdk/lib/librte_eal/freebsd/eal.c:1079: error: unterminated argument list invoking macro "RTE_LOG"
 1079 | }
      | 
/root/FreeBSD1201-64_K12.1_GCC9.2.0/x86_64-native-bsdapp-gcc/3999f354db0243f6ab28f98f44074649/dpdk/lib/librte_eal/freebsd/eal.c:857:2: error: 'RTE_LOG' undeclared (first use in this function)
  857 |  RTE_LOG(DEBUG, EAL, "Master lcore %u is ready (tid=%p;cpuset=[%s%s])\n",
      |  ^~~~~~~
/root/FreeBSD1201-64_K12.1_GCC9.2.0/x86_64-native-bsdapp-gcc/3999f354db0243f6ab28f98f44074649/dpdk/lib/librte_eal/freebsd/eal.c:857:2: note: each undeclared identifier is reported only once for each function it appears in
/root/FreeBSD1201-64_K12.1_GCC9.2.0/x86_64-native-bsdapp-gcc/3999f354db0243f6ab28f98f44074649/dpdk/lib/librte_eal/freebsd/eal.c:857:9: error: expected ';' at end of input
  857 |  RTE_LOG(DEBUG, EAL, "Master lcore %u is ready (tid=%p;cpuset=[%s%s])\n",
      |         ^
      |         ;
......
 1079 | }
      |          
/root/FreeBSD1201-64_K12.1_GCC9.2.0/x86_64-native-bsdapp-gcc/3999f354db0243f6ab28f98f44074649/dpdk/lib/librte_eal/freebsd/eal.c:857:2: error: expected declaration or statement at end of input
  857 |  RTE_LOG(DEBUG, EAL, "Master lcore %u is ready (tid=%p;cpuset=[%s%s])\n",
      |  ^~~~~~~
/root/FreeBSD1201-64_K12.1_GCC9.2.0/x86_64-native-bsdapp-gcc/3999f354db0243f6ab28f98f44074649/dpdk/lib/librte_eal/freebsd/eal.c:671:27: warning: unused variable 'config' [-Wunused-variable]
--
/root/FreeBSD1201-64_K12.1_GCC9.2.0/x86_64-native-bsdapp-gcc/3999f354db0243f6ab28f98f44074649/dpdk/lib/librte_eal/freebsd/eal.c:606:1: warning: 'check_socket' defined but not used [-Wunused-function]
  606 | check_socket(const struct rte_memseg_list *msl, void *arg)
      | ^~~~~~~~~~~~
gmake[6]: *** [/root/FreeBSD1201-64_K12.1_GCC9.2.0/x86_64-native-bsdapp-gcc/3999f354db0243f6ab28f98f44074649/dpdk/mk/internal/rte.compile-pre.mk:116: eal.o] Error 1
gmake[6]: *** Waiting for unfinished jobs....
gmake[5]: *** [/root/FreeBSD1201-64_K12.1_GCC9.2.0/x86_64-native-bsdapp-gcc/3999f354db0243f6ab28f98f44074649/dpdk/mk/rte.subdir.mk:37: freebsd] Error 2
gmake[4]: *** [/root/FreeBSD1201-64_K12.1_GCC9.2.0/x86_64-native-bsdapp-gcc/3999f354db0243f6ab28f98f44074649/dpdk/mk/rte.subdir.mk:37: librte_eal] Error 2
gmake[3]: *** [/root/FreeBSD1201-64_K12.1_GCC9.2.0/x86_64-native-bsdapp-gcc/3999f354db0243f6ab28f98f44074649/dpdk/mk/rte.sdkbuild.mk:53: lib] Error 2
gmake[2]: *** [/root/FreeBSD1201-64_K12.1_GCC9.2.0/x86_64-native-bsdapp-gcc/3999f354db0243f6ab28f98f44074649/dpdk/mk/rte.sdkroot.mk:115: all] Error 2
gmake[1]: *** [/root/FreeBSD1201-64_K12.1_GCC9.2.0/x86_64-native-bsdapp-gcc/3999f354db0243f6ab28f98f44074649/dpdk/mk/rte.sdkinstall.mk:61: pre_install] Error 2
gmake: *** [/root/FreeBSD1201-64_K12.1_GCC9.2.0/x86_64-native-bsdapp-gcc/3999f354db0243f6ab28f98f44074649/dpdk/mk/rte.sdkroot.mk:92: install] Error 2


*Makefile Build Failed #3:
OS: FreeBSD1201-64
Target: x86_64-native-bsdapp-clang
/root/FreeBSD1201-64_K12.1_Clang8.0.1/x86_64-native-bsdapp-clang/3999f354db0243f6ab28f98f44074649/dpdk/lib/librte_eal/freebsd/eal_thread.c:86:6: warning: no previous prototype for function 'eal_thread_set_initial_lcore' [-Wmissing-prototypes]
void eal_thread_set_initial_lcore(unsigned lcore_id)
     ^
 error: version control conflict marker in file
<<<<<<< HEAD
^
1 warning generated.
/root/FreeBSD1201-64_K12.1_Clang8.0.1/x86_64-native-bsdapp-clang/3999f354db0243f6ab28f98f44074649/dpdk/lib/librte_eal/freebsd/eal.c:626:45: error: no member named 'master_lcore' in 'struct rte_config'
        socket_id = rte_lcore_to_socket_id(config->master_lcore);
                                           ~~~~~~  ^
/root/FreeBSD1201-64_K12.1_Clang8.0.1/x86_64-native-bsdapp-clang/3999f354db0243f6ab28f98f44074649/dpdk/lib/librte_eal/freebsd/eal.c:852:1: error: version control conflict marker in file
<<<<<<< HEAD
^
/root/FreeBSD1201-64_K12.1_Clang8.0.1/x86_64-native-bsdapp-clang/3999f354db0243f6ab28f98f44074649/dpdk/lib/librte_eal/freebsd/eal.c:853:35: error: no member named 'master_lcore' in 'struct rte_config'
        eal_thread_initial_lcore(config->master_lcore);
                                 ~~~~~~  ^
/root/FreeBSD1201-64_K12.1_Clang8.0.1/x86_64-native-bsdapp-clang/3999f354db0243f6ab28f98f44074649/dpdk/lib/librte_eal/freebsd/eal.c:858:11: error: no member named 'master_lcore' in 'struct rte_config'
                config->master_lcore, thread_id, cpuset,
                ~~~~~~  ^
/root/FreeBSD1201-64_K12.1_Clang8.0.1/x86_64-native-bsdapp-clang/3999f354db0243f6ab28f98f44074649/dpdk/x86_64-native-bsdapp-clang/include/rte_log.h:351:32: note: expanded from macro 'RTE_LOG'
                 RTE_LOGTYPE_ ## t, # t ": " __VA_ARGS__)
                                             ^~~~~~~~~~~
5 errors generated.
gmake[6]: *** [/root/FreeBSD1201-64_K12.1_Clang8.0.1/x86_64-native-bsdapp-clang/3999f354db0243f6ab28f98f44074649/dpdk/mk/internal/rte.compile-pre.mk:116: eal.o] Error 1
gmake[6]: *** Waiting for unfinished jobs....
gmake[5]: *** [/root/FreeBSD1201-64_K12.1_Clang8.0.1/x86_64-native-bsdapp-clang/3999f354db0243f6ab28f98f44074649/dpdk/mk/rte.subdir.mk:37: freebsd] Error 2
gmake[4]: *** [/root/FreeBSD1201-64_K12.1_Clang8.0.1/x86_64-native-bsdapp-clang/3999f354db0243f6ab28f98f44074649/dpdk/mk/rte.subdir.mk:37: librte_eal] Error 2
gmake[3]: *** [/root/FreeBSD1201-64_K12.1_Clang8.0.1/x86_64-native-bsdapp-clang/3999f354db0243f6ab28f98f44074649/dpdk/mk/rte.sdkbuild.mk:53: lib] Error 2
gmake[2]: *** [/root/FreeBSD1201-64_K12.1_Clang8.0.1/x86_64-native-bsdapp-clang/3999f354db0243f6ab28f98f44074649/dpdk/mk/rte.sdkroot.mk:115: all] Error 2
gmake[1]: *** [/root/FreeBSD1201-64_K12.1_Clang8.0.1/x86_64-native-bsdapp-clang/3999f354db0243f6ab28f98f44074649/dpdk/mk/rte.sdkinstall.mk:61: pre_install] Error 2
gmake: *** [/root/FreeBSD1201-64_K12.1_Clang8.0.1/x86_64-native-bsdapp-clang/3999f354db0243f6ab28f98f44074649/dpdk/mk/rte.sdkroot.mk:92: install] Error 2


*Makefile Build Failed #4:
OS: FreeBSD1201-64
Target: x86_64-native-bsdapp-gcc+shared
  CC eal_interrupts.o
  CC eal_timer.o
/root/FreeBSD1201-64_K12.1_GCC7.3.0/x86_64-native-bsdapp-gcc+shared/3999f354db0243f6ab28f98f44074649/dpdk/lib/librte_eal/freebsd/eal.c: In function 'eal_check_mem_on_local_socket':
/root/FreeBSD1201-64_K12.1_GCC7.3.0/x86_64-native-bsdapp-gcc+shared/3999f354db0243f6ab28f98f44074649/dpdk/lib/librte_eal/freebsd/eal.c:625:1: error: version control conflict marker in file
  625 | <<<<<<< HEAD
      | ^~~~~~~
/root/FreeBSD1201-64_K12.1_GCC7.3.0/x86_64-native-bsdapp-gcc+shared/3999f354db0243f6ab28f98f44074649/dpdk/lib/librte_eal/freebsd/eal.c:627:1: error: version control conflict marker in file
  627 | =======
      | ^~~~~~~
/root/FreeBSD1201-64_K12.1_GCC7.3.0/x86_64-native-bsdapp-gcc+shared/3999f354db0243f6ab28f98f44074649/dpdk/lib/librte_eal/freebsd/eal.c:629:1: error: version control conflict marker in file
  629 | >>>>>>> 28604a3e5a3a... eal: rename terms used for DPDK lcores
      | ^~~~~~~
/root/FreeBSD1201-64_K12.1_GCC7.3.0/x86_64-native-bsdapp-gcc+shared/3999f354db0243f6ab28f98f44074649/dpdk/lib/librte_eal/freebsd/eal.c:629:9: error: invalid suffix "a3e5a3a..." on integer constant
  629 | >>>>>>> 28604a3e5a3a... eal: rename terms used for DPDK lcores
      |         ^~~~~~~~~~~~~~~
/root/FreeBSD1201-64_K12.1_GCC7.3.0/x86_64-native-bsdapp-gcc+shared/3999f354db0243f6ab28f98f44074649/dpdk/lib/librte_eal/freebsd/eal.c:623:27: warning: unused variable 'config' [-Wunused-variable]
--
  622 |  int socket_id;
      |      ^~~~~~~~~
/root/FreeBSD1201-64_K12.1_GCC7.3.0/x86_64-native-bsdapp-gcc+shared/3999f354db0243f6ab28f98f44074649/dpdk/lib/librte_eal/freebsd/eal.c: In function 'rte_eal_init':
/root/FreeBSD1201-64_K12.1_GCC7.3.0/x86_64-native-bsdapp-gcc+shared/3999f354db0243f6ab28f98f44074649/dpdk/lib/librte_eal/freebsd/eal.c:852:1: error: version control conflict marker in file
  852 | <<<<<<< HEAD
      | ^~~~~~~
/root/FreeBSD1201-64_K12.1_GCC7.3.0/x86_64-native-bsdapp-gcc+shared/3999f354db0243f6ab28f98f44074649/dpdk/lib/librte_eal/freebsd/eal.c:1079: error: unterminated argument list invoking macro "RTE_LOG"
 1079 | }
      | 
/root/FreeBSD1201-64_K12.1_GCC7.3.0/x86_64-native-bsdapp-gcc+shared/3999f354db0243f6ab28f98f44074649/dpdk/lib/librte_eal/freebsd/eal.c:857:2: error: 'RTE_LOG' undeclared (first use in this function)
  857 |  RTE_LOG(DEBUG, EAL, "Master lcore %u is ready (tid=%p;cpuset=[%s%s])\n",
      |  ^~~~~~~
/root/FreeBSD1201-64_K12.1_GCC7.3.0/x86_64-native-bsdapp-gcc+shared/3999f354db0243f6ab28f98f44074649/dpdk/lib/librte_eal/freebsd/eal.c:857:2: note: each undeclared identifier is reported only once for each function it appears in
/root/FreeBSD1201-64_K12.1_GCC7.3.0/x86_64-native-bsdapp-gcc+shared/3999f354db0243f6ab28f98f44074649/dpdk/lib/librte_eal/freebsd/eal.c:857:9: error: expected ';' at end of input
  857 |  RTE_LOG(DEBUG, EAL, "Master lcore %u is ready (tid=%p;cpuset=[%s%s])\n",
      |         ^
      |         ;
--
/root/FreeBSD1201-64_K12.1_GCC7.3.0/x86_64-native-bsdapp-gcc+shared/3999f354db0243f6ab28f98f44074649/dpdk/lib/librte_eal/freebsd/eal_thread.c:86:6: warning: no previous prototype for 'eal_thread_set_initial_lcore' [-Wmissing-prototypes]
   86 | void eal_thread_set_initial_lcore(unsigned lcore_id)
      |      ^~~~~~~~~~~~~~~~~~~~~~~~~~~~
/root/FreeBSD1201-64_K12.1_GCC7.3.0/x86_64-native-bsdapp-gcc+shared/3999f354db0243f6ab28f98f44074649/dpdk/lib/librte_eal/freebsd/eal.c:857:2: error: expected declaration or statement at end of input
  857 |  RTE_LOG(DEBUG, EAL, "Master lcore %u is ready (tid=%p;cpuset=[%s%s])\n",
      |  ^~~~~~~
/root/FreeBSD1201-64_K12.1_GCC7.3.0/x86_64-native-bsdapp-gcc+shared/3999f354db0243f6ab28f98f44074649/dpdk/lib/librte_eal/freebsd/eal.c:671:27: warning: unused variable 'config' [-Wunused-variable]
--
/root/FreeBSD1201-64_K12.1_GCC7.3.0/x86_64-native-bsdapp-gcc+shared/3999f354db0243f6ab28f98f44074649/dpdk/lib/librte_eal/freebsd/eal.c:606:1: warning: 'check_socket' defined but not used [-Wunused-function]
  606 | check_socket(const struct rte_memseg_list *msl, void *arg)
      | ^~~~~~~~~~~~
gmake[6]: *** [/root/FreeBSD1201-64_K12.1_GCC7.3.0/x86_64-native-bsdapp-gcc+shared/3999f354db0243f6ab28f98f44074649/dpdk/mk/internal/rte.compile-pre.mk:116: eal.o] Error 1
gmake[6]: *** Waiting for unfinished jobs....
gmake[5]: *** [/root/FreeBSD1201-64_K12.1_GCC7.3.0/x86_64-native-bsdapp-gcc+shared/3999f354db0243f6ab28f98f44074649/dpdk/mk/rte.subdir.mk:37: freebsd] Error 2
gmake[4]: *** [/root/FreeBSD1201-64_K12.1_GCC7.3.0/x86_64-native-bsdapp-gcc+shared/3999f354db0243f6ab28f98f44074649/dpdk/mk/rte.subdir.mk:37: librte_eal] Error 2
gmake[3]: *** [/root/FreeBSD1201-64_K12.1_GCC7.3.0/x86_64-native-bsdapp-gcc+shared/3999f354db0243f6ab28f98f44074649/dpdk/mk/rte.sdkbuild.mk:53: lib] Error 2
gmake[2]: *** [/root/FreeBSD1201-64_K12.1_GCC7.3.0/x86_64-native-bsdapp-gcc+shared/3999f354db0243f6ab28f98f44074649/dpdk/mk/rte.sdkroot.mk:115: all] Error 2
gmake[1]: *** [/root/FreeBSD1201-64_K12.1_GCC7.3.0/x86_64-native-bsdapp-gcc+shared/3999f354db0243f6ab28f98f44074649/dpdk/mk/rte.sdkinstall.mk:61: pre_install] Error 2
gmake: *** [/root/FreeBSD1201-64_K12.1_GCC7.3.0/x86_64-native-bsdapp-gcc+shared/3999f354db0243f6ab28f98f44074649/dpdk/mk/rte.sdkroot.mk:92: install] Error 2


*Makefile Build Failed #5:
OS: FreeBSD1201-64
Target: x86_64-native-bsdapp-gcc+debug
  CC eal_lcore.o
  CC eal_timer.o
/root/FreeBSD1201-64_K12.1_GCC7.3.0/x86_64-native-bsdapp-gcc+debug/3999f354db0243f6ab28f98f44074649/dpdk/lib/librte_eal/freebsd/eal.c: In function 'eal_check_mem_on_local_socket':
/root/FreeBSD1201-64_K12.1_GCC7.3.0/x86_64-native-bsdapp-gcc+debug/3999f354db0243f6ab28f98f44074649/dpdk/lib/librte_eal/freebsd/eal.c:625:1: error: version control conflict marker in file
  625 | <<<<<<< HEAD
      | ^~~~~~~
  CC eal_interrupts.o
/root/FreeBSD1201-64_K12.1_GCC7.3.0/x86_64-native-bsdapp-gcc+debug/3999f354db0243f6ab28f98f44074649/dpdk/lib/librte_eal/freebsd/eal.c:627:1: error: version control conflict marker in file
  627 | =======
      | ^~~~~~~
/root/FreeBSD1201-64_K12.1_GCC7.3.0/x86_64-native-bsdapp-gcc+debug/3999f354db0243f6ab28f98f44074649/dpdk/lib/librte_eal/freebsd/eal.c:629:1: error: version control conflict marker in file
  629 | >>>>>>> 28604a3e5a3a... eal: rename terms used for DPDK lcores
      | ^~~~~~~
/root/FreeBSD1201-64_K12.1_GCC7.3.0/x86_64-native-bsdapp-gcc+debug/3999f354db0243f6ab28f98f44074649/dpdk/lib/librte_eal/freebsd/eal.c:629:9: error: invalid suffix "a3e5a3a..." on integer constant
  629 | >>>>>>> 28604a3e5a3a... eal: rename terms used for DPDK lcores
      |         ^~~~~~~~~~~~~~~
/root/FreeBSD1201-64_K12.1_GCC7.3.0/x86_64-native-bsdapp-gcc+debug/3999f354db0243f6ab28f98f44074649/dpdk/lib/librte_eal/freebsd/eal.c:623:27: warning: unused variable 'config' [-Wunused-variable]
--
  622 |  int socket_id;
      |      ^~~~~~~~~
/root/FreeBSD1201-64_K12.1_GCC7.3.0/x86_64-native-bsdapp-gcc+debug/3999f354db0243f6ab28f98f44074649/dpdk/lib/librte_eal/freebsd/eal.c: In function 'rte_eal_init':
/root/FreeBSD1201-64_K12.1_GCC7.3.0/x86_64-native-bsdapp-gcc+debug/3999f354db0243f6ab28f98f44074649/dpdk/lib/librte_eal/freebsd/eal.c:852:1: error: version control conflict marker in file
  852 | <<<<<<< HEAD
      | ^~~~~~~
/root/FreeBSD1201-64_K12.1_GCC7.3.0/x86_64-native-bsdapp-gcc+debug/3999f354db0243f6ab28f98f44074649/dpdk/lib/librte_eal/freebsd/eal.c:1079: error: unterminated argument list invoking macro "RTE_LOG"
 1079 | }
      | 
/root/FreeBSD1201-64_K12.1_GCC7.3.0/x86_64-native-bsdapp-gcc+debug/3999f354db0243f6ab28f98f44074649/dpdk/lib/librte_eal/freebsd/eal.c:857:2: error: 'RTE_LOG' undeclared (first use in this function)
  857 |  RTE_LOG(DEBUG, EAL, "Master lcore %u is ready (tid=%p;cpuset=[%s%s])\n",
      |  ^~~~~~~
/root/FreeBSD1201-64_K12.1_GCC7.3.0/x86_64-native-bsdapp-gcc+debug/3999f354db0243f6ab28f98f44074649/dpdk/lib/librte_eal/freebsd/eal.c:857:2: note: each undeclared identifier is reported only once for each function it appears in
/root/FreeBSD1201-64_K12.1_GCC7.3.0/x86_64-native-bsdapp-gcc+debug/3999f354db0243f6ab28f98f44074649/dpdk/lib/librte_eal/freebsd/eal.c:857:9: error: expected ';' at end of input
  857 |  RTE_LOG(DEBUG, EAL, "Master lcore %u is ready (tid=%p;cpuset=[%s%s])\n",
      |         ^
      |         ;
......
 1079 | }
      |          
/root/FreeBSD1201-64_K12.1_GCC7.3.0/x86_64-native-bsdapp-gcc+debug/3999f354db0243f6ab28f98f44074649/dpdk/lib/librte_eal/freebsd/eal.c:857:2: error: expected declaration or statement at end of input
  857 |  RTE_LOG(DEBUG, EAL, "Master lcore %u is ready (tid=%p;cpuset=[%s%s])\n",
      |  ^~~~~~~
/root/FreeBSD1201-64_K12.1_GCC7.3.0/x86_64-native-bsdapp-gcc+debug/3999f354db0243f6ab28f98f44074649/dpdk/lib/librte_eal/freebsd/eal.c:671:27: warning: unused variable 'config' [-Wunused-variable]
--
/root/FreeBSD1201-64_K12.1_GCC7.3.0/x86_64-native-bsdapp-gcc+debug/3999f354db0243f6ab28f98f44074649/dpdk/lib/librte_eal/freebsd/eal.c:606:1: warning: 'check_socket' defined but not used [-Wunused-function]
  606 | check_socket(const struct rte_memseg_list *msl, void *arg)
      | ^~~~~~~~~~~~
gmake[6]: *** [/root/FreeBSD1201-64_K12.1_GCC7.3.0/x86_64-native-bsdapp-gcc+debug/3999f354db0243f6ab28f98f44074649/dpdk/mk/internal/rte.compile-pre.mk:116: eal.o] Error 1
gmake[6]: *** Waiting for unfinished jobs....
/root/FreeBSD1201-64_K12.1_GCC7.3.0/x86_64-native-bsdapp-gcc+debug/3999f354db0243f6ab28f98f44074649/dpdk/lib/librte_eal/freebsd/eal_thread.c:86:6: warning: no previous prototype for 'eal_thread_set_initial_lcore' [-Wmissing-prototypes]
   86 | void eal_thread_set_initial_lcore(unsigned lcore_id)
      |      ^~~~~~~~~~~~~~~~~~~~~~~~~~~~
gmake[5]: *** [/root/FreeBSD1201-64_K12.1_GCC7.3.0/x86_64-native-bsdapp-gcc+debug/3999f354db0243f6ab28f98f44074649/dpdk/mk/rte.subdir.mk:37: freebsd] Error 2
gmake[4]: *** [/root/FreeBSD1201-64_K12.1_GCC7.3.0/x86_64-native-bsdapp-gcc+debug/3999f354db0243f6ab28f98f44074649/dpdk/mk/rte.subdir.mk:37: librte_eal] Error 2
gmake[3]: *** [/root/FreeBSD1201-64_K12.1_GCC7.3.0/x86_64-native-bsdapp-gcc+debug/3999f354db0243f6ab28f98f44074649/dpdk/mk/rte.sdkbuild.mk:53: lib] Error 2
gmake[2]: *** [/root/FreeBSD1201-64_K12.1_GCC7.3.0/x86_64-native-bsdapp-gcc+debug/3999f354db0243f6ab28f98f44074649/dpdk/mk/rte.sdkroot.mk:115: all] Error 2
gmake[1]: *** [/root/FreeBSD1201-64_K12.1_GCC7.3.0/x86_64-native-bsdapp-gcc+debug/3999f354db0243f6ab28f98f44074649/dpdk/mk/rte.sdkinstall.mk:61: pre_install] Error 2
gmake: *** [/root/FreeBSD1201-64_K12.1_GCC7.3.0/x86_64-native-bsdapp-gcc+debug/3999f354db0243f6ab28f98f44074649/dpdk/mk/rte.sdkroot.mk:92: install] Error 2


*Makefile Build Failed #6:
OS: UB2004-32
Target: i686-native-linuxapp-gcc
  CC eal_common_launch.o
  CC eal_common_dynmem.o
/root/UB2004-32_K4.15.0_GCC9.3.0/i686-native-linuxapp-gcc/3999f354db0243f6ab28f98f44074649/dpdk/lib/librte_eal/common/eal_common_dynmem.c: In function ‘eal_dynmem_calc_num_pages_per_socket’:
/root/UB2004-32_K4.15.0_GCC9.3.0/i686-native-linuxapp-gcc/3999f354db0243f6ab28f98f44074649/dpdk/lib/librte_eal/common/eal_common_dynmem.c:440:31: error: ‘struct rte_config’ has no member named ‘master_lcore’
  440 |     rte_lcore_to_socket_id(cfg->master_lcore);
      |                               ^~
make[6]: *** [/root/UB2004-32_K4.15.0_GCC9.3.0/i686-native-linuxapp-gcc/3999f354db0243f6ab28f98f44074649/dpdk/mk/internal/rte.compile-pre.mk:116: eal_common_dynmem.o] Error 1
make[6]: *** Waiting for unfinished jobs....
make[5]: *** [/root/UB2004-32_K4.15.0_GCC9.3.0/i686-native-linuxapp-gcc/3999f354db0243f6ab28f98f44074649/dpdk/mk/rte.subdir.mk:37: linux] Error 2
make[4]: *** [/root/UB2004-32_K4.15.0_GCC9.3.0/i686-native-linuxapp-gcc/3999f354db0243f6ab28f98f44074649/dpdk/mk/rte.subdir.mk:37: librte_eal] Error 2
make[3]: *** [/root/UB2004-32_K4.15.0_GCC9.3.0/i686-native-linuxapp-gcc/3999f354db0243f6ab28f98f44074649/dpdk/mk/rte.sdkbuild.mk:53: lib] Error 2
make[2]: *** [/root/UB2004-32_K4.15.0_GCC9.3.0/i686-native-linuxapp-gcc/3999f354db0243f6ab28f98f44074649/dpdk/mk/rte.sdkroot.mk:115: all] Error 2
make[1]: *** [/root/UB2004-32_K4.15.0_GCC9.3.0/i686-native-linuxapp-gcc/3999f354db0243f6ab28f98f44074649/dpdk/mk/rte.sdkinstall.mk:61: pre_install] Error 2
make: *** [/root/UB2004-32_K4.15.0_GCC9.3.0/i686-native-linuxapp-gcc/3999f354db0243f6ab28f98f44074649/dpdk/mk/rte.sdkroot.mk:92: install] Error 2


*Makefile Build Failed #7:
OS: UB2004-64
Target: x86_64-native-linuxapp-icc
  MKRES test_resource_c.res.o
icc: error #10106: Fatal error in /opt/intel/compilers_and_libraries_2020.1.217/linux/bin/intel64/mcpcom, terminated by kill signal
compilation aborted for /root/UB2004-64_K5.4.0_ICC19.1.0/x86_64-native-linuxapp-icc/3999f354db0243f6ab28f98f44074649/dpdk/app/test/test_ring.c (code 1)
make[5]: *** [/root/UB2004-64_K5.4.0_ICC19.1.0/x86_64-native-linuxapp-icc/3999f354db0243f6ab28f98f44074649/dpdk/mk/internal/rte.compile-pre.mk:114: test_ring.o] Error 1
make[5]: *** Waiting for unfinished jobs....
make[4]: *** [/root/UB2004-64_K5.4.0_ICC19.1.0/x86_64-native-linuxapp-icc/3999f354db0243f6ab28f98f44074649/dpdk/mk/rte.subdir.mk:35: test] Error 2
make[3]: *** [/root/UB2004-64_K5.4.0_ICC19.1.0/x86_64-native-linuxapp-icc/3999f354db0243f6ab28f98f44074649/dpdk/mk/rte.sdkbuild.mk:53: app] Error 2
make[2]: *** [/root/UB2004-64_K5.4.0_ICC19.1.0/x86_64-native-linuxapp-icc/3999f354db0243f6ab28f98f44074649/dpdk/mk/rte.sdkroot.mk:115: all] Error 2
make[1]: *** [/root/UB2004-64_K5.4.0_ICC19.1.0/x86_64-native-linuxapp-icc/3999f354db0243f6ab28f98f44074649/dpdk/mk/rte.sdkinstall.mk:61: pre_install] Error 2
make: *** [/root/UB2004-64_K5.4.0_ICC19.1.0/x86_64-native-linuxapp-icc/3999f354db0243f6ab28f98f44074649/dpdk/mk/rte.sdkroot.mk:92: install] Error 2
DPDK STV team

^ permalink raw reply	[flat|nested] only message in thread

only message in thread, other threads:[~2020-07-02  0:51 UTC | newest]

Thread overview: (only message) (download: mbox.gz / follow: Atom feed)
-- links below jump to the message on this page --
2020-07-02  0:51 [dpdk-test-report] |FAILURE| pw(72641) [v3, 04/27] librte_power: change reference to rte_master_lcore sys_stv

automatic DPDK test reports

This inbox may be cloned and mirrored by anyone:

	git clone --mirror https://inbox.dpdk.org/test-report/0 test-report/git/0.git

	# If you have public-inbox 1.1+ installed, you may
	# initialize and index your mirror using the following commands:
	public-inbox-init -V2 test-report test-report/ https://inbox.dpdk.org/test-report \
		test-report@dpdk.org
	public-inbox-index test-report

Example config snippet for mirrors.
Newsgroup available over NNTP:
	nntp://inbox.dpdk.org/inbox.dpdk.test-report


AGPL code for this site: git clone https://public-inbox.org/public-inbox.git