automatic DPDK test reports
 help / color / mirror / Atom feed
From: sys_stv@intel.com
To: test-report@dpdk.org
Subject: [dpdk-test-report]  |FAILURE| pw(73630) [v3, 1/2] Fix build of apps with external dependencies
Date: 10 Jul 2020 21:32:53 -0700
Message-ID: <fecc85$amqogv@orsmga001.jf.intel.com> (raw)

[-- Attachment #1: Type: text/plain, Size: 16903 bytes --]


Test-Label: Intel-compilation
Test-Status: FAILURE
http://dpdk.org/patch/73630

_Compilation issues_

Submitter: Felix Moessbauer <felix.moessbauer@siemens.com>
Date: 2020-07-09 09:27:10
Reply_mail: 20200709092711.14900-2-felix.moessbauer@siemens.com

DPDK git baseline: Repo:dpdk, CommitID: 2d6ed071a8b93ead509ff26914bdb8938efd7543


Meson build Summary: 8 Builds Done, 7 Successful, 1 Failures, 0 Blocked

Makefile build Summary: 20 Builds Done, 20 Successful, 0 Failures, 0 Blocked

                +==============================================+===========+==========+
                |                   Makefile                   |   Meson   | Document |
+----------------+------+-------+------+------------+-----------+-----------+----------+
| os             | gcc  | clang | icc  | gcc+shared | gcc+debug | gcc/clang | pdf/html |
+----------------+------+-------+------+------------+-----------+-----------+----------+
| CENTOS82-64    | pass | pass  | pass | pass       | pass      | pass      |          |
| RHEL82-64      | pass |       |      |            |           |           |          |
| UB1804-64      | pass |       |      |            |           |           |          |
| FC32-64        | pass | pass  |      |            |           | FAIL      |          |
| CENTOS77-64    | pass |       |      |            |           |           |          |
| UB2004-64      | pass | pass  | pass |            |           | pass      | pass     |
| WIN10-64       |      |       |      |            |           | pass      |          |
| UB2004-32      | pass |       |      |            |           |           |          |
| UB1804-32      |      |       |      |            |           | pass      |          |
| FreeBSD1201-64 | pass | pass  |      | pass       | pass      | pass      |          |
| SUSE15-64      | pass | pass  |      |            |           | pass      |          |
+----------------+------+-------+------+------------+-----------+-----------+----------+
Test environment and configuration as below:

** Makefile build **


OS: CENTOS82-64
	Kernel Version: 4.18.0-193.el8.x86_64
	CPU info: Intel(R) Xeon(R) Platinum 8280M CPU @ 2.70GHz
	GCC Version: gcc (GCC) 8.3.1 20191121 (Red Hat 8.3.1-5)
	Clang Version: 9.0.1 (Red Hat 9.0.1-2.module_el8.2.0+309+0c7b6b03)
	x86_64-native-linuxapp-gcc
	x86_64-native-linuxapp-clang
	x86_64-native-linuxapp-icc
	x86_64-native-linuxapp-gcc+shared
	x86_64-native-linuxapp-gcc+debug


OS: RHEL82-64
	Kernel Version: 4.18.0-193.el8.x86_64
	CPU info: Intel(R) Xeon(R) Platinum 8280M CPU @ 2.70GHz
	GCC Version: gcc (GCC) 8.3.1 20191121 (Red Hat 8.3.1-5)
	Clang Version: 8.0.1 (Red Hat 8.0.1-1.module_el8.1.0+215+a01033fb)
	x86_64-native-linuxapp-gcc


OS: UB1804-64
	Kernel Version: 4.15.0-29-generic
	CPU info: Intel(R) Xeon(R) Platinum 8180 CPU @ 2.50GHz
	GCC Version: gcc (Ubuntu 7.5.0-3ubuntu1~18.04) 7.5.0
	Clang Version: 6.0.0-1ubuntu2 (tags/RELEASE_600/final)
	x86_64-native-linuxapp-gcc


OS: FC32-64
	Kernel Version: 5.6.0-0.rc7.git0.2.fc32.x86_64
	CPU info: Intel(R) Xeon(R) Platinum 8280M CPU @ 2.70GHz
	GCC Version: gcc (GCC) 10.0.1 20200311 (Red Hat 10.0.1-0.9)
	Clang Version: 10.0.0 (Fedora 10.0.0-0.3.rc4.fc32)
	x86_64-native-linuxapp-gcc
	x86_64-native-linuxapp-clang


OS: CENTOS77-64
	Kernel Version: 3.10.0-1062.9.1.el7.x86_64
	CPU info: Intel(R) Xeon(R) Platinum 8280M CPU @ 2.70GHz
	GCC Version: gcc (GCC) 4.8.5 20150623 (Red Hat 4.8.5-39)
	Clang Version: 3.4.2 (tags/RELEASE_34/dot2-final)
	x86_64-native-linuxapp-gcc


OS: UB2004-64
	Kernel Version: 5.4.0-26-generic
	CPU info: Intel(R) Xeon(R) Platinum 8180 CPU @ 2.50GHz
	GCC Version: gcc (Ubuntu 10-20200416-0ubuntu1) 10.0.1 20200416 (experimental) [master revision 3c3f12e2a76:dcee354ce56:44b326839d864fc10c459916abcc97f35a9ac3de]
	Clang Version: 10.0.0-4ubuntu1
	x86_64-native-linuxapp-clang
	x86_64-native-linuxapp-gcc
	x86_64-native-linuxapp-icc


OS: UB2004-32
	Kernel Version: 5.4.0-26-generic
	CPU info: Intel(R) Xeon(R) Platinum 8180 CPU @ 2.50GHz
	GCC Version: gcc (Ubuntu 9.3.0-10ubuntu2) 9.3.0
	Clang Version: 10.0.0-4ubuntu1
	i686-native-linuxapp-gcc


OS: FreeBSD1201-64
	Kernel Version: 12.1-RELEASE
	CPU info: Intel(R) Xeon(R) CPU E5-2699 v3 @ 2.30GHz (2294.74-MHz K8-class CPU)
	GCC Version: gcc (FreeBSD Ports Collection) 9.2.0
	Clang Version: 8.0.1 (tags/RELEASE_801/final 366581) (based on LLVM 8.0.1)
	x86_64-native-bsdapp-gcc
	x86_64-native-bsdapp-clang
	x86_64-native-bsdapp-gcc+shared
	x86_64-native-bsdapp-gcc+debug


OS: SUSE15-64
	Kernel Version: 4.12.14-lp150.11-default
	CPU info: Intel(R) Xeon(R) CPU E5-2699 v4 @ 2.20GHz
	GCC Version: gcc (SUSE Linux) 7.3.1 20180323 [gcc-7-branch revision 258812]
	Clang Version: 5.0.1 (tags/RELEASE_501/final 312548)
	x86_64-native-linuxapp-clang
	x86_64-native-linuxapp-gcc

** Meson build **


OS: CENTOS82-64
	Kernel Version: 4.18.0-193.el8.x86_64
	CPU info: Intel(R) Xeon(R) CPU E5-2699 v4 @ 2.20GHz
	GCC Version: gcc (GCC) 8.3.1 20191121 (Red Hat 8.3.1-5)
	Clang Version: 9.0.1 (Red Hat 9.0.1-2.module_el8.2.0+309+0c7b6b03)
	./build-gcc-static
	./build-gcc-shared
	./build-clang-static
	./build-clang-shared
	./build-x86-default


OS: UB2004-64
	Kernel Version: 5.4.0-26-generic
	CPU info: Intel(R) Xeon(R) Platinum 8180 CPU @ 2.50GHz
	GCC Version: gcc (Ubuntu 9.3.0-10ubuntu2) 9.3.0
	Clang Version: 10.0.0-4ubuntu1
	x86_64-native-linuxapp-doc
	./build-gcc-static
	./build-gcc-shared
	./build-clang-static
	./build-clang-shared
	./build-x86-default


OS: FC32-64
	Kernel Version: 5.6.0-0.rc7.git0.2.fc32.x86_64
	CPU info: Intel(R) Xeon(R) CPU E5-2699 v4 @ 2.20GHz
	GCC Version: gcc (GCC) 10.0.1 20200311 (Red Hat 10.0.1-0.9)
	Clang Version: 10.0.0 (Fedora 10.0.0-0.3.rc4.fc32)
	./build-gcc-static
	./build-gcc-shared
	./build-clang-static
	./build-clang-shared
	./build-x86-default


OS: WIN10-64
	Kernel Version: N/A
	CPU info: N/A
	GCC Version: N/A
	Clang Version: Clang 8.0.0
	x86_64-windows-clang


OS: UB1804-32
	Kernel Version: 4.15.0-20-generic
	CPU info: Intel(R) Xeon(R) CPU E5-2699 v4 @ 2.20GHz
	GCC Version: gcc (Ubuntu 7.5.0-3ubuntu1~18.04) 7.5.0
	Clang Version: 6.0.0-1ubuntu2 (tags/RELEASE_600/final)
	./build-gcc-static
	./build-gcc-shared
	./build-clang-static
	./build-clang-shared
	./build-x86-default


OS: FreeBSD1201-64
	Kernel Version: 12.1-RELEASE
	CPU info: Intel(R) Xeon(R) CPU E5-2699 v4 @ 2.20GHz (2194.97-MHz K8-class CPU)
	GCC Version: gcc (FreeBSD Ports Collection) 9.2.0
	Clang Version: 8.0.1 (tags/RELEASE_801/final 366581) (based on LLVM 8.0.1)
	./build-gcc-static
	./build-gcc-shared
	./build-clang-static
	./build-clang-shared
	./build-x86-default


OS: SUSE15-64
	Kernel Version: 4.12.14-lp150.12.82-default
	CPU info: Intel(R) Xeon(R) CPU E5-2699 v4 @ 2.20GHz
	GCC Version: gcc (SUSE Linux) 7.4.1 20190905 [gcc-7-branch revision 275407]
	Clang Version: 5.0.1 (tags/RELEASE_501/final 312548)
	./build-gcc-static
	./build-gcc-shared
	./build-clang-static
	./build-clang-shared
	./build-x86-default



*Meson Build Failed #1:
OS: FC32-64
Target:./build-gcc-static
FAILED: app/dpdk-l2reflect 
gcc  -o app/dpdk-l2reflect 'app/a172ced@@dpdk-l2reflect@exe/l2reflect_main.c.o' 'app/a172ced@@dpdk-l2reflect@exe/l2reflect_stats.c.o' -Wl,--as-needed -Wl,--no-undefined -Wl,--whole-archive -Wl,--start-group lib/librte_node.a lib/librte_graph.a lib/librte_bpf.a lib/librte_flow_classify.a lib/librte_pipeline.a lib/librte_table.a lib/librte_port.a lib/librte_fib.a lib/librte_ipsec.a lib/librte_vhost.a lib/librte_stack.a lib/librte_security.a lib/librte_sched.a lib/librte_reorder.a lib/librte_rib.a lib/librte_regexdev.a lib/librte_rawdev.a lib/librte_pdump.a lib/librte_power.a lib/librte_member.a lib/librte_lpm.a lib/librte_latencystats.a lib/librte_kni.a lib/librte_jobstats.a lib/librte_ip_frag.a lib/librte_gso.a lib/librte_gro.a lib/librte_eventdev.a lib/librte_efd.a lib/librte_distributor.a lib/librte_cryptodev.a lib/librte_compressdev.a lib/librte_cfgfile.a lib/librte_bitratestats.a lib/librte_bbdev.a lib/librte_acl.a lib/librte_timer.a lib/librte_hash.a lib/librte_metrics.a lib/librte_cmdline.a lib/librte_pci.a lib/librte_ethdev.a lib/librte_meter.a lib/librte_net.a lib/librte_mbuf.a lib/librte_mempool.a lib/librte_rcu.a lib/librte_ring.a lib/librte_eal.a lib/librte_telemetry.a lib/librte_kvargs.a drivers/librte_common_cpt.a drivers/librte_common_dpaax.a drivers/librte_common_iavf.a drivers/librte_common_octeontx.a drivers/librte_common_octeontx2.a drivers/librte_bus_dpaa.a drivers/librte_bus_fslmc.a drivers/librte_bus_ifpga.a drivers/librte_bus_pci.a drivers/librte_bus_vdev.a drivers/librte_bus_vmbus.a drivers/librte_mempool_bucket.a drivers/librte_mempool_dpaa.a drivers/librte_mempool_dpaa2.a drivers/librte_mempool_octeontx.a drivers/librte_mempool_octeontx2.a drivers/librte_mempool_ring.a drivers/librte_mempool_stack.a drivers/librte_pmd_af_packet.a drivers/librte_pmd_ark.a drivers/librte_pmd_atlantic.a drivers/librte_pmd_avp.a drivers/librte_pmd_axgbe.a drivers/librte_pmd_bond.a drivers/librte_pmd_bnx2x.a drivers/librte_pmd_bnxt.a drivers/librte_pmd_cxgbe.a drivers/librte_pmd_dpaa.a drivers/librte_pmd_dpaa2.a drivers/librte_pmd_e1000.a drivers/librte_pmd_ena.a drivers/librte_pmd_enetc.a drivers/librte_pmd_enic.a drivers/librte_pmd_failsafe.a drivers/librte_pmd_fm10k.a drivers/librte_pmd_i40e.a drivers/librte_pmd_hinic.a drivers/librte_pmd_hns3.a drivers/librte_pmd_iavf.a drivers/librte_pmd_ice.a drivers/librte_pmd_igc.a drivers/librte_pmd_ixgbe.a drivers/librte_pmd_kni.a drivers/librte_pmd_liquidio.a drivers/librte_pmd_memif.a drivers/librte_pmd_netvsc.a drivers/librte_pmd_nfp.a drivers/librte_pmd_null.a drivers/librte_pmd_octeontx.a drivers/librte_pmd_octeontx2.a drivers/librte_pmd_pcap.a drivers/librte_pmd_pfe.a drivers/librte_pmd_qede.a drivers/librte_pmd_ring.a drivers/librte_pmd_sfc.a drivers/librte_pmd_softnic.a drivers/librte_pmd_tap.a drivers/librte_pmd_thunderx.a drivers/librte_pmd_vdev_netvsc.a drivers/librte_pmd_vhost.a drivers/librte_pmd_virtio.a drivers/librte_pmd_vmxnet3.a drivers/librte_rawdev_dpaa2_cmdif.a drivers/librte_rawdev_dpaa2_qdma.a drivers/librte_rawdev_ioat.a drivers/librte_rawdev_ntb.a drivers/librte_rawdev_octeontx2_dma.a drivers/librte_rawdev_octeontx2_ep.a drivers/librte_rawdev_skeleton.a drivers/librte_pmd_aesni_gcm.a drivers/librte_pmd_aesni_mb.a drivers/librte_pmd_caam_jr.a drivers/librte_pmd_ccp.a drivers/librte_pmd_dpaa_sec.a drivers/librte_pmd_dpaa2_sec.a drivers/librte_pmd_kasumi.a drivers/librte_pmd_nitrox.a drivers/librte_pmd_null_crypto.a drivers/librte_pmd_octeontx_crypto.a drivers/librte_pmd_octeontx2_crypto.a drivers/librte_pmd_openssl.a drivers/librte_pmd_crypto_scheduler.a drivers/librte_pmd_snow3g.a drivers/librte_pmd_virtio_crypto.a drivers/librte_pmd_zuc.a drivers/librte_pmd_isal.a drivers/librte_pmd_octeontx_compress.a drivers/librte_pmd_qat.a drivers/librte_pmd_zlib.a drivers/librte_pmd_ifc.a drivers/librte_pmd_dpaa_event.a drivers/librte_pmd_dpaa2_event.a drivers/librte_pmd_octeontx2_event.a drivers/librte_pmd_opdl_event.a drivers/librte_pmd_skeleton_event.a drivers/librte_pmd_sw_event.a drivers/librte_pmd_dsw_event.a drivers/librte_pmd_octeontx_event.a drivers/librte_pmd_bbdev_null.a drivers/librte_pmd_bbdev_turbo_sw.a drivers/librte_pmd_bbdev_fpga_lte_fec.a drivers/librte_pmd_bbdev_fpga_5gnr_fec.a -Wl,--no-whole-archive -Wl,--no-as-needed -pthread -lm -ldl -lnuma -lpcap -lpcap -lpcap -lpcap /usr/lib64/libz.so -lpcap -lpcap -lIPSec_MB -lIPSec_MB /usr/lib64/libcrypto.so -lIPSec_MB -lIPSec_MB -lIPSec_MB /usr/lib64/libisal.so -Wl,--end-group -Wl,-rpath,XXXXXXXXXXXXXXXXXXXXXXXXXXXXXXXXX
/usr/bin/ld: app/a172ced@@dpdk-l2reflect@exe/l2reflect_stats.c.o:/root/FC32-64_K5.6.0_GCC10.0.1/x86_64-native-linuxapp-gcc/2f5636ece3394911a7b114cb24567e8d/dpdk/build-gcc-static/../app/l2reflect/l2reflect.h:45: multiple definition of `l2reflect_hist'; app/a172ced@@dpdk-l2reflect@exe/l2reflect_main.c.o:/root/FC32-64_K5.6.0_GCC10.0.1/x86_64-native-linuxapp-gcc/2f5636ece3394911a7b114cb24567e8d/dpdk/build-gcc-static/../app/l2reflect/l2reflect.h:45: first defined here
/usr/bin/ld: app/a172ced@@dpdk-l2reflect@exe/l2reflect_stats.c.o:/root/FC32-64_K5.6.0_GCC10.0.1/x86_64-native-linuxapp-gcc/2f5636ece3394911a7b114cb24567e8d/dpdk/build-gcc-static/../app/l2reflect/stats.h:38: multiple definition of `record'; app/a172ced@@dpdk-l2reflect@exe/l2reflect_main.c.o:/root/FC32-64_K5.6.0_GCC10.0.1/x86_64-native-linuxapp-gcc/2f5636ece3394911a7b114cb24567e8d/dpdk/build-gcc-static/../app/l2reflect/stats.h:38: first defined here
/usr/bin/ld: app/a172ced@@dpdk-l2reflect@exe/l2reflect_stats.c.o:/root/FC32-64_K5.6.0_GCC10.0.1/x86_64-native-linuxapp-gcc/2f5636ece3394911a7b114cb24567e8d/dpdk/build-gcc-static/../app/l2reflect/stats.h:39: multiple definition of `hist_filename'; app/a172ced@@dpdk-l2reflect@exe/l2reflect_main.c.o:/root/FC32-64_K5.6.0_GCC10.0.1/x86_64-native-linuxapp-gcc/2f5636ece3394911a7b114cb24567e8d/dpdk/build-gcc-static/../app/l2reflect/stats.h:39: first defined here
/usr/bin/ld: app/a172ced@@dpdk-l2reflect@exe/l2reflect_stats.c.o:/root/FC32-64_K5.6.0_GCC10.0.1/x86_64-native-linuxapp-gcc/2f5636ece3394911a7b114cb24567e8d/dpdk/build-gcc-static/../app/l2reflect/l2reflect.h:48: multiple definition of `l2reflect_port_number'; app/a172ced@@dpdk-l2reflect@exe/l2reflect_main.c.o:/root/FC32-64_K5.6.0_GCC10.0.1/x86_64-native-linuxapp-gcc/2f5636ece3394911a7b114cb24567e8d/dpdk/build-gcc-static/../app/l2reflect/l2reflect.h:48: first defined here
/usr/bin/ld: app/a172ced@@dpdk-l2reflect@exe/l2reflect_stats.c.o:/root/FC32-64_K5.6.0_GCC10.0.1/x86_64-native-linuxapp-gcc/2f5636ece3394911a7b114cb24567e8d/dpdk/build-gcc-static/../app/l2reflect/l2reflect.h:51: multiple definition of `l2reflect_remote_eth_addr'; app/a172ced@@dpdk-l2reflect@exe/l2reflect_main.c.o:/root/FC32-64_K5.6.0_GCC10.0.1/x86_64-native-linuxapp-gcc/2f5636ece3394911a7b114cb24567e8d/dpdk/build-gcc-static/../app/l2reflect/l2reflect.h:51: first defined here
/usr/bin/ld: app/a172ced@@dpdk-l2reflect@exe/l2reflect_stats.c.o:/root/FC32-64_K5.6.0_GCC10.0.1/x86_64-native-linuxapp-gcc/2f5636ece3394911a7b114cb24567e8d/dpdk/build-gcc-static/../app/l2reflect/l2reflect.h:50: multiple definition of `l2reflect_port_eth_addr'; app/a172ced@@dpdk-l2reflect@exe/l2reflect_main.c.o:/root/FC32-64_K5.6.0_GCC10.0.1/x86_64-native-linuxapp-gcc/2f5636ece3394911a7b114cb24567e8d/dpdk/build-gcc-static/../app/l2reflect/l2reflect.h:50: first defined here
/usr/bin/ld: app/a172ced@@dpdk-l2reflect@exe/l2reflect_stats.c.o:/root/FC32-64_K5.6.0_GCC10.0.1/x86_64-native-linuxapp-gcc/2f5636ece3394911a7b114cb24567e8d/dpdk/build-gcc-static/../app/l2reflect/l2reflect.h:47: multiple definition of `l2reflect_sleep_msec'; app/a172ced@@dpdk-l2reflect@exe/l2reflect_main.c.o:/root/FC32-64_K5.6.0_GCC10.0.1/x86_64-native-linuxapp-gcc/2f5636ece3394911a7b114cb24567e8d/dpdk/build-gcc-static/../app/l2reflect/l2reflect.h:47: first defined here
/usr/bin/ld: app/a172ced@@dpdk-l2reflect@exe/l2reflect_stats.c.o:/root/FC32-64_K5.6.0_GCC10.0.1/x86_64-native-linuxapp-gcc/2f5636ece3394911a7b114cb24567e8d/dpdk/build-gcc-static/../app/l2reflect/l2reflect.h:49: multiple definition of `l2reflect_state'; app/a172ced@@dpdk-l2reflect@exe/l2reflect_main.c.o:/root/FC32-64_K5.6.0_GCC10.0.1/x86_64-native-linuxapp-gcc/2f5636ece3394911a7b114cb24567e8d/dpdk/build-gcc-static/../app/l2reflect/l2reflect.h:49: first defined here
/usr/bin/ld: app/a172ced@@dpdk-l2reflect@exe/l2reflect_stats.c.o:/root/FC32-64_K5.6.0_GCC10.0.1/x86_64-native-linuxapp-gcc/2f5636ece3394911a7b114cb24567e8d/dpdk/build-gcc-static/../app/l2reflect/l2reflect.h:46: multiple definition of `l2reflect_output_hist'; app/a172ced@@dpdk-l2reflect@exe/l2reflect_main.c.o:/root/FC32-64_K5.6.0_GCC10.0.1/x86_64-native-linuxapp-gcc/2f5636ece3394911a7b114cb24567e8d/dpdk/build-gcc-static/../app/l2reflect/l2reflect.h:46: first defined here
/usr/bin/ld: app/a172ced@@dpdk-l2reflect@exe/l2reflect_stats.c.o:/root/FC32-64_K5.6.0_GCC10.0.1/x86_64-native-linuxapp-gcc/2f5636ece3394911a7b114cb24567e8d/dpdk/build-gcc-static/../app/l2reflect/stats.h:24: multiple definition of `hist_bucket_usec'; app/a172ced@@dpdk-l2reflect@exe/l2reflect_main.c.o:/root/FC32-64_K5.6.0_GCC10.0.1/x86_64-native-linuxapp-gcc/2f5636ece3394911a7b114cb24567e8d/dpdk/build-gcc-static/../app/l2reflect/stats.h:24: first defined here
collect2: error: ld returned 1 exit status
[2375/2389] Linking target app/dpdk-test-flow-perf.
[2376/2389] Linking target app/dpdk-test-compress-perf.
[2377/2389] Linking target app/dpdk-test-eventdev.
[2378/2389] Linking target app/dpdk-test-cmdline.
[2379/2389] Linking target app/dpdk-test-pipeline.
[2380/2389] Linking target app/dpdk-pdump.
[2381/2389] Linking target app/dpdk-test-fib.
[2382/2389] Linking target app/dpdk-proc-info.
[2383/2389] Linking target app/dpdk-test-acl.
[2384/2389] Linking target app/dpdk-test-crypto-perf.
[2385/2389] Linking target app/dpdk-test-bbdev.
ninja: build stopped: subcommand failed


DPDK STV team

                 reply	other threads:[~2020-07-11  4:32 UTC|newest]

Thread overview: [no followups] expand[flat|nested]  mbox.gz  Atom feed

Reply instructions:

You may reply publicly to this message via plain-text email
using any one of the following methods:

* Save the following mbox file, import it into your mail client,
  and reply-to-all from there: mbox

  Avoid top-posting and favor interleaved quoting:
  https://en.wikipedia.org/wiki/Posting_style#Interleaved_style

* Reply using the --to, --cc, and --in-reply-to
  switches of git-send-email(1):

  git send-email \
    --in-reply-to='fecc85$amqogv@orsmga001.jf.intel.com' \
    --to=sys_stv@intel.com \
    --cc=test-report@dpdk.org \
    /path/to/YOUR_REPLY

  https://kernel.org/pub/software/scm/git/docs/git-send-email.html

* If your mail client supports setting the In-Reply-To header
  via mailto: links, try the mailto: link

automatic DPDK test reports

This inbox may be cloned and mirrored by anyone:

	git clone --mirror https://inbox.dpdk.org/test-report/0 test-report/git/0.git

	# If you have public-inbox 1.1+ installed, you may
	# initialize and index your mirror using the following commands:
	public-inbox-init -V2 test-report test-report/ https://inbox.dpdk.org/test-report \
		test-report@dpdk.org
	public-inbox-index test-report

Example config snippet for mirrors.
Newsgroup available over NNTP:
	nntp://inbox.dpdk.org/inbox.dpdk.test-report


AGPL code for this site: git clone https://public-inbox.org/public-inbox.git