automatic DPDK test reports
 help / color / mirror / Atom feed
* [dpdk-test-report] |FAILURE| pw(73784) [v20.11] net/dpaa: fix public API port ID type
@ 2020-07-11  4:44 sys_stv
  0 siblings, 0 replies; 2+ messages in thread
From: sys_stv @ 2020-07-11  4:44 UTC (permalink / raw)
  To: test-report

[-- Attachment #1: Type: text/plain, Size: 55086 bytes --]


Test-Label: Intel-compilation
Test-Status: FAILURE
http://dpdk.org/patch/73784

_Compilation issues_

Submitter: Ferruh Yigit <ferruh.yigit@intel.com>
Date: 2020-07-10 21:52:17
Reply_mail: 20200710215217.1409242-1-ferruh.yigit@intel.com

DPDK git baseline: Repo:dpdk-next-net, CommitID: 75ed7f10737c68feb91145e042377f961caab069


Meson build Summary: 8 Builds Done, 3 Successful, 5 Failures, 0 Blocked

Makefile build Summary: 20 Builds Done, 6 Successful, 14 Failures, 0 Blocked

                +==============================================+===========+==========+
                |                   Makefile                   |   Meson   | Document |
+----------------+------+-------+------+------------+-----------+-----------+----------+
| os             | gcc  | clang | icc  | gcc+shared | gcc+debug | gcc/clang | pdf/html |
+----------------+------+-------+------+------------+-----------+-----------+----------+
| CENTOS82-64    | FAIL | FAIL  | pass | FAIL       | FAIL      | FAIL      |          |
| RHEL82-64      | FAIL |       |      |            |           |           |          |
| UB1804-64      | FAIL |       |      |            |           |           |          |
| FC32-64        | FAIL | FAIL  |      |            |           | FAIL      |          |
| CENTOS77-64    | FAIL |       |      |            |           |           |          |
| UB2004-64      | FAIL | FAIL  | pass |            |           | FAIL      | pass     |
| WIN10-64       |      |       |      |            |           | pass      |          |
| UB2004-32      | FAIL |       |      |            |           |           |          |
| UB1804-32      |      |       |      |            |           | FAIL      |          |
| FreeBSD1201-64 | pass | pass  |      | pass       | pass      | pass      |          |
| SUSE15-64      | FAIL | FAIL  |      |            |           | FAIL      |          |
+----------------+------+-------+------+------------+-----------+-----------+----------+
Test environment and configuration as below:

** Makefile build **


OS: CENTOS82-64
	Kernel Version: 4.18.0-193.el8.x86_64
	CPU info: Intel(R) Xeon(R) Platinum 8280M CPU @ 2.70GHz
	GCC Version: gcc (GCC) 8.3.1 20191121 (Red Hat 8.3.1-5)
	Clang Version: 9.0.1 (Red Hat 9.0.1-2.module_el8.2.0+309+0c7b6b03)
	x86_64-native-linuxapp-gcc
	x86_64-native-linuxapp-clang
	x86_64-native-linuxapp-icc
	x86_64-native-linuxapp-gcc+shared
	x86_64-native-linuxapp-gcc+debug


OS: RHEL82-64
	Kernel Version: 4.18.0-193.el8.x86_64
	CPU info: Intel(R) Xeon(R) Platinum 8280M CPU @ 2.70GHz
	GCC Version: gcc (GCC) 8.3.1 20191121 (Red Hat 8.3.1-5)
	Clang Version: 8.0.1 (Red Hat 8.0.1-1.module_el8.1.0+215+a01033fb)
	x86_64-native-linuxapp-gcc


OS: UB1804-64
	Kernel Version: 4.15.0-29-generic
	CPU info: Intel(R) Xeon(R) Platinum 8180 CPU @ 2.50GHz
	GCC Version: gcc (Ubuntu 7.5.0-3ubuntu1~18.04) 7.5.0
	Clang Version: 6.0.0-1ubuntu2 (tags/RELEASE_600/final)
	x86_64-native-linuxapp-gcc


OS: FC32-64
	Kernel Version: 5.6.0-0.rc7.git0.2.fc32.x86_64
	CPU info: Intel(R) Xeon(R) Platinum 8280M CPU @ 2.70GHz
	GCC Version: gcc (GCC) 10.0.1 20200311 (Red Hat 10.0.1-0.9)
	Clang Version: 10.0.0 (Fedora 10.0.0-0.3.rc4.fc32)
	x86_64-native-linuxapp-gcc
	x86_64-native-linuxapp-clang


OS: CENTOS77-64
	Kernel Version: 3.10.0-1062.9.1.el7.x86_64
	CPU info: Intel(R) Xeon(R) Platinum 8280M CPU @ 2.70GHz
	GCC Version: gcc (GCC) 4.8.5 20150623 (Red Hat 4.8.5-39)
	Clang Version: 3.4.2 (tags/RELEASE_34/dot2-final)
	x86_64-native-linuxapp-gcc


OS: UB2004-64
	Kernel Version: 5.4.0-26-generic
	CPU info: Intel(R) Xeon(R) Platinum 8180 CPU @ 2.50GHz
	GCC Version: gcc (Ubuntu 10-20200416-0ubuntu1) 10.0.1 20200416 (experimental) [master revision 3c3f12e2a76:dcee354ce56:44b326839d864fc10c459916abcc97f35a9ac3de]
	Clang Version: 10.0.0-4ubuntu1
	x86_64-native-linuxapp-clang
	x86_64-native-linuxapp-gcc
	x86_64-native-linuxapp-icc


OS: UB2004-32
	Kernel Version: 5.4.0-26-generic
	CPU info: Intel(R) Xeon(R) Platinum 8180 CPU @ 2.50GHz
	GCC Version: gcc (Ubuntu 9.3.0-10ubuntu2) 9.3.0
	Clang Version: 10.0.0-4ubuntu1
	i686-native-linuxapp-gcc


OS: FreeBSD1201-64
	Kernel Version: 12.1-RELEASE
	CPU info: Intel(R) Xeon(R) CPU E5-2699 v3 @ 2.30GHz (2294.74-MHz K8-class CPU)
	GCC Version: gcc (FreeBSD Ports Collection) 9.2.0
	Clang Version: 8.0.1 (tags/RELEASE_801/final 366581) (based on LLVM 8.0.1)
	x86_64-native-bsdapp-gcc
	x86_64-native-bsdapp-clang
	x86_64-native-bsdapp-gcc+shared
	x86_64-native-bsdapp-gcc+debug


OS: SUSE15-64
	Kernel Version: 4.12.14-lp150.11-default
	CPU info: Intel(R) Xeon(R) CPU E5-2699 v4 @ 2.20GHz
	GCC Version: gcc (SUSE Linux) 7.3.1 20180323 [gcc-7-branch revision 258812]
	Clang Version: 5.0.1 (tags/RELEASE_501/final 312548)
	x86_64-native-linuxapp-clang
	x86_64-native-linuxapp-gcc

** Meson build **


OS: CENTOS82-64
	Kernel Version: 4.18.0-193.el8.x86_64
	CPU info: Intel(R) Xeon(R) CPU E5-2699 v4 @ 2.20GHz
	GCC Version: gcc (GCC) 8.3.1 20191121 (Red Hat 8.3.1-5)
	Clang Version: 9.0.1 (Red Hat 9.0.1-2.module_el8.2.0+309+0c7b6b03)
	./build-gcc-static
	./build-gcc-shared
	./build-clang-static
	./build-clang-shared
	./build-x86-default


OS: UB2004-64
	Kernel Version: 5.4.0-26-generic
	CPU info: Intel(R) Xeon(R) Platinum 8180 CPU @ 2.50GHz
	GCC Version: gcc (Ubuntu 9.3.0-10ubuntu2) 9.3.0
	Clang Version: 10.0.0-4ubuntu1
	x86_64-native-linuxapp-doc
	./build-gcc-static
	./build-gcc-shared
	./build-clang-static
	./build-clang-shared
	./build-x86-default


OS: FC32-64
	Kernel Version: 5.6.0-0.rc7.git0.2.fc32.x86_64
	CPU info: Intel(R) Xeon(R) CPU E5-2699 v4 @ 2.20GHz
	GCC Version: gcc (GCC) 10.0.1 20200311 (Red Hat 10.0.1-0.9)
	Clang Version: 10.0.0 (Fedora 10.0.0-0.3.rc4.fc32)
	./build-gcc-static
	./build-gcc-shared
	./build-clang-static
	./build-clang-shared
	./build-x86-default


OS: WIN10-64
	Kernel Version: N/A
	CPU info: N/A
	GCC Version: N/A
	Clang Version: Clang 8.0.0
	x86_64-windows-clang


OS: UB1804-32
	Kernel Version: 4.15.0-20-generic
	CPU info: Intel(R) Xeon(R) CPU E5-2699 v4 @ 2.20GHz
	GCC Version: gcc (Ubuntu 7.5.0-3ubuntu1~18.04) 7.5.0
	Clang Version: 6.0.0-1ubuntu2 (tags/RELEASE_600/final)
	./build-gcc-static
	./build-gcc-shared
	./build-clang-static
	./build-clang-shared
	./build-x86-default


OS: FreeBSD1201-64
	Kernel Version: 12.1-RELEASE
	CPU info: Intel(R) Xeon(R) CPU E5-2699 v4 @ 2.20GHz (2194.97-MHz K8-class CPU)
	GCC Version: gcc (FreeBSD Ports Collection) 9.2.0
	Clang Version: 8.0.1 (tags/RELEASE_801/final 366581) (based on LLVM 8.0.1)
	./build-gcc-static
	./build-gcc-shared
	./build-clang-static
	./build-clang-shared
	./build-x86-default


OS: SUSE15-64
	Kernel Version: 4.12.14-lp150.12.82-default
	CPU info: Intel(R) Xeon(R) CPU E5-2699 v4 @ 2.20GHz
	GCC Version: gcc (SUSE Linux) 7.4.1 20190905 [gcc-7-branch revision 275407]
	Clang Version: 5.0.1 (tags/RELEASE_501/final 312548)
	./build-gcc-static
	./build-gcc-shared
	./build-clang-static
	./build-clang-shared
	./build-x86-default



*Meson Build Failed #1:
OS: CENTOS82-64
Target:./build-gcc-static
FAILED: drivers/a715181@@tmp_rte_pmd_dpaa@sta/net_dpaa_dpaa_ethdev.c.o 
gcc -Idrivers/a715181@@tmp_rte_pmd_dpaa@sta -Idrivers -I../drivers -Idrivers/net/dpaa -I../drivers/net/dpaa -Ilib/librte_ethdev -I../lib/librte_ethdev -I. -I../ -Iconfig -I../config -Ilib/librte_eal/include -I../lib/librte_eal/include -Ilib/librte_eal/linux/include -I../lib/librte_eal/linux/include -Ilib/librte_eal/x86/include -I../lib/librte_eal/x86/include -Ilib/librte_eal/common -I../lib/librte_eal/common -Ilib/librte_eal -I../lib/librte_eal -Ilib/librte_kvargs -I../lib/librte_kvargs -Ilib/librte_telemetry/../librte_metrics -I../lib/librte_telemetry/../librte_metrics -Ilib/librte_telemetry -I../lib/librte_telemetry -Ilib/librte_net -I../lib/librte_net -Ilib/librte_mbuf -I../lib/librte_mbuf -Ilib/librte_mempool -I../lib/librte_mempool -Ilib/librte_ring -I../lib/librte_ring -Ilib/librte_meter -I../lib/librte_meter -Idrivers/bus/pci -I../drivers/bus/pci -I../drivers/bus/pci/linux -Ilib/librte_pci -I../lib/librte_pci -Idrivers/bus/vdev -I../drivers/bus/vdev -Idrivers/mempool/dpaa -I../drivers/mempool/dpaa -Idrivers/bus/dpaa -I../drivers/bus/dpaa -I../drivers/bus/dpaa/include -I../drivers/bus/dpaa/base/qbman -Idrivers/common/dpaax -I../drivers/common/dpaax -I../drivers/common/dpaax/caamflib -Ilib/librte_eventdev -I../lib/librte_eventdev -Ilib/librte_hash -I../lib/librte_hash -Ilib/librte_timer -I../lib/librte_timer -Ilib/librte_cryptodev -I../lib/librte_cryptodev -fdiagnostics-color=always -pipe -D_FILE_OFFSET_BITS=64 -Wall -Winvalid-pch -Werror -O2 -g -include rte_config.h -Wextra -Wcast-qual -Wdeprecated -Wformat-nonliteral -Wformat-security -Wmissing-declarations -Wmissing-prototypes -Wnested-externs -Wold-style-definition -Wpointer-arith -Wsign-compare -Wstrict-prototypes -Wundef -Wwrite-strings -Wno-packed-not-aligned -Wno-missing-field-initializers -D_GNU_SOURCE -fPIC -march=native -mno-avx512f -DALLOW_EXPERIMENTAL_API -DALLOW_INTERNAL_API -Wno-format-truncation -Wno-pointer-arith -MD -MQ 'drivers/a715181@@tmp_rte_pmd_dpaa@sta/net_dpaa_dpaa_ethdev.c.o' -MF 'drivers/a715181@@tmp_rte_pmd_dpaa@sta/net_dpaa_dpaa_ethdev.c.o.d' -o 'drivers/a715181@@tmp_rte_pmd_dpaa@sta/net_dpaa_dpaa_ethdev.c.o' -c ../drivers/net/dpaa/dpaa_ethdev.c
../drivers/net/dpaa/dpaa_ethdev.c:1231:1: error: conflicting types for ‘rte_pmd_dpaa_set_tx_loopback’
 rte_pmd_dpaa_set_tx_loopback(uint8_t port, uint8_t on)
 ^~~~~~~~~~~~~~~~~~~~~~~~~~~~
In file included from ../drivers/net/dpaa/dpaa_ethdev.c:42:
../drivers/net/dpaa/rte_pmd_dpaa.h:32:1: note: previous declaration of ‘rte_pmd_dpaa_set_tx_loopback’ was here
 rte_pmd_dpaa_set_tx_loopback(uint16_t port, uint8_t on);
 ^~~~~~~~~~~~~~~~~~~~~~~~~~~~
[958/2386] Compiling C object 'drivers/a715181@@tmp_rte_pmd_cxgbe@sta/net_cxgbe_base_t4vf_hw.c.o'.
[959/2386] Generating rte_pmd_bnxt.pmd.c with a custom command.
[960/2386] Compiling C object 'drivers/a715181@@tmp_rte_pmd_cxgbe@sta/net_cxgbe_cxgbe_filter.c.o'.
[961/2386] Compiling C object 'drivers/a715181@@tmp_rte_pmd_dpaa2@sta/net_dpaa2_base_dpaa2_hw_dpni.c.o'.
[962/2386] Compiling C object 'drivers/a715181@@tmp_rte_pmd_dpaa2@sta/net_dpaa2_dpaa2_mux.c.o'.
[963/2386] Compiling C object 'drivers/a715181@@tmp_rte_pmd_cxgbe@sta/net_cxgbe_sge.c.o'.
[964/2386] Generating pipeline.sym_chk with a meson_exe.py custom command.
[965/2386] Compiling C object 'drivers/a715181@@tmp_rte_pmd_cxgbe@sta/net_cxgbe_base_t4_hw.c.o'.
[966/2386] Compiling C object 'drivers/a715181@@tmp_rte_pmd_dpaa2@sta/net_dpaa2_dpaa2_ethdev.c.o'.
[967/2386] Compiling C object 'drivers/a715181@@tmp_rte_pmd_dpaa2@sta/net_dpaa2_dpaa2_flow.c.o'.
[968/2386] Compiling C object 'drivers/a715181@@tmp_rte_pmd_dpaa@sta/net_dpaa_dpaa_rxtx.c.o'.
ninja: build stopped: subcommand failed




*Meson Build Failed #2:
OS: FC32-64
Target:./build-gcc-static
FAILED: drivers/a715181@@tmp_rte_pmd_dpaa@sta/net_dpaa_dpaa_ethdev.c.o 
gcc -Idrivers/a715181@@tmp_rte_pmd_dpaa@sta -Idrivers -I../drivers -Idrivers/net/dpaa -I../drivers/net/dpaa -Ilib/librte_ethdev -I../lib/librte_ethdev -I. -I../ -Iconfig -I../config -Ilib/librte_eal/include -I../lib/librte_eal/include -Ilib/librte_eal/linux/include -I../lib/librte_eal/linux/include -Ilib/librte_eal/x86/include -I../lib/librte_eal/x86/include -Ilib/librte_eal/common -I../lib/librte_eal/common -Ilib/librte_eal -I../lib/librte_eal -Ilib/librte_kvargs -I../lib/librte_kvargs -Ilib/librte_telemetry/../librte_metrics -I../lib/librte_telemetry/../librte_metrics -Ilib/librte_telemetry -I../lib/librte_telemetry -Ilib/librte_net -I../lib/librte_net -Ilib/librte_mbuf -I../lib/librte_mbuf -Ilib/librte_mempool -I../lib/librte_mempool -Ilib/librte_ring -I../lib/librte_ring -Ilib/librte_meter -I../lib/librte_meter -Idrivers/bus/pci -I../drivers/bus/pci -I../drivers/bus/pci/linux -Ilib/librte_pci -I../lib/librte_pci -Idrivers/bus/vdev -I../drivers/bus/vdev -Idrivers/mempool/dpaa -I../drivers/mempool/dpaa -Idrivers/bus/dpaa -I../drivers/bus/dpaa -I../drivers/bus/dpaa/include -I../drivers/bus/dpaa/base/qbman -Idrivers/common/dpaax -I../drivers/common/dpaax -I../drivers/common/dpaax/caamflib -Ilib/librte_eventdev -I../lib/librte_eventdev -Ilib/librte_hash -I../lib/librte_hash -Ilib/librte_timer -I../lib/librte_timer -Ilib/librte_cryptodev -I../lib/librte_cryptodev -fdiagnostics-color=always -pipe -D_FILE_OFFSET_BITS=64 -Wall -Winvalid-pch -Werror -O2 -g -include rte_config.h -Wextra -Wcast-qual -Wdeprecated -Wformat-nonliteral -Wformat-security -Wmissing-declarations -Wmissing-prototypes -Wnested-externs -Wold-style-definition -Wpointer-arith -Wsign-compare -Wstrict-prototypes -Wundef -Wwrite-strings -Wno-address-of-packed-member -Wno-packed-not-aligned -Wno-missing-field-initializers -Wno-zero-length-bounds -D_GNU_SOURCE -fPIC -march=native -DALLOW_EXPERIMENTAL_API -DALLOW_INTERNAL_API -Wno-format-truncation -Wno-pointer-arith -MD -MQ 'drivers/a715181@@tmp_rte_pmd_dpaa@sta/net_dpaa_dpaa_ethdev.c.o' -MF 'drivers/a715181@@tmp_rte_pmd_dpaa@sta/net_dpaa_dpaa_ethdev.c.o.d' -o 'drivers/a715181@@tmp_rte_pmd_dpaa@sta/net_dpaa_dpaa_ethdev.c.o' -c ../drivers/net/dpaa/dpaa_ethdev.c
../drivers/net/dpaa/dpaa_ethdev.c:1231:1: error: conflicting types for ‘rte_pmd_dpaa_set_tx_loopback’
 1231 | rte_pmd_dpaa_set_tx_loopback(uint8_t port, uint8_t on)
      | ^~~~~~~~~~~~~~~~~~~~~~~~~~~~
In file included from ../drivers/net/dpaa/dpaa_ethdev.c:42:
../drivers/net/dpaa/rte_pmd_dpaa.h:32:1: note: previous declaration of ‘rte_pmd_dpaa_set_tx_loopback’ was here
   32 | rte_pmd_dpaa_set_tx_loopback(uint16_t port, uint8_t on);
      | ^~~~~~~~~~~~~~~~~~~~~~~~~~~~
[962/2387] Compiling C object 'drivers/a715181@@tmp_rte_pmd_dpaa2@sta/net_dpaa2_base_dpaa2_hw_dpni.c.o'.
[963/2387] Compiling C object 'drivers/a715181@@tmp_rte_pmd_cxgbe@sta/net_cxgbe_base_t4vf_hw.c.o'.
[964/2387] Compiling C object 'drivers/a715181@@tmp_rte_pmd_dpaa2@sta/net_dpaa2_dpaa2_mux.c.o'.
[965/2387] Generating rte_pmd_bnxt.sym_chk with a meson_exe.py custom command.
[966/2387] Compiling C object 'drivers/a715181@@tmp_rte_pmd_dpaa2@sta/net_dpaa2_dpaa2_sparser.c.o'.
[967/2387] Compiling C object 'lib/76b5a35@@rte_pipeline@sta/librte_pipeline_rte_table_action.c.o'.
[968/2387] Compiling C object 'drivers/a715181@@tmp_rte_pmd_dpaa2@sta/net_dpaa2_dpaa2_ethdev.c.o'.
[969/2387] Compiling C object 'drivers/a715181@@tmp_rte_pmd_dpaa@sta/net_dpaa_dpaa_rxtx.c.o'.
[970/2387] Compiling C object 'drivers/a715181@@tmp_rte_pmd_cxgbe@sta/net_cxgbe_base_t4_hw.c.o'.
[971/2387] Compiling C object 'drivers/a715181@@tmp_rte_pmd_dpaa2@sta/net_dpaa2_dpaa2_rxtx.c.o'.
[972/2387] Compiling C object 'drivers/a715181@@tmp_rte_pmd_dpaa2@sta/net_dpaa2_dpaa2_flow.c.o'.
ninja: build stopped: subcommand failed




*Meson Build Failed #3:
OS: SUSE15-64
Target:./build-gcc-static
FAILED: drivers/a715181@@tmp_rte_pmd_dpaa@sta/net_dpaa_dpaa_ethdev.c.o 
gcc -Idrivers/a715181@@tmp_rte_pmd_dpaa@sta -Idrivers -I../drivers -Idrivers/net/dpaa -I../drivers/net/dpaa -Ilib/librte_ethdev -I../lib/librte_ethdev -I. -I../ -Iconfig -I../config -Ilib/librte_eal/include -I../lib/librte_eal/include -Ilib/librte_eal/linux/include -I../lib/librte_eal/linux/include -Ilib/librte_eal/x86/include -I../lib/librte_eal/x86/include -Ilib/librte_eal/common -I../lib/librte_eal/common -Ilib/librte_eal -I../lib/librte_eal -Ilib/librte_kvargs -I../lib/librte_kvargs -Ilib/librte_telemetry/../librte_metrics -I../lib/librte_telemetry/../librte_metrics -Ilib/librte_telemetry -I../lib/librte_telemetry -Ilib/librte_net -I../lib/librte_net -Ilib/librte_mbuf -I../lib/librte_mbuf -Ilib/librte_mempool -I../lib/librte_mempool -Ilib/librte_ring -I../lib/librte_ring -Ilib/librte_meter -I../lib/librte_meter -Idrivers/bus/pci -I../drivers/bus/pci -I../drivers/bus/pci/linux -Ilib/librte_pci -I../lib/librte_pci -Idrivers/bus/vdev -I../drivers/bus/vdev -Idrivers/mempool/dpaa -I../drivers/mempool/dpaa -Idrivers/bus/dpaa -I../drivers/bus/dpaa -I../drivers/bus/dpaa/include -I../drivers/bus/dpaa/base/qbman -Idrivers/common/dpaax -I../drivers/common/dpaax -I../drivers/common/dpaax/caamflib -Ilib/librte_eventdev -I../lib/librte_eventdev -Ilib/librte_hash -I../lib/librte_hash -Ilib/librte_timer -I../lib/librte_timer -Ilib/librte_cryptodev -I../lib/librte_cryptodev -fdiagnostics-color=always -pipe -D_FILE_OFFSET_BITS=64 -Wall -Winvalid-pch -Werror -O2 -g -include rte_config.h -Wextra -Wcast-qual -Wdeprecated -Wformat-nonliteral -Wformat-security -Wmissing-declarations -Wmissing-prototypes -Wnested-externs -Wold-style-definition -Wpointer-arith -Wsign-compare -Wstrict-prototypes -Wundef -Wwrite-strings -Wno-missing-field-initializers -D_GNU_SOURCE -fPIC -march=native -DALLOW_EXPERIMENTAL_API -DALLOW_INTERNAL_API -Wno-format-truncation -Wno-pointer-arith -MD -MQ 'drivers/a715181@@tmp_rte_pmd_dpaa@sta/net_dpaa_dpaa_ethdev.c.o' -MF 'drivers/a715181@@tmp_rte_pmd_dpaa@sta/net_dpaa_dpaa_ethdev.c.o.d' -o 'drivers/a715181@@tmp_rte_pmd_dpaa@sta/net_dpaa_dpaa_ethdev.c.o' -c ../drivers/net/dpaa/dpaa_ethdev.c
../drivers/net/dpaa/dpaa_ethdev.c:1231:1: error: conflicting types for ‘rte_pmd_dpaa_set_tx_loopback’
 rte_pmd_dpaa_set_tx_loopback(uint8_t port, uint8_t on)
 ^~~~~~~~~~~~~~~~~~~~~~~~~~~~
In file included from ../drivers/net/dpaa/dpaa_ethdev.c:42:0:
../drivers/net/dpaa/rte_pmd_dpaa.h:32:1: note: previous declaration of ‘rte_pmd_dpaa_set_tx_loopback’ was here
 rte_pmd_dpaa_set_tx_loopback(uint16_t port, uint8_t on);
 ^~~~~~~~~~~~~~~~~~~~~~~~~~~~
[963/2281] Compiling C object 'drivers/a715181@@tmp_rte_pmd_dpaa2@sta/net_dpaa2_base_dpaa2_hw_dpni.c.o'.
[964/2281] Generating rte_pmd_bnxt.pmd.c with a custom command.
[965/2281] Compiling C object 'drivers/a715181@@tmp_rte_pmd_cxgbe@sta/net_cxgbe_sge.c.o'.
[966/2281] Compiling C object 'drivers/a715181@@tmp_rte_pmd_dpaa2@sta/net_dpaa2_dpaa2_mux.c.o'.
[967/2281] Compiling C object 'drivers/a715181@@tmp_rte_pmd_cxgbe@sta/net_cxgbe_base_t4_hw.c.o'.
[968/2281] Compiling C object 'drivers/a715181@@tmp_rte_pmd_dpaa2@sta/net_dpaa2_dpaa2_ethdev.c.o'.
[969/2281] Compiling C object 'drivers/a715181@@tmp_rte_pmd_dpaa@sta/net_dpaa_dpaa_rxtx.c.o'.
[970/2281] Compiling C object 'drivers/a715181@@tmp_rte_pmd_dpaa2@sta/net_dpaa2_dpaa2_flow.c.o'.
[971/2281] Compiling C object 'drivers/a715181@@tmp_rte_pmd_dpaa2@sta/net_dpaa2_dpaa2_rxtx.c.o'.
ninja: build stopped: subcommand failed




*Meson Build Failed #4:
OS: UB1804-32
Target:./build-gcc-static
FAILED: drivers/a715181@@tmp_rte_pmd_dpaa@sta/net_dpaa_dpaa_ethdev.c.o 
gcc -Idrivers/a715181@@tmp_rte_pmd_dpaa@sta -Idrivers -I../drivers -Idrivers/net/dpaa -I../drivers/net/dpaa -Ilib/librte_ethdev -I../lib/librte_ethdev -I. -I../ -Iconfig -I../config -Ilib/librte_eal/include -I../lib/librte_eal/include -Ilib/librte_eal/linux/include -I../lib/librte_eal/linux/include -Ilib/librte_eal/x86/include -I../lib/librte_eal/x86/include -Ilib/librte_eal/common -I../lib/librte_eal/common -Ilib/librte_eal -I../lib/librte_eal -Ilib/librte_kvargs -I../lib/librte_kvargs -Ilib/librte_telemetry/../librte_metrics -I../lib/librte_telemetry/../librte_metrics -Ilib/librte_telemetry -I../lib/librte_telemetry -Ilib/librte_net -I../lib/librte_net -Ilib/librte_mbuf -I../lib/librte_mbuf -Ilib/librte_mempool -I../lib/librte_mempool -Ilib/librte_ring -I../lib/librte_ring -Ilib/librte_meter -I../lib/librte_meter -Idrivers/bus/pci -I../drivers/bus/pci -I../drivers/bus/pci/linux -Ilib/librte_pci -I../lib/librte_pci -Idrivers/bus/vdev -I../drivers/bus/vdev -Idrivers/mempool/dpaa -I../drivers/mempool/dpaa -Idrivers/bus/dpaa -I../drivers/bus/dpaa -I../drivers/bus/dpaa/include -I../drivers/bus/dpaa/base/qbman -Idrivers/common/dpaax -I../drivers/common/dpaax -I../drivers/common/dpaax/caamflib -Ilib/librte_eventdev -I../lib/librte_eventdev -Ilib/librte_hash -I../lib/librte_hash -Ilib/librte_timer -I../lib/librte_timer -Ilib/librte_cryptodev -I../lib/librte_cryptodev -fdiagnostics-color=always -pipe -D_FILE_OFFSET_BITS=64 -Wall -Winvalid-pch -Werror -O2 -g -include rte_config.h -Wextra -Wcast-qual -Wdeprecated -Wformat-nonliteral -Wformat-security -Wmissing-declarations -Wmissing-prototypes -Wnested-externs -Wold-style-definition -Wpointer-arith -Wsign-compare -Wstrict-prototypes -Wundef -Wwrite-strings -Wno-missing-field-initializers -Wno-pointer-to-int-cast -D_GNU_SOURCE -m32 -fPIC -march=native -DALLOW_EXPERIMENTAL_API -DALLOW_INTERNAL_API -Wno-format-truncation -Wno-pointer-arith -MD -MQ 'drivers/a715181@@tmp_rte_pmd_dpaa@sta/net_dpaa_dpaa_ethdev.c.o' -MF 'drivers/a715181@@tmp_rte_pmd_dpaa@sta/net_dpaa_dpaa_ethdev.c.o.d' -o 'drivers/a715181@@tmp_rte_pmd_dpaa@sta/net_dpaa_dpaa_ethdev.c.o' -c ../drivers/net/dpaa/dpaa_ethdev.c
../drivers/net/dpaa/dpaa_ethdev.c:1231:1: error: conflicting types for ‘rte_pmd_dpaa_set_tx_loopback’
 rte_pmd_dpaa_set_tx_loopback(uint8_t port, uint8_t on)
 ^~~~~~~~~~~~~~~~~~~~~~~~~~~~
In file included from ../drivers/net/dpaa/dpaa_ethdev.c:42:0:
../drivers/net/dpaa/rte_pmd_dpaa.h:32:1: note: previous declaration of ‘rte_pmd_dpaa_set_tx_loopback’ was here
 rte_pmd_dpaa_set_tx_loopback(uint16_t port, uint8_t on);
 ^~~~~~~~~~~~~~~~~~~~~~~~~~~~
[930/2127] Generating rte_pmd_bnxt.pmd.c with a custom command.
[931/2127] Compiling C object 'drivers/a715181@@tmp_rte_pmd_cxgbe@sta/net_cxgbe_cxgbe_filter.c.o'.
[932/2127] Compiling C object 'drivers/a715181@@tmp_rte_pmd_cxgbe@sta/net_cxgbe_base_t4vf_hw.c.o'.
[933/2127] Compiling C object 'drivers/a715181@@tmp_rte_pmd_cxgbe@sta/net_cxgbe_sge.c.o'.
[934/2127] Compiling C object 'drivers/a715181@@tmp_rte_pmd_dpaa2@sta/net_dpaa2_base_dpaa2_hw_dpni.c.o'.
[935/2127] Compiling C object 'drivers/a715181@@tmp_rte_pmd_dpaa2@sta/net_dpaa2_dpaa2_mux.c.o'.
[936/2127] Compiling C object 'drivers/a715181@@tmp_rte_pmd_cxgbe@sta/net_cxgbe_base_t4_hw.c.o'.
[937/2127] Compiling C object 'drivers/a715181@@tmp_rte_pmd_dpaa2@sta/net_dpaa2_dpaa2_ethdev.c.o'.
[938/2127] Compiling C object 'drivers/a715181@@tmp_rte_pmd_dpaa@sta/net_dpaa_dpaa_rxtx.c.o'.
[939/2127] Compiling C object 'drivers/a715181@@tmp_rte_pmd_dpaa2@sta/net_dpaa2_dpaa2_flow.c.o'.
[940/2127] Compiling C object 'lib/76b5a35@@rte_pipeline@sta/librte_pipeline_rte_table_action.c.o'.
ninja: build stopped: subcommand failed




*Meson Build Failed #5:
OS: UB2004-64
Target:./build-gcc-static
FAILED: drivers/a715181@@tmp_rte_pmd_dpaa@sta/net_dpaa_dpaa_ethdev.c.o 
gcc -Idrivers/a715181@@tmp_rte_pmd_dpaa@sta -Idrivers -I../drivers -Idrivers/net/dpaa -I../drivers/net/dpaa -Ilib/librte_ethdev -I../lib/librte_ethdev -I. -I../ -Iconfig -I../config -Ilib/librte_eal/include -I../lib/librte_eal/include -Ilib/librte_eal/linux/include -I../lib/librte_eal/linux/include -Ilib/librte_eal/x86/include -I../lib/librte_eal/x86/include -Ilib/librte_eal/common -I../lib/librte_eal/common -Ilib/librte_eal -I../lib/librte_eal -Ilib/librte_kvargs -I../lib/librte_kvargs -Ilib/librte_telemetry/../librte_metrics -I../lib/librte_telemetry/../librte_metrics -Ilib/librte_telemetry -I../lib/librte_telemetry -Ilib/librte_net -I../lib/librte_net -Ilib/librte_mbuf -I../lib/librte_mbuf -Ilib/librte_mempool -I../lib/librte_mempool -Ilib/librte_ring -I../lib/librte_ring -Ilib/librte_meter -I../lib/librte_meter -Idrivers/bus/pci -I../drivers/bus/pci -I../drivers/bus/pci/linux -Ilib/librte_pci -I../lib/librte_pci -Idrivers/bus/vdev -I../drivers/bus/vdev -Idrivers/mempool/dpaa -I../drivers/mempool/dpaa -Idrivers/bus/dpaa -I../drivers/bus/dpaa -I../drivers/bus/dpaa/include -I../drivers/bus/dpaa/base/qbman -Idrivers/common/dpaax -I../drivers/common/dpaax -I../drivers/common/dpaax/caamflib -Ilib/librte_eventdev -I../lib/librte_eventdev -Ilib/librte_hash -I../lib/librte_hash -Ilib/librte_timer -I../lib/librte_timer -Ilib/librte_cryptodev -I../lib/librte_cryptodev -fdiagnostics-color=always -pipe -D_FILE_OFFSET_BITS=64 -Wall -Winvalid-pch -Werror -O2 -g -include rte_config.h -Wextra -Wcast-qual -Wdeprecated -Wformat-nonliteral -Wformat-security -Wmissing-declarations -Wmissing-prototypes -Wnested-externs -Wold-style-definition -Wpointer-arith -Wsign-compare -Wstrict-prototypes -Wundef -Wwrite-strings -Wno-address-of-packed-member -Wno-packed-not-aligned -Wno-missing-field-initializers -D_GNU_SOURCE -fPIC -march=native -DALLOW_EXPERIMENTAL_API -DALLOW_INTERNAL_API -Wno-format-truncation -Wno-pointer-arith -MD -MQ 'drivers/a715181@@tmp_rte_pmd_dpaa@sta/net_dpaa_dpaa_ethdev.c.o' -MF 'drivers/a715181@@tmp_rte_pmd_dpaa@sta/net_dpaa_dpaa_ethdev.c.o.d' -o 'drivers/a715181@@tmp_rte_pmd_dpaa@sta/net_dpaa_dpaa_ethdev.c.o' -c ../drivers/net/dpaa/dpaa_ethdev.c
../drivers/net/dpaa/dpaa_ethdev.c:1231:1: error: conflicting types for ‘rte_pmd_dpaa_set_tx_loopback’
 1231 | rte_pmd_dpaa_set_tx_loopback(uint8_t port, uint8_t on)
      | ^~~~~~~~~~~~~~~~~~~~~~~~~~~~
In file included from ../drivers/net/dpaa/dpaa_ethdev.c:42:
../drivers/net/dpaa/rte_pmd_dpaa.h:32:1: note: previous declaration of ‘rte_pmd_dpaa_set_tx_loopback’ was here
   32 | rte_pmd_dpaa_set_tx_loopback(uint16_t port, uint8_t on);
      | ^~~~~~~~~~~~~~~~~~~~~~~~~~~~
[956/2377] Compiling C object 'drivers/a715181@@tmp_rte_pmd_cxgbe@sta/net_cxgbe_sge.c.o'.
[957/2377] Compiling C object 'drivers/a715181@@tmp_rte_pmd_cxgbe@sta/net_cxgbe_cxgbe_filter.c.o'.
[958/2377] Generating rte_pmd_bnxt.pmd.c with a custom command.
[959/2377] Compiling C object 'drivers/a715181@@tmp_rte_pmd_cxgbe@sta/net_cxgbe_base_t4vf_hw.c.o'.
[960/2377] Compiling C object 'drivers/a715181@@tmp_rte_pmd_dpaa2@sta/net_dpaa2_dpaa2_mux.c.o'.
[961/2377] Compiling C object 'drivers/a715181@@tmp_rte_pmd_dpaa2@sta/net_dpaa2_base_dpaa2_hw_dpni.c.o'.
[962/2377] Compiling C object 'drivers/a715181@@tmp_rte_pmd_cxgbe@sta/net_cxgbe_base_t4_hw.c.o'.
[963/2377] Compiling C object 'drivers/a715181@@tmp_rte_pmd_dpaa2@sta/net_dpaa2_dpaa2_ethdev.c.o'.
[964/2377] Compiling C object 'lib/76b5a35@@rte_pipeline@sta/librte_pipeline_rte_table_action.c.o'.
[965/2377] Compiling C object 'drivers/a715181@@tmp_rte_pmd_dpaa@sta/net_dpaa_dpaa_rxtx.c.o'.
[966/2377] Compiling C object 'drivers/a715181@@tmp_rte_pmd_dpaa2@sta/net_dpaa2_dpaa2_flow.c.o'.
ninja: build stopped: subcommand failed



*Makefile Build Failed #1:
OS: CENTOS77-64
Target: x86_64-native-linuxapp-gcc
  SYMLINK-FILE include/rte_pmd_dpaa.h
  CC dpaa_ethdev.o
  CC t4_hw.o
/root/CENTOS77-64_K3.10.0_GCC4.8.5/x86_64-native-linuxapp-gcc/05eb8bd802684e989f7218ee05e08042/dpdk/drivers/net/dpaa/dpaa_ethdev.c:1231:1: error: conflicting types for ‘rte_pmd_dpaa_set_tx_loopback’
 rte_pmd_dpaa_set_tx_loopback(uint8_t port, uint8_t on)
 ^
In file included from /root/CENTOS77-64_K3.10.0_GCC4.8.5/x86_64-native-linuxapp-gcc/05eb8bd802684e989f7218ee05e08042/dpdk/drivers/net/dpaa/dpaa_ethdev.c:42:0:
--
 rte_pmd_dpaa_set_tx_loopback(uint16_t port, uint8_t on);
 ^
cc1: warning: unrecognized command line option "-Wno-address-of-packed-member" [enabled by default]
make[6]: *** [dpaa_ethdev.o] Error 1
make[5]: *** [dpaa] Error 2
make[5]: *** Waiting for unfinished jobs....
  CC clip_tbl.o
  CC mps_tcam.o
--
  AR librte_pmd_e1000.a
  INSTALL-LIB librte_pmd_e1000.a
make[6]: warning:  Clock skew detected.  Your build may be incomplete.
make[4]: *** [net] Error 2
make[3]: *** [drivers] Error 2
make[2]: *** [all] Error 2
make[1]: *** [pre_install] Error 2
make: *** [install] Error 2


*Makefile Build Failed #2:
OS: CENTOS82-64
Target: x86_64-native-linuxapp-gcc
  CC axgbe_ethdev.o.pmd.o
  LD fpga_lte_fec.o
  LD axgbe_ethdev.o
/root/CENTOS82-64_K4.18.0_GCC8.3.1/x86_64-native-linuxapp-gcc/05eb8bd802684e989f7218ee05e08042/dpdk/drivers/net/dpaa/dpaa_ethdev.c:1231:1: error: conflicting types for ‘rte_pmd_dpaa_set_tx_loopback’
 rte_pmd_dpaa_set_tx_loopback(uint8_t port, uint8_t on)
 ^~~~~~~~~~~~~~~~~~~~~~~~~~~~
In file included from /root/CENTOS82-64_K4.18.0_GCC8.3.1/x86_64-native-linuxapp-gcc/05eb8bd802684e989f7218ee05e08042/dpdk/drivers/net/dpaa/dpaa_ethdev.c:42:
--
 rte_pmd_dpaa_set_tx_loopback(uint16_t port, uint8_t on);
 ^~~~~~~~~~~~~~~~~~~~~~~~~~~~
cc1: warning: unrecognized command line option ‘-Wno-address-of-packed-member’
make[6]: *** [/root/CENTOS82-64_K4.18.0_GCC8.3.1/x86_64-native-linuxapp-gcc/05eb8bd802684e989f7218ee05e08042/dpdk/mk/internal/rte.compile-pre.mk:114: dpaa_ethdev.o] Error 1
make[5]: *** [/root/CENTOS82-64_K4.18.0_GCC8.3.1/x86_64-native-linuxapp-gcc/05eb8bd802684e989f7218ee05e08042/dpdk/mk/rte.subdir.mk:37: dpaa] Error 2
make[5]: *** Waiting for unfinished jobs....
  CC dpaa2_rxtx.o
  CC otx2_cryptodev_hw_access.o
--
  CC virtio_rxtx.o
  AR librte_pmd_bnx2x.a
  INSTALL-LIB librte_pmd_bnx2x.a
make[4]: *** [/root/CENTOS82-64_K4.18.0_GCC8.3.1/x86_64-native-linuxapp-gcc/05eb8bd802684e989f7218ee05e08042/dpdk/mk/rte.subdir.mk:35: net] Error 2
make[4]: *** Waiting for unfinished jobs....
  CC virtio_cryptodev.o
  PMDINFO caam_jr.o.pmd.c
--
  AR librte_pmd_virtio_crypto.a
  INSTALL-LIB librte_pmd_dpaa2_sec.a
  INSTALL-LIB librte_pmd_virtio_crypto.a
make[3]: *** [/root/CENTOS82-64_K4.18.0_GCC8.3.1/x86_64-native-linuxapp-gcc/05eb8bd802684e989f7218ee05e08042/dpdk/mk/rte.sdkbuild.mk:51: drivers] Error 2
make[2]: *** [/root/CENTOS82-64_K4.18.0_GCC8.3.1/x86_64-native-linuxapp-gcc/05eb8bd802684e989f7218ee05e08042/dpdk/mk/rte.sdkroot.mk:115: all] Error 2
make[1]: *** [/root/CENTOS82-64_K4.18.0_GCC8.3.1/x86_64-native-linuxapp-gcc/05eb8bd802684e989f7218ee05e08042/dpdk/mk/rte.sdkinstall.mk:61: pre_install] Error 2
make: *** [/root/CENTOS82-64_K4.18.0_GCC8.3.1/x86_64-native-linuxapp-gcc/05eb8bd802684e989f7218ee05e08042/dpdk/mk/rte.sdkroot.mk:92: install] Error 2


*Makefile Build Failed #3:
OS: CENTOS82-64
Target: x86_64-native-linuxapp-clang
  LD cxgbe_ethdev.o
  CC cxgbevf_ethdev.o
  CC rte_eth_bond_flow.o
/root/CENTOS82-64_K4.18.0_Clang7.0.1/x86_64-native-linuxapp-clang/05eb8bd802684e989f7218ee05e08042/dpdk/drivers/net/dpaa/dpaa_ethdev.c:1231:1: error: conflicting types for 'rte_pmd_dpaa_set_tx_loopback'
rte_pmd_dpaa_set_tx_loopback(uint8_t port, uint8_t on)
^
/root/CENTOS82-64_K4.18.0_Clang7.0.1/x86_64-native-linuxapp-clang/05eb8bd802684e989f7218ee05e08042/dpdk/drivers/net/dpaa/rte_pmd_dpaa.h:32:1: note: previous declaration is here
rte_pmd_dpaa_set_tx_loopback(uint16_t port, uint8_t on);
^
1 error generated.
make[6]: *** [/root/CENTOS82-64_K4.18.0_Clang7.0.1/x86_64-native-linuxapp-clang/05eb8bd802684e989f7218ee05e08042/dpdk/mk/internal/rte.compile-pre.mk:116: dpaa_ethdev.o] Error 1
make[5]: *** [/root/CENTOS82-64_K4.18.0_Clang7.0.1/x86_64-native-linuxapp-clang/05eb8bd802684e989f7218ee05e08042/dpdk/mk/rte.subdir.mk:37: dpaa] Error 2
make[5]: *** Waiting for unfinished jobs....
  CC cxgbe_main.o
== Build drivers/crypto/octeontx2
--
  INSTALL-LIB librte_pmd_virtio_crypto.a
  AR librte_pmd_cxgbe.a
  INSTALL-LIB librte_pmd_cxgbe.a
make[4]: *** [/root/CENTOS82-64_K4.18.0_Clang7.0.1/x86_64-native-linuxapp-clang/05eb8bd802684e989f7218ee05e08042/dpdk/mk/rte.subdir.mk:35: net] Error 2
make[4]: *** Waiting for unfinished jobs....
  AR librte_pmd_caam_jr.a
  INSTALL-LIB librte_pmd_caam_jr.a
--
  LD dpaa2_sec_dpseci.o
  AR librte_pmd_dpaa2_sec.a
  INSTALL-LIB librte_pmd_dpaa2_sec.a
make[3]: *** [/root/CENTOS82-64_K4.18.0_Clang7.0.1/x86_64-native-linuxapp-clang/05eb8bd802684e989f7218ee05e08042/dpdk/mk/rte.sdkbuild.mk:51: drivers] Error 2
make[2]: *** [/root/CENTOS82-64_K4.18.0_Clang7.0.1/x86_64-native-linuxapp-clang/05eb8bd802684e989f7218ee05e08042/dpdk/mk/rte.sdkroot.mk:115: all] Error 2
make[1]: *** [/root/CENTOS82-64_K4.18.0_Clang7.0.1/x86_64-native-linuxapp-clang/05eb8bd802684e989f7218ee05e08042/dpdk/mk/rte.sdkinstall.mk:61: pre_install] Error 2
make: *** [/root/CENTOS82-64_K4.18.0_Clang7.0.1/x86_64-native-linuxapp-clang/05eb8bd802684e989f7218ee05e08042/dpdk/mk/rte.sdkroot.mk:92: install] Error 2


*Makefile Build Failed #4:
OS: CENTOS82-64
Target: x86_64-native-linuxapp-gcc+shared
  PMDINFO cxgbevf_ethdev.o.pmd.c
  CC cxgbevf_ethdev.o.pmd.o
  LD cxgbevf_ethdev.o
/root/CENTOS82-64_K4.18.0_GCC8.3.1/x86_64-native-linuxapp-gcc+shared/05eb8bd802684e989f7218ee05e08042/dpdk/drivers/net/dpaa/dpaa_ethdev.c:1231:1: error: conflicting types for ‘rte_pmd_dpaa_set_tx_loopback’
 rte_pmd_dpaa_set_tx_loopback(uint8_t port, uint8_t on)
 ^~~~~~~~~~~~~~~~~~~~~~~~~~~~
In file included from /root/CENTOS82-64_K4.18.0_GCC8.3.1/x86_64-native-linuxapp-gcc+shared/05eb8bd802684e989f7218ee05e08042/dpdk/drivers/net/dpaa/dpaa_ethdev.c:42:
--
 rte_pmd_dpaa_set_tx_loopback(uint16_t port, uint8_t on);
 ^~~~~~~~~~~~~~~~~~~~~~~~~~~~
cc1: warning: unrecognized command line option ‘-Wno-address-of-packed-member’
make[6]: *** [/root/CENTOS82-64_K4.18.0_GCC8.3.1/x86_64-native-linuxapp-gcc+shared/05eb8bd802684e989f7218ee05e08042/dpdk/mk/internal/rte.compile-pre.mk:114: dpaa_ethdev.o] Error 1
make[5]: *** [/root/CENTOS82-64_K4.18.0_GCC8.3.1/x86_64-native-linuxapp-gcc+shared/05eb8bd802684e989f7218ee05e08042/dpdk/mk/rte.subdir.mk:35: dpaa] Error 2
make[5]: *** Waiting for unfinished jobs....
  CC base/dpaa2_hw_dpni.o
make[6]: Warning: File 'rte_eth_bond_8023ad.c' has modification time 3358 s in the future
--
make[6]: warning:  Clock skew detected.  Your build may be incomplete.
  LD librte_pmd_bnx2x.so.20.0.3
  INSTALL-LIB librte_pmd_bnx2x.so.20.0.3
make[4]: *** [/root/CENTOS82-64_K4.18.0_GCC8.3.1/x86_64-native-linuxapp-gcc+shared/05eb8bd802684e989f7218ee05e08042/dpdk/mk/rte.subdir.mk:35: net] Error 2
make[3]: *** [/root/CENTOS82-64_K4.18.0_GCC8.3.1/x86_64-native-linuxapp-gcc+shared/05eb8bd802684e989f7218ee05e08042/dpdk/mk/rte.sdkbuild.mk:51: drivers] Error 2
make[2]: *** [/root/CENTOS82-64_K4.18.0_GCC8.3.1/x86_64-native-linuxapp-gcc+shared/05eb8bd802684e989f7218ee05e08042/dpdk/mk/rte.sdkroot.mk:115: all] Error 2
make[1]: *** [/root/CENTOS82-64_K4.18.0_GCC8.3.1/x86_64-native-linuxapp-gcc+shared/05eb8bd802684e989f7218ee05e08042/dpdk/mk/rte.sdkinstall.mk:61: pre_install] Error 2
make: *** [/root/CENTOS82-64_K4.18.0_GCC8.3.1/x86_64-native-linuxapp-gcc+shared/05eb8bd802684e989f7218ee05e08042/dpdk/mk/rte.sdkroot.mk:92: install] Error 2


*Makefile Build Failed #5:
OS: CENTOS82-64
Target: x86_64-native-linuxapp-gcc+debug
  CC rte_eth_bond_pmd.o.pmd.o
  LD rte_eth_bond_pmd.o
  CC base/dpaa2_hw_dpni.o
/root/CENTOS82-64_K4.18.0_GCC8.3.1/x86_64-native-linuxapp-gcc+debug/05eb8bd802684e989f7218ee05e08042/dpdk/drivers/net/dpaa/dpaa_ethdev.c:1231:1: error: conflicting types for ‘rte_pmd_dpaa_set_tx_loopback’
 rte_pmd_dpaa_set_tx_loopback(uint8_t port, uint8_t on)
 ^~~~~~~~~~~~~~~~~~~~~~~~~~~~
In file included from /root/CENTOS82-64_K4.18.0_GCC8.3.1/x86_64-native-linuxapp-gcc+debug/05eb8bd802684e989f7218ee05e08042/dpdk/drivers/net/dpaa/dpaa_ethdev.c:42:
--
 rte_pmd_dpaa_set_tx_loopback(uint16_t port, uint8_t on);
 ^~~~~~~~~~~~~~~~~~~~~~~~~~~~
cc1: warning: unrecognized command line option ‘-Wno-address-of-packed-member’
make[6]: *** [/root/CENTOS82-64_K4.18.0_GCC8.3.1/x86_64-native-linuxapp-gcc+debug/05eb8bd802684e989f7218ee05e08042/dpdk/mk/internal/rte.compile-pre.mk:114: dpaa_ethdev.o] Error 1
make[5]: *** [/root/CENTOS82-64_K4.18.0_GCC8.3.1/x86_64-native-linuxapp-gcc+debug/05eb8bd802684e989f7218ee05e08042/dpdk/mk/rte.subdir.mk:35: dpaa] Error 2
make[5]: *** Waiting for unfinished jobs....
  CC elink.o
  CC dpaa2_rxtx.o
--
  AR librte_pmd_e1000.a
  INSTALL-LIB librte_pmd_e1000.a
make[6]: warning:  Clock skew detected.  Your build may be incomplete.
make[4]: *** [/root/CENTOS82-64_K4.18.0_GCC8.3.1/x86_64-native-linuxapp-gcc+debug/05eb8bd802684e989f7218ee05e08042/dpdk/mk/rte.subdir.mk:35: net] Error 2
make[3]: *** [/root/CENTOS82-64_K4.18.0_GCC8.3.1/x86_64-native-linuxapp-gcc+debug/05eb8bd802684e989f7218ee05e08042/dpdk/mk/rte.sdkbuild.mk:51: drivers] Error 2
make[2]: *** [/root/CENTOS82-64_K4.18.0_GCC8.3.1/x86_64-native-linuxapp-gcc+debug/05eb8bd802684e989f7218ee05e08042/dpdk/mk/rte.sdkroot.mk:115: all] Error 2
make[1]: *** [/root/CENTOS82-64_K4.18.0_GCC8.3.1/x86_64-native-linuxapp-gcc+debug/05eb8bd802684e989f7218ee05e08042/dpdk/mk/rte.sdkinstall.mk:61: pre_install] Error 2
make: *** [/root/CENTOS82-64_K4.18.0_GCC8.3.1/x86_64-native-linuxapp-gcc+debug/05eb8bd802684e989f7218ee05e08042/dpdk/mk/rte.sdkroot.mk:92: install] Error 2


*Makefile Build Failed #6:
OS: FC32-64
Target: x86_64-native-linuxapp-gcc
  CC axgbe_ethdev.o.pmd.o
  LD axgbe_ethdev.o
  CC cxgbevf_ethdev.o
/root/FC32-64_K5.6.0_GCC10.0.1/x86_64-native-linuxapp-gcc/05eb8bd802684e989f7218ee05e08042/dpdk/drivers/net/dpaa/dpaa_ethdev.c:1231:1: error: conflicting types for ‘rte_pmd_dpaa_set_tx_loopback’
 1231 | rte_pmd_dpaa_set_tx_loopback(uint8_t port, uint8_t on)
      | ^~~~~~~~~~~~~~~~~~~~~~~~~~~~
In file included from /root/FC32-64_K5.6.0_GCC10.0.1/x86_64-native-linuxapp-gcc/05eb8bd802684e989f7218ee05e08042/dpdk/drivers/net/dpaa/dpaa_ethdev.c:42:
--
   32 | rte_pmd_dpaa_set_tx_loopback(uint16_t port, uint8_t on);
      | ^~~~~~~~~~~~~~~~~~~~~~~~~~~~
  CC axgbe_mdio.o
make[6]: *** [/root/FC32-64_K5.6.0_GCC10.0.1/x86_64-native-linuxapp-gcc/05eb8bd802684e989f7218ee05e08042/dpdk/mk/internal/rte.compile-pre.mk:116: dpaa_ethdev.o] Error 1
make[6]: *** Waiting for unfinished jobs....
  CC axgbe_phy_impl.o
  AR librte_pmd_atlantic.a
--
  CC cxgbevf_main.o
== Build drivers/crypto/scheduler
  CC axgbe_rxtx_vec_sse.o
make[5]: *** [/root/FC32-64_K5.6.0_GCC10.0.1/x86_64-native-linuxapp-gcc/05eb8bd802684e989f7218ee05e08042/dpdk/mk/rte.subdir.mk:37: dpaa] Error 2
make[5]: *** Waiting for unfinished jobs....
  CC sge.o
== Build drivers/crypto/null
--
  INSTALL-LIB librte_pmd_dpaa_sec.a
  AR librte_pmd_bnx2x.a
  INSTALL-LIB librte_pmd_bnx2x.a
make[4]: *** [/root/FC32-64_K5.6.0_GCC10.0.1/x86_64-native-linuxapp-gcc/05eb8bd802684e989f7218ee05e08042/dpdk/mk/rte.subdir.mk:35: net] Error 2
make[3]: *** [/root/FC32-64_K5.6.0_GCC10.0.1/x86_64-native-linuxapp-gcc/05eb8bd802684e989f7218ee05e08042/dpdk/mk/rte.sdkbuild.mk:51: drivers] Error 2
make[2]: *** [/root/FC32-64_K5.6.0_GCC10.0.1/x86_64-native-linuxapp-gcc/05eb8bd802684e989f7218ee05e08042/dpdk/mk/rte.sdkroot.mk:115: all] Error 2
make[1]: *** [/root/FC32-64_K5.6.0_GCC10.0.1/x86_64-native-linuxapp-gcc/05eb8bd802684e989f7218ee05e08042/dpdk/mk/rte.sdkinstall.mk:61: pre_install] Error 2
make: *** [/root/FC32-64_K5.6.0_GCC10.0.1/x86_64-native-linuxapp-gcc/05eb8bd802684e989f7218ee05e08042/dpdk/mk/rte.sdkroot.mk:92: install] Error 2


*Makefile Build Failed #7:
OS: FC32-64
Target: x86_64-native-linuxapp-clang
  CC sge.o
  LD cxgbe_ethdev.o
== Build drivers/crypto/dpaa_sec
/root/FC32-64_K5.6.0_Clang10.0.0/x86_64-native-linuxapp-clang/05eb8bd802684e989f7218ee05e08042/dpdk/drivers/net/dpaa/dpaa_ethdev.c:1231:1: error: conflicting types for 'rte_pmd_dpaa_set_tx_loopback'
rte_pmd_dpaa_set_tx_loopback(uint8_t port, uint8_t on)
^
/root/FC32-64_K5.6.0_Clang10.0.0/x86_64-native-linuxapp-clang/05eb8bd802684e989f7218ee05e08042/dpdk/drivers/net/dpaa/rte_pmd_dpaa.h:32:1: note: previous declaration is here
rte_pmd_dpaa_set_tx_loopback(uint16_t port, uint8_t on);
^
1 error generated.
make[6]: *** [/root/FC32-64_K5.6.0_Clang10.0.0/x86_64-native-linuxapp-clang/05eb8bd802684e989f7218ee05e08042/dpdk/mk/internal/rte.compile-pre.mk:114: dpaa_ethdev.o] Error 1
make[5]: *** [/root/FC32-64_K5.6.0_Clang10.0.0/x86_64-native-linuxapp-clang/05eb8bd802684e989f7218ee05e08042/dpdk/mk/rte.subdir.mk:37: dpaa] Error 2
make[5]: *** Waiting for unfinished jobs....
  CC cxgbe_filter.o
  CC dpaa_sec.o
--
  INSTALL-LIB librte_pmd_caam_jr.a
  AR librte_pmd_cxgbe.a
  INSTALL-LIB librte_pmd_cxgbe.a
make[4]: *** [/root/FC32-64_K5.6.0_Clang10.0.0/x86_64-native-linuxapp-clang/05eb8bd802684e989f7218ee05e08042/dpdk/mk/rte.subdir.mk:35: net] Error 2
make[4]: *** Waiting for unfinished jobs....
  PMDINFO virtio_cryptodev.o.pmd.c
  CC virtio_cryptodev.o.pmd.o
--
  LD dpaa_sec.o
  AR librte_pmd_dpaa_sec.a
  INSTALL-LIB librte_pmd_dpaa_sec.a
make[3]: *** [/root/FC32-64_K5.6.0_Clang10.0.0/x86_64-native-linuxapp-clang/05eb8bd802684e989f7218ee05e08042/dpdk/mk/rte.sdkbuild.mk:51: drivers] Error 2
make[2]: *** [/root/FC32-64_K5.6.0_Clang10.0.0/x86_64-native-linuxapp-clang/05eb8bd802684e989f7218ee05e08042/dpdk/mk/rte.sdkroot.mk:115: all] Error 2
make[1]: *** [/root/FC32-64_K5.6.0_Clang10.0.0/x86_64-native-linuxapp-clang/05eb8bd802684e989f7218ee05e08042/dpdk/mk/rte.sdkinstall.mk:61: pre_install] Error 2
make: *** [/root/FC32-64_K5.6.0_Clang10.0.0/x86_64-native-linuxapp-clang/05eb8bd802684e989f7218ee05e08042/dpdk/mk/rte.sdkroot.mk:92: install] Error 2


*Makefile Build Failed #8:
OS: RHEL82-64
Target: x86_64-native-linuxapp-gcc
  AR librte_pmd_axgbe.a
  INSTALL-LIB librte_pmd_axgbe.a
== Build drivers/net/ena
/root/RHEL82-64_K4.18.0_GCC8.3.1/x86_64-native-linuxapp-gcc/05eb8bd802684e989f7218ee05e08042/dpdk/drivers/net/dpaa/dpaa_ethdev.c:1231:1: error: conflicting types for ‘rte_pmd_dpaa_set_tx_loopback’
 rte_pmd_dpaa_set_tx_loopback(uint8_t port, uint8_t on)
 ^~~~~~~~~~~~~~~~~~~~~~~~~~~~
In file included from /root/RHEL82-64_K4.18.0_GCC8.3.1/x86_64-native-linuxapp-gcc/05eb8bd802684e989f7218ee05e08042/dpdk/drivers/net/dpaa/dpaa_ethdev.c:42:
--
 rte_pmd_dpaa_set_tx_loopback(uint16_t port, uint8_t on);
 ^~~~~~~~~~~~~~~~~~~~~~~~~~~~
cc1: warning: unrecognized command line option ‘-Wno-address-of-packed-member’
make[6]: *** [/root/RHEL82-64_K4.18.0_GCC8.3.1/x86_64-native-linuxapp-gcc/05eb8bd802684e989f7218ee05e08042/dpdk/mk/internal/rte.compile-pre.mk:114: dpaa_ethdev.o] Error 1
make[5]: *** [/root/RHEL82-64_K4.18.0_GCC8.3.1/x86_64-native-linuxapp-gcc/05eb8bd802684e989f7218ee05e08042/dpdk/mk/rte.subdir.mk:35: dpaa] Error 2
make[5]: *** Waiting for unfinished jobs....
  CC ecore_sp.o
make[6]: Warning: File 'rte_pmd_dpaa2.h' has modification time 38910 s in the future
--
  AR librte_pmd_e1000.a
  INSTALL-LIB librte_pmd_e1000.a
make[6]: warning:  Clock skew detected.  Your build may be incomplete.
make[4]: *** [/root/RHEL82-64_K4.18.0_GCC8.3.1/x86_64-native-linuxapp-gcc/05eb8bd802684e989f7218ee05e08042/dpdk/mk/rte.subdir.mk:35: net] Error 2
make[3]: *** [/root/RHEL82-64_K4.18.0_GCC8.3.1/x86_64-native-linuxapp-gcc/05eb8bd802684e989f7218ee05e08042/dpdk/mk/rte.sdkbuild.mk:51: drivers] Error 2
make[2]: *** [/root/RHEL82-64_K4.18.0_GCC8.3.1/x86_64-native-linuxapp-gcc/05eb8bd802684e989f7218ee05e08042/dpdk/mk/rte.sdkroot.mk:115: all] Error 2
make[1]: *** [/root/RHEL82-64_K4.18.0_GCC8.3.1/x86_64-native-linuxapp-gcc/05eb8bd802684e989f7218ee05e08042/dpdk/mk/rte.sdkinstall.mk:61: pre_install] Error 2
make: *** [/root/RHEL82-64_K4.18.0_GCC8.3.1/x86_64-native-linuxapp-gcc/05eb8bd802684e989f7218ee05e08042/dpdk/mk/rte.sdkroot.mk:92: install] Error 2


*Makefile Build Failed #9:
OS: SUSE15-64
Target: x86_64-native-linuxapp-clang
  CC dpaa_ethdev.o
  CC nitrox_sym.o
  CC nitrox_sym_capabilities.o
/root/SUSE15-64_K4.12.14_Clang5.0.1/x86_64-native-linuxapp-clang/05eb8bd802684e989f7218ee05e08042/dpdk/drivers/net/dpaa/dpaa_ethdev.c:1231:1: error: conflicting types for 'rte_pmd_dpaa_set_tx_loopback'
rte_pmd_dpaa_set_tx_loopback(uint8_t port, uint8_t on)
^
/root/SUSE15-64_K4.12.14_Clang5.0.1/x86_64-native-linuxapp-clang/05eb8bd802684e989f7218ee05e08042/dpdk/drivers/net/dpaa/rte_pmd_dpaa.h:32:1: note: previous declaration is here
--
^
1 error generated.
  PMDINFO nitrox_device.o.pmd.c
make[6]: *** [/root/SUSE15-64_K4.12.14_Clang5.0.1/x86_64-native-linuxapp-clang/05eb8bd802684e989f7218ee05e08042/dpdk/mk/internal/rte.compile-pre.mk:116: dpaa_ethdev.o] Error 1
make[5]: *** [/root/SUSE15-64_K4.12.14_Clang5.0.1/x86_64-native-linuxapp-clang/05eb8bd802684e989f7218ee05e08042/dpdk/mk/rte.subdir.mk:35: dpaa] Error 2
make[5]: *** Waiting for unfinished jobs....
  CC nitrox_device.o.pmd.o
  CC nitrox_sym_reqmgr.o
--
  INSTALL-LIB librte_pmd_cxgbe.a
  AR librte_pmd_bnx2x.a
  INSTALL-LIB librte_pmd_bnx2x.a
make[4]: *** [/root/SUSE15-64_K4.12.14_Clang5.0.1/x86_64-native-linuxapp-clang/05eb8bd802684e989f7218ee05e08042/dpdk/mk/rte.subdir.mk:35: net] Error 2
make[3]: *** [/root/SUSE15-64_K4.12.14_Clang5.0.1/x86_64-native-linuxapp-clang/05eb8bd802684e989f7218ee05e08042/dpdk/mk/rte.sdkbuild.mk:51: drivers] Error 2
make[2]: *** [/root/SUSE15-64_K4.12.14_Clang5.0.1/x86_64-native-linuxapp-clang/05eb8bd802684e989f7218ee05e08042/dpdk/mk/rte.sdkroot.mk:115: all] Error 2
make[1]: *** [/root/SUSE15-64_K4.12.14_Clang5.0.1/x86_64-native-linuxapp-clang/05eb8bd802684e989f7218ee05e08042/dpdk/mk/rte.sdkinstall.mk:61: pre_install] Error 2
make: *** [/root/SUSE15-64_K4.12.14_Clang5.0.1/x86_64-native-linuxapp-clang/05eb8bd802684e989f7218ee05e08042/dpdk/mk/rte.sdkroot.mk:92: install] Error 2


*Makefile Build Failed #10:
OS: SUSE15-64
Target: x86_64-native-linuxapp-gcc
  SYMLINK-FILE include/rte_pmd_dpaa2.h
  CC base/dpaa2_hw_dpni.o
  CC cxgbe_main.o
/root/SUSE15-64_K4.12.14_GCC7.3.1/x86_64-native-linuxapp-gcc/05eb8bd802684e989f7218ee05e08042/dpdk/drivers/net/dpaa/dpaa_ethdev.c:1231:1: error: conflicting types for ‘rte_pmd_dpaa_set_tx_loopback’
 rte_pmd_dpaa_set_tx_loopback(uint8_t port, uint8_t on)
 ^~~~~~~~~~~~~~~~~~~~~~~~~~~~
In file included from /root/SUSE15-64_K4.12.14_GCC7.3.1/x86_64-native-linuxapp-gcc/05eb8bd802684e989f7218ee05e08042/dpdk/drivers/net/dpaa/dpaa_ethdev.c:42:0:
--
 ^~~~~~~~~~~~~~~~~~~~~~~~~~~~
cc1: warning: unrecognized command line option ‘-Wno-address-of-packed-member’
  CC e1000_base.o
make[6]: *** [/root/SUSE15-64_K4.12.14_GCC7.3.1/x86_64-native-linuxapp-gcc/05eb8bd802684e989f7218ee05e08042/dpdk/mk/internal/rte.compile-pre.mk:116: dpaa_ethdev.o] Error 1
make[6]: *** Waiting for unfinished jobs....
  CC cxgbevf_main.o
  PMDINFO cxgbevf_ethdev.o.pmd.c
--
  CC e1000_82541.o
  CC clip_tbl.o
  CC mps_tcam.o
make[5]: *** [/root/SUSE15-64_K4.12.14_GCC7.3.1/x86_64-native-linuxapp-gcc/05eb8bd802684e989f7218ee05e08042/dpdk/mk/rte.subdir.mk:37: dpaa] Error 2
make[5]: *** Waiting for unfinished jobs....
  CC e1000_82542.o
  CC e1000_82543.o
--
  INSTALL-LIB librte_pmd_bond.a
  AR librte_pmd_dpaa2.a
  INSTALL-LIB librte_pmd_dpaa2.a
make[4]: *** [/root/SUSE15-64_K4.12.14_GCC7.3.1/x86_64-native-linuxapp-gcc/05eb8bd802684e989f7218ee05e08042/dpdk/mk/rte.subdir.mk:35: net] Error 2
make[3]: *** [/root/SUSE15-64_K4.12.14_GCC7.3.1/x86_64-native-linuxapp-gcc/05eb8bd802684e989f7218ee05e08042/dpdk/mk/rte.sdkbuild.mk:51: drivers] Error 2
make[2]: *** [/root/SUSE15-64_K4.12.14_GCC7.3.1/x86_64-native-linuxapp-gcc/05eb8bd802684e989f7218ee05e08042/dpdk/mk/rte.sdkroot.mk:115: all] Error 2
make[1]: *** [/root/SUSE15-64_K4.12.14_GCC7.3.1/x86_64-native-linuxapp-gcc/05eb8bd802684e989f7218ee05e08042/dpdk/mk/rte.sdkinstall.mk:61: pre_install] Error 2
make: *** [/root/SUSE15-64_K4.12.14_GCC7.3.1/x86_64-native-linuxapp-gcc/05eb8bd802684e989f7218ee05e08042/dpdk/mk/rte.sdkroot.mk:92: install] Error 2


*Makefile Build Failed #11:
OS: UB1804-64
Target: x86_64-native-linuxapp-gcc
  INSTALL-LIB librte_pmd_virtio_crypto.a
  CC bnx2x_rxtx.o
  CC cxgbe_main.o
/root/UB1804-64_K4.15.0_GCC7.3.0/x86_64-native-linuxapp-gcc/05eb8bd802684e989f7218ee05e08042/dpdk/drivers/net/dpaa/dpaa_ethdev.c:1231:1: error: conflicting types for ‘rte_pmd_dpaa_set_tx_loopback’
 rte_pmd_dpaa_set_tx_loopback(uint8_t port, uint8_t on)
 ^~~~~~~~~~~~~~~~~~~~~~~~~~~~
In file included from /root/UB1804-64_K4.15.0_GCC7.3.0/x86_64-native-linuxapp-gcc/05eb8bd802684e989f7218ee05e08042/dpdk/drivers/net/dpaa/dpaa_ethdev.c:42:0:
--
 rte_pmd_dpaa_set_tx_loopback(uint16_t port, uint8_t on);
 ^~~~~~~~~~~~~~~~~~~~~~~~~~~~
cc1: warning: unrecognized command line option ‘-Wno-address-of-packed-member’
/root/UB1804-64_K4.15.0_GCC7.3.0/x86_64-native-linuxapp-gcc/05eb8bd802684e989f7218ee05e08042/dpdk/mk/internal/rte.compile-pre.mk:114: recipe for target 'dpaa_ethdev.o' failed
make[6]: *** [dpaa_ethdev.o] Error 1
make[6]: *** Waiting for unfinished jobs....
  CC bnx2x_stats.o
  CC caam_jr_uio.o
--
  CC rte_eth_bond_8023ad.o
  CC base/dpaa2_hw_dpni.o
  CC e1000_base.o
/root/UB1804-64_K4.15.0_GCC7.3.0/x86_64-native-linuxapp-gcc/05eb8bd802684e989f7218ee05e08042/dpdk/mk/rte.subdir.mk:35: recipe for target 'dpaa' failed
make[5]: *** [dpaa] Error 2
make[5]: *** Waiting for unfinished jobs....
  CC rte_eth_bond_alb.o
  CC bnx2x_vfpf.o
--
  LD igb_ethdev.o
  AR librte_pmd_e1000.a
  INSTALL-LIB librte_pmd_e1000.a
/root/UB1804-64_K4.15.0_GCC7.3.0/x86_64-native-linuxapp-gcc/05eb8bd802684e989f7218ee05e08042/dpdk/mk/rte.subdir.mk:35: recipe for target 'net' failed
make[4]: *** [net] Error 2
/root/UB1804-64_K4.15.0_GCC7.3.0/x86_64-native-linuxapp-gcc/05eb8bd802684e989f7218ee05e08042/dpdk/mk/rte.sdkbuild.mk:51: recipe for target 'drivers' failed
make[3]: *** [drivers] Error 2
/root/UB1804-64_K4.15.0_GCC7.3.0/x86_64-native-linuxapp-gcc/05eb8bd802684e989f7218ee05e08042/dpdk/mk/rte.sdkroot.mk:113: recipe for target 'all' failed
make[2]: *** [all] Error 2
/root/UB1804-64_K4.15.0_GCC7.3.0/x86_64-native-linuxapp-gcc/05eb8bd802684e989f7218ee05e08042/dpdk/mk/rte.sdkinstall.mk:60: recipe for target 'pre_install' failed
make[1]: *** [pre_install] Error 2
/root/UB1804-64_K4.15.0_GCC7.3.0/x86_64-native-linuxapp-gcc/05eb8bd802684e989f7218ee05e08042/dpdk/mk/rte.sdkroot.mk:92: recipe for target 'install' failed
make: *** [install] Error 2


*Makefile Build Failed #12:
OS: UB2004-32
Target: i686-native-linuxapp-gcc
  CC cxgbe_ethdev.o.pmd.o
  LD cxgbe_ethdev.o
  CC rte_eth_bond_pmd.o
/root/UB2004-32_K4.15.0_GCC9.3.0/i686-native-linuxapp-gcc/05eb8bd802684e989f7218ee05e08042/dpdk/drivers/net/dpaa/dpaa_ethdev.c:1231:1: error: conflicting types for ‘rte_pmd_dpaa_set_tx_loopback’
 1231 | rte_pmd_dpaa_set_tx_loopback(uint8_t port, uint8_t on)
      | ^~~~~~~~~~~~~~~~~~~~~~~~~~~~
In file included from /root/UB2004-32_K4.15.0_GCC9.3.0/i686-native-linuxapp-gcc/05eb8bd802684e989f7218ee05e08042/dpdk/drivers/net/dpaa/dpaa_ethdev.c:42:
/root/UB2004-32_K4.15.0_GCC9.3.0/i686-native-linuxapp-gcc/05eb8bd802684e989f7218ee05e08042/dpdk/drivers/net/dpaa/rte_pmd_dpaa.h:32:1: note: previous declaration of ‘rte_pmd_dpaa_set_tx_loopback’ was here
   32 | rte_pmd_dpaa_set_tx_loopback(uint16_t port, uint8_t on);
      | ^~~~~~~~~~~~~~~~~~~~~~~~~~~~
make[6]: *** [/root/UB2004-32_K4.15.0_GCC9.3.0/i686-native-linuxapp-gcc/05eb8bd802684e989f7218ee05e08042/dpdk/mk/internal/rte.compile-pre.mk:116: dpaa_ethdev.o] Error 1
make[5]: *** [/root/UB2004-32_K4.15.0_GCC9.3.0/i686-native-linuxapp-gcc/05eb8bd802684e989f7218ee05e08042/dpdk/mk/rte.subdir.mk:37: dpaa] Error 2
make[5]: *** Waiting for unfinished jobs....
  CC rte_eth_bond_args.o
  CC cxgbevf_ethdev.o
--
  INSTALL-LIB librte_pmd_caam_jr.a
  AR librte_pmd_cxgbe.a
  INSTALL-LIB librte_pmd_cxgbe.a
make[4]: *** [/root/UB2004-32_K4.15.0_GCC9.3.0/i686-native-linuxapp-gcc/05eb8bd802684e989f7218ee05e08042/dpdk/mk/rte.subdir.mk:35: net] Error 2
make[3]: *** [/root/UB2004-32_K4.15.0_GCC9.3.0/i686-native-linuxapp-gcc/05eb8bd802684e989f7218ee05e08042/dpdk/mk/rte.sdkbuild.mk:53: drivers] Error 2
make[2]: *** [/root/UB2004-32_K4.15.0_GCC9.3.0/i686-native-linuxapp-gcc/05eb8bd802684e989f7218ee05e08042/dpdk/mk/rte.sdkroot.mk:115: all] Error 2
make[1]: *** [/root/UB2004-32_K4.15.0_GCC9.3.0/i686-native-linuxapp-gcc/05eb8bd802684e989f7218ee05e08042/dpdk/mk/rte.sdkinstall.mk:61: pre_install] Error 2
make: *** [/root/UB2004-32_K4.15.0_GCC9.3.0/i686-native-linuxapp-gcc/05eb8bd802684e989f7218ee05e08042/dpdk/mk/rte.sdkroot.mk:92: install] Error 2


*Makefile Build Failed #13:
OS: UB2004-64
Target: x86_64-native-linuxapp-clang
  CC zlib_pmd_ops.o
  CC axgbe_rxtx_vec_sse.o
  AR librte_pmd_qat.a
/root/UB2004-64_K5.4.0_Clang10.0.0/x86_64-native-linuxapp-clang/05eb8bd802684e989f7218ee05e08042/dpdk/drivers/net/dpaa/dpaa_ethdev.c:1231:1: error: conflicting types for 'rte_pmd_dpaa_set_tx_loopback'
rte_pmd_dpaa_set_tx_loopback(uint8_t port, uint8_t on)
^
/root/UB2004-64_K5.4.0_Clang10.0.0/x86_64-native-linuxapp-clang/05eb8bd802684e989f7218ee05e08042/dpdk/drivers/net/dpaa/rte_pmd_dpaa.h:32:1: note: previous declaration is here
--
^
1 error generated.
  INSTALL-LIB librte_pmd_qat.a
make[6]: *** [/root/UB2004-64_K5.4.0_Clang10.0.0/x86_64-native-linuxapp-clang/05eb8bd802684e989f7218ee05e08042/dpdk/mk/internal/rte.compile-pre.mk:116: dpaa_ethdev.o] Error 1
make[5]: *** [/root/UB2004-64_K5.4.0_Clang10.0.0/x86_64-native-linuxapp-clang/05eb8bd802684e989f7218ee05e08042/dpdk/mk/rte.subdir.mk:37: dpaa] Error 2
make[5]: *** Waiting for unfinished jobs....
== Build drivers/crypto/octeontx2
== Build drivers/crypto/openssl
--
== Build drivers/crypto/nitrox
  AR librte_pmd_bnx2x.a
  INSTALL-LIB librte_pmd_bnx2x.a
make[4]: *** [/root/UB2004-64_K5.4.0_Clang10.0.0/x86_64-native-linuxapp-clang/05eb8bd802684e989f7218ee05e08042/dpdk/mk/rte.subdir.mk:35: net] Error 2
make[4]: *** Waiting for unfinished jobs....
  CC scheduler_multicore.o
  CC virtio_rxtx.o
--
  AR librte_pmd_crypto_scheduler.a
  INSTALL-LIB librte_pmd_crypto_scheduler.a
  INSTALL-LIB librte_pmd_dpaa2_sec.a
make[3]: *** [/root/UB2004-64_K5.4.0_Clang10.0.0/x86_64-native-linuxapp-clang/05eb8bd802684e989f7218ee05e08042/dpdk/mk/rte.sdkbuild.mk:51: drivers] Error 2
make[2]: *** [/root/UB2004-64_K5.4.0_Clang10.0.0/x86_64-native-linuxapp-clang/05eb8bd802684e989f7218ee05e08042/dpdk/mk/rte.sdkroot.mk:115: all] Error 2
make[1]: *** [/root/UB2004-64_K5.4.0_Clang10.0.0/x86_64-native-linuxapp-clang/05eb8bd802684e989f7218ee05e08042/dpdk/mk/rte.sdkinstall.mk:61: pre_install] Error 2
make: *** [/root/UB2004-64_K5.4.0_Clang10.0.0/x86_64-native-linuxapp-clang/05eb8bd802684e989f7218ee05e08042/dpdk/mk/rte.sdkroot.mk:92: install] Error 2


*Makefile Build Failed #14:
OS: UB2004-64
Target: x86_64-native-linuxapp-gcc
  INSTALL-LIB librte_pmd_caam_jr.a
  CC virtio_cryptodev.o
  CC t4_hw.o
/root/UB2004-64_K5.4.0_GCC9.3.0/x86_64-native-linuxapp-gcc/05eb8bd802684e989f7218ee05e08042/dpdk/drivers/net/dpaa/dpaa_ethdev.c:1231:1: error: conflicting types for ‘rte_pmd_dpaa_set_tx_loopback’
 1231 | rte_pmd_dpaa_set_tx_loopback(uint8_t port, uint8_t on)
      | ^~~~~~~~~~~~~~~~~~~~~~~~~~~~
In file included from /root/UB2004-64_K5.4.0_GCC9.3.0/x86_64-native-linuxapp-gcc/05eb8bd802684e989f7218ee05e08042/dpdk/drivers/net/dpaa/dpaa_ethdev.c:42:
--
   32 | rte_pmd_dpaa_set_tx_loopback(uint16_t port, uint8_t on);
      | ^~~~~~~~~~~~~~~~~~~~~~~~~~~~
  CC nitrox_qp.o
make[6]: *** [/root/UB2004-64_K5.4.0_GCC9.3.0/x86_64-native-linuxapp-gcc/05eb8bd802684e989f7218ee05e08042/dpdk/mk/internal/rte.compile-pre.mk:116: dpaa_ethdev.o] Error 1
make[5]: *** [/root/UB2004-64_K5.4.0_GCC9.3.0/x86_64-native-linuxapp-gcc/05eb8bd802684e989f7218ee05e08042/dpdk/mk/rte.subdir.mk:37: dpaa] Error 2
make[5]: *** Waiting for unfinished jobs....
  CC clip_tbl.o
  CC mps_tcam.o
--
  INSTALL-LIB librte_pmd_bnx2x.a
  AR librte_pmd_dpaa2.a
  INSTALL-LIB librte_pmd_dpaa2.a
make[4]: *** [/root/UB2004-64_K5.4.0_GCC9.3.0/x86_64-native-linuxapp-gcc/05eb8bd802684e989f7218ee05e08042/dpdk/mk/rte.subdir.mk:35: net] Error 2
make[3]: *** [/root/UB2004-64_K5.4.0_GCC9.3.0/x86_64-native-linuxapp-gcc/05eb8bd802684e989f7218ee05e08042/dpdk/mk/rte.sdkbuild.mk:51: drivers] Error 2
make[2]: *** [/root/UB2004-64_K5.4.0_GCC9.3.0/x86_64-native-linuxapp-gcc/05eb8bd802684e989f7218ee05e08042/dpdk/mk/rte.sdkroot.mk:115: all] Error 2
make[1]: *** [/root/UB2004-64_K5.4.0_GCC9.3.0/x86_64-native-linuxapp-gcc/05eb8bd802684e989f7218ee05e08042/dpdk/mk/rte.sdkinstall.mk:61: pre_install] Error 2
make: *** [/root/UB2004-64_K5.4.0_GCC9.3.0/x86_64-native-linuxapp-gcc/05eb8bd802684e989f7218ee05e08042/dpdk/mk/rte.sdkroot.mk:92: install] Error 2
DPDK STV team

^ permalink raw reply	[flat|nested] 2+ messages in thread

* [dpdk-test-report] |FAILURE| pw(73784) [v20.11] net/dpaa: fix public API port ID type
@ 2020-07-12  2:27 sys_stv
  0 siblings, 0 replies; 2+ messages in thread
From: sys_stv @ 2020-07-12  2:27 UTC (permalink / raw)
  To: test-report

[-- Attachment #1: Type: text/plain, Size: 57323 bytes --]


Test-Label: Intel-compilation
Test-Status: FAILURE
http://dpdk.org/patch/73784

_Compilation issues_

Submitter: Ferruh Yigit <ferruh.yigit@intel.com>
Date: 2020-07-10 21:52:17
Reply_mail: 20200710215217.1409242-1-ferruh.yigit@intel.com

DPDK git baseline: Repo:dpdk-next-net, CommitID: 76704fd5b49115b0b4849e1a472323cd4d0f75b4


Meson build Summary: 8 Builds Done, 3 Successful, 5 Failures, 0 Blocked

Makefile build Summary: 20 Builds Done, 6 Successful, 14 Failures, 0 Blocked

                +==============================================+===========+==========+
                |                   Makefile                   |   Meson   | Document |
+----------------+------+-------+------+------------+-----------+-----------+----------+
| os             | gcc  | clang | icc  | gcc+shared | gcc+debug | gcc/clang | pdf/html |
+----------------+------+-------+------+------------+-----------+-----------+----------+
| CENTOS82-64    | FAIL | FAIL  | pass | FAIL       | FAIL      | FAIL      |          |
| RHEL82-64      | FAIL |       |      |            |           |           |          |
| UB1804-64      | FAIL |       |      |            |           |           |          |
| FC32-64        | FAIL | FAIL  |      |            |           | FAIL      |          |
| CENTOS77-64    | FAIL |       |      |            |           |           |          |
| UB2004-64      | FAIL | FAIL  | pass |            |           | FAIL      | pass     |
| WIN10-64       |      |       |      |            |           | pass      |          |
| UB2004-32      | FAIL |       |      |            |           |           |          |
| UB1804-32      |      |       |      |            |           | FAIL      |          |
| FreeBSD1201-64 | pass | pass  |      | pass       | pass      | pass      |          |
| SUSE15-64      | FAIL | FAIL  |      |            |           | FAIL      |          |
+----------------+------+-------+------+------------+-----------+-----------+----------+
Test environment and configuration as below:

** Makefile build **


OS: CENTOS82-64
	Kernel Version: 4.18.0-193.el8.x86_64
	CPU info: Intel(R) Xeon(R) Platinum 8280M CPU @ 2.70GHz
	GCC Version: gcc (GCC) 8.3.1 20191121 (Red Hat 8.3.1-5)
	Clang Version: 9.0.1 (Red Hat 9.0.1-2.module_el8.2.0+309+0c7b6b03)
	x86_64-native-linuxapp-gcc
	x86_64-native-linuxapp-clang
	x86_64-native-linuxapp-icc
	x86_64-native-linuxapp-gcc+shared
	x86_64-native-linuxapp-gcc+debug


OS: RHEL82-64
	Kernel Version: 4.18.0-193.el8.x86_64
	CPU info: Intel(R) Xeon(R) Platinum 8280M CPU @ 2.70GHz
	GCC Version: gcc (GCC) 8.3.1 20191121 (Red Hat 8.3.1-5)
	Clang Version: 8.0.1 (Red Hat 8.0.1-1.module_el8.1.0+215+a01033fb)
	x86_64-native-linuxapp-gcc


OS: UB1804-64
	Kernel Version: 4.15.0-29-generic
	CPU info: Intel(R) Xeon(R) Platinum 8180 CPU @ 2.50GHz
	GCC Version: gcc (Ubuntu 7.5.0-3ubuntu1~18.04) 7.5.0
	Clang Version: 6.0.0-1ubuntu2 (tags/RELEASE_600/final)
	x86_64-native-linuxapp-gcc


OS: FC32-64
	Kernel Version: 5.6.0-0.rc7.git0.2.fc32.x86_64
	CPU info: Intel(R) Xeon(R) Platinum 8280M CPU @ 2.70GHz
	GCC Version: gcc (GCC) 10.0.1 20200311 (Red Hat 10.0.1-0.9)
	Clang Version: 10.0.0 (Fedora 10.0.0-0.3.rc4.fc32)
	x86_64-native-linuxapp-gcc
	x86_64-native-linuxapp-clang


OS: CENTOS77-64
	Kernel Version: 3.10.0-1062.9.1.el7.x86_64
	CPU info: Intel(R) Xeon(R) Platinum 8280M CPU @ 2.70GHz
	GCC Version: gcc (GCC) 4.8.5 20150623 (Red Hat 4.8.5-39)
	Clang Version: 3.4.2 (tags/RELEASE_34/dot2-final)
	x86_64-native-linuxapp-gcc


OS: UB2004-64
	Kernel Version: 5.4.0-26-generic
	CPU info: Intel(R) Xeon(R) Platinum 8180 CPU @ 2.50GHz
	GCC Version: gcc (Ubuntu 10-20200416-0ubuntu1) 10.0.1 20200416 (experimental) [master revision 3c3f12e2a76:dcee354ce56:44b326839d864fc10c459916abcc97f35a9ac3de]
	Clang Version: 10.0.0-4ubuntu1
	x86_64-native-linuxapp-clang
	x86_64-native-linuxapp-gcc
	x86_64-native-linuxapp-icc


OS: UB2004-32
	Kernel Version: 5.4.0-26-generic
	CPU info: Intel(R) Xeon(R) Platinum 8180 CPU @ 2.50GHz
	GCC Version: gcc (Ubuntu 9.3.0-10ubuntu2) 9.3.0
	Clang Version: 10.0.0-4ubuntu1
	i686-native-linuxapp-gcc


OS: FreeBSD1201-64
	Kernel Version: 12.1-RELEASE
	CPU info: Intel(R) Xeon(R) CPU E5-2699 v3 @ 2.30GHz (2294.74-MHz K8-class CPU)
	GCC Version: gcc (FreeBSD Ports Collection) 9.2.0
	Clang Version: 8.0.1 (tags/RELEASE_801/final 366581) (based on LLVM 8.0.1)
	x86_64-native-bsdapp-gcc
	x86_64-native-bsdapp-clang
	x86_64-native-bsdapp-gcc+shared
	x86_64-native-bsdapp-gcc+debug


OS: SUSE15-64
	Kernel Version: 4.12.14-lp150.11-default
	CPU info: Intel(R) Xeon(R) CPU E5-2699 v4 @ 2.20GHz
	GCC Version: gcc (SUSE Linux) 7.3.1 20180323 [gcc-7-branch revision 258812]
	Clang Version: 5.0.1 (tags/RELEASE_501/final 312548)
	x86_64-native-linuxapp-clang
	x86_64-native-linuxapp-gcc

** Meson build **


OS: CENTOS82-64
	Kernel Version: 4.18.0-193.el8.x86_64
	CPU info: Intel(R) Xeon(R) CPU E5-2699 v4 @ 2.20GHz
	GCC Version: gcc (GCC) 8.3.1 20191121 (Red Hat 8.3.1-5)
	Clang Version: 9.0.1 (Red Hat 9.0.1-2.module_el8.2.0+309+0c7b6b03)
	./build-gcc-static
	./build-gcc-shared
	./build-clang-static
	./build-clang-shared
	./build-x86-default


OS: UB2004-64
	Kernel Version: 5.4.0-26-generic
	CPU info: Intel(R) Xeon(R) Platinum 8180 CPU @ 2.50GHz
	GCC Version: gcc (Ubuntu 9.3.0-10ubuntu2) 9.3.0
	Clang Version: 10.0.0-4ubuntu1
	x86_64-native-linuxapp-doc
	./build-gcc-static
	./build-gcc-shared
	./build-clang-static
	./build-clang-shared
	./build-x86-default


OS: FC32-64
	Kernel Version: 5.6.0-0.rc7.git0.2.fc32.x86_64
	CPU info: Intel(R) Xeon(R) CPU E5-2699 v4 @ 2.20GHz
	GCC Version: gcc (GCC) 10.0.1 20200311 (Red Hat 10.0.1-0.9)
	Clang Version: 10.0.0 (Fedora 10.0.0-0.3.rc4.fc32)
	./build-gcc-static
	./build-gcc-shared
	./build-clang-static
	./build-clang-shared
	./build-x86-default


OS: WIN10-64
	Kernel Version: N/A
	CPU info: N/A
	GCC Version: N/A
	Clang Version: Clang 8.0.0
	x86_64-windows-clang


OS: UB1804-32
	Kernel Version: 4.15.0-20-generic
	CPU info: Intel(R) Xeon(R) CPU E5-2699 v4 @ 2.20GHz
	GCC Version: gcc (Ubuntu 7.5.0-3ubuntu1~18.04) 7.5.0
	Clang Version: 6.0.0-1ubuntu2 (tags/RELEASE_600/final)
	./build-gcc-static
	./build-gcc-shared
	./build-clang-static
	./build-clang-shared
	./build-x86-default


OS: FreeBSD1201-64
	Kernel Version: 12.1-RELEASE
	CPU info: Intel(R) Xeon(R) CPU E5-2699 v4 @ 2.20GHz (2194.97-MHz K8-class CPU)
	GCC Version: gcc (FreeBSD Ports Collection) 9.2.0
	Clang Version: 8.0.1 (tags/RELEASE_801/final 366581) (based on LLVM 8.0.1)
	./build-gcc-static
	./build-gcc-shared
	./build-clang-static
	./build-clang-shared
	./build-x86-default


OS: SUSE15-64
	Kernel Version: 4.12.14-lp150.12.82-default
	CPU info: Intel(R) Xeon(R) CPU E5-2699 v4 @ 2.20GHz
	GCC Version: gcc (SUSE Linux) 7.4.1 20190905 [gcc-7-branch revision 275407]
	Clang Version: 5.0.1 (tags/RELEASE_501/final 312548)
	./build-gcc-static
	./build-gcc-shared
	./build-clang-static
	./build-clang-shared
	./build-x86-default



*Meson Build Failed #1:
OS: CENTOS82-64
Target:./build-gcc-static
FAILED: drivers/a715181@@tmp_rte_pmd_dpaa@sta/net_dpaa_dpaa_ethdev.c.o 
gcc -Idrivers/a715181@@tmp_rte_pmd_dpaa@sta -Idrivers -I../drivers -Idrivers/net/dpaa -I../drivers/net/dpaa -Ilib/librte_ethdev -I../lib/librte_ethdev -I. -I../ -Iconfig -I../config -Ilib/librte_eal/include -I../lib/librte_eal/include -Ilib/librte_eal/linux/include -I../lib/librte_eal/linux/include -Ilib/librte_eal/x86/include -I../lib/librte_eal/x86/include -Ilib/librte_eal/common -I../lib/librte_eal/common -Ilib/librte_eal -I../lib/librte_eal -Ilib/librte_kvargs -I../lib/librte_kvargs -Ilib/librte_telemetry/../librte_metrics -I../lib/librte_telemetry/../librte_metrics -Ilib/librte_telemetry -I../lib/librte_telemetry -Ilib/librte_net -I../lib/librte_net -Ilib/librte_mbuf -I../lib/librte_mbuf -Ilib/librte_mempool -I../lib/librte_mempool -Ilib/librte_ring -I../lib/librte_ring -Ilib/librte_meter -I../lib/librte_meter -Idrivers/bus/pci -I../drivers/bus/pci -I../drivers/bus/pci/linux -Ilib/librte_pci -I../lib/librte_pci -Idrivers/bus/vdev -I../drivers/bus/vdev -Idrivers/mempool/dpaa -I../drivers/mempool/dpaa -Idrivers/bus/dpaa -I../drivers/bus/dpaa -I../drivers/bus/dpaa/include -I../drivers/bus/dpaa/base/qbman -Idrivers/common/dpaax -I../drivers/common/dpaax -I../drivers/common/dpaax/caamflib -Ilib/librte_eventdev -I../lib/librte_eventdev -Ilib/librte_hash -I../lib/librte_hash -Ilib/librte_timer -I../lib/librte_timer -Ilib/librte_cryptodev -I../lib/librte_cryptodev -fdiagnostics-color=always -pipe -D_FILE_OFFSET_BITS=64 -Wall -Winvalid-pch -Werror -O2 -g -include rte_config.h -Wextra -Wcast-qual -Wdeprecated -Wformat-nonliteral -Wformat-security -Wmissing-declarations -Wmissing-prototypes -Wnested-externs -Wold-style-definition -Wpointer-arith -Wsign-compare -Wstrict-prototypes -Wundef -Wwrite-strings -Wno-packed-not-aligned -Wno-missing-field-initializers -D_GNU_SOURCE -fPIC -march=native -mno-avx512f -DALLOW_EXPERIMENTAL_API -DALLOW_INTERNAL_API -Wno-format-truncation -Wno-pointer-arith -MD -MQ 'drivers/a715181@@tmp_rte_pmd_dpaa@sta/net_dpaa_dpaa_ethdev.c.o' -MF 'drivers/a715181@@tmp_rte_pmd_dpaa@sta/net_dpaa_dpaa_ethdev.c.o.d' -o 'drivers/a715181@@tmp_rte_pmd_dpaa@sta/net_dpaa_dpaa_ethdev.c.o' -c ../drivers/net/dpaa/dpaa_ethdev.c
../drivers/net/dpaa/dpaa_ethdev.c:1231:1: error: conflicting types for ‘rte_pmd_dpaa_set_tx_loopback’
 rte_pmd_dpaa_set_tx_loopback(uint8_t port, uint8_t on)
 ^~~~~~~~~~~~~~~~~~~~~~~~~~~~
In file included from ../drivers/net/dpaa/dpaa_ethdev.c:42:
../drivers/net/dpaa/rte_pmd_dpaa.h:32:1: note: previous declaration of ‘rte_pmd_dpaa_set_tx_loopback’ was here
 rte_pmd_dpaa_set_tx_loopback(uint16_t port, uint8_t on);
 ^~~~~~~~~~~~~~~~~~~~~~~~~~~~
[959/2388] Compiling C object 'drivers/a715181@@tmp_rte_pmd_cxgbe@sta/net_cxgbe_cxgbe_filter.c.o'.
[960/2388] Generating rte_pmd_bnxt.pmd.c with a custom command.
[961/2388] Generating pipeline.sym_chk with a meson_exe.py custom command.
[962/2388] Compiling C object 'drivers/a715181@@tmp_rte_pmd_cxgbe@sta/net_cxgbe_base_t4vf_hw.c.o'.
[963/2388] Compiling C object 'drivers/a715181@@tmp_rte_pmd_dpaa2@sta/net_dpaa2_base_dpaa2_hw_dpni.c.o'.
[964/2388] Compiling C object 'drivers/a715181@@tmp_rte_pmd_dpaa2@sta/net_dpaa2_dpaa2_mux.c.o'.
[965/2388] Compiling C object 'drivers/a715181@@tmp_rte_pmd_cxgbe@sta/net_cxgbe_base_t4_hw.c.o'.
[966/2388] Compiling C object 'drivers/a715181@@tmp_rte_pmd_cxgbe@sta/net_cxgbe_sge.c.o'.
[967/2388] Compiling C object 'drivers/a715181@@tmp_rte_pmd_dpaa2@sta/net_dpaa2_dpaa2_ethdev.c.o'.
[968/2388] Compiling C object 'drivers/a715181@@tmp_rte_pmd_dpaa2@sta/net_dpaa2_dpaa2_flow.c.o'.
[969/2388] Compiling C object 'drivers/a715181@@tmp_rte_pmd_dpaa@sta/net_dpaa_dpaa_rxtx.c.o'.
ninja: build stopped: subcommand failed




*Meson Build Failed #2:
OS: FC32-64
Target:./build-gcc-static
FAILED: drivers/a715181@@tmp_rte_pmd_dpaa@sta/net_dpaa_dpaa_ethdev.c.o 
gcc -Idrivers/a715181@@tmp_rte_pmd_dpaa@sta -Idrivers -I../drivers -Idrivers/net/dpaa -I../drivers/net/dpaa -Ilib/librte_ethdev -I../lib/librte_ethdev -I. -I../ -Iconfig -I../config -Ilib/librte_eal/include -I../lib/librte_eal/include -Ilib/librte_eal/linux/include -I../lib/librte_eal/linux/include -Ilib/librte_eal/x86/include -I../lib/librte_eal/x86/include -Ilib/librte_eal/common -I../lib/librte_eal/common -Ilib/librte_eal -I../lib/librte_eal -Ilib/librte_kvargs -I../lib/librte_kvargs -Ilib/librte_telemetry/../librte_metrics -I../lib/librte_telemetry/../librte_metrics -Ilib/librte_telemetry -I../lib/librte_telemetry -Ilib/librte_net -I../lib/librte_net -Ilib/librte_mbuf -I../lib/librte_mbuf -Ilib/librte_mempool -I../lib/librte_mempool -Ilib/librte_ring -I../lib/librte_ring -Ilib/librte_meter -I../lib/librte_meter -Idrivers/bus/pci -I../drivers/bus/pci -I../drivers/bus/pci/linux -Ilib/librte_pci -I../lib/librte_pci -Idrivers/bus/vdev -I../drivers/bus/vdev -Idrivers/mempool/dpaa -I../drivers/mempool/dpaa -Idrivers/bus/dpaa -I../drivers/bus/dpaa -I../drivers/bus/dpaa/include -I../drivers/bus/dpaa/base/qbman -Idrivers/common/dpaax -I../drivers/common/dpaax -I../drivers/common/dpaax/caamflib -Ilib/librte_eventdev -I../lib/librte_eventdev -Ilib/librte_hash -I../lib/librte_hash -Ilib/librte_timer -I../lib/librte_timer -Ilib/librte_cryptodev -I../lib/librte_cryptodev -fdiagnostics-color=always -pipe -D_FILE_OFFSET_BITS=64 -Wall -Winvalid-pch -Werror -O2 -g -include rte_config.h -Wextra -Wcast-qual -Wdeprecated -Wformat-nonliteral -Wformat-security -Wmissing-declarations -Wmissing-prototypes -Wnested-externs -Wold-style-definition -Wpointer-arith -Wsign-compare -Wstrict-prototypes -Wundef -Wwrite-strings -Wno-address-of-packed-member -Wno-packed-not-aligned -Wno-missing-field-initializers -Wno-zero-length-bounds -D_GNU_SOURCE -fPIC -march=native -DALLOW_EXPERIMENTAL_API -DALLOW_INTERNAL_API -Wno-format-truncation -Wno-pointer-arith -MD -MQ 'drivers/a715181@@tmp_rte_pmd_dpaa@sta/net_dpaa_dpaa_ethdev.c.o' -MF 'drivers/a715181@@tmp_rte_pmd_dpaa@sta/net_dpaa_dpaa_ethdev.c.o.d' -o 'drivers/a715181@@tmp_rte_pmd_dpaa@sta/net_dpaa_dpaa_ethdev.c.o' -c ../drivers/net/dpaa/dpaa_ethdev.c
../drivers/net/dpaa/dpaa_ethdev.c:1231:1: error: conflicting types for ‘rte_pmd_dpaa_set_tx_loopback’
 1231 | rte_pmd_dpaa_set_tx_loopback(uint8_t port, uint8_t on)
      | ^~~~~~~~~~~~~~~~~~~~~~~~~~~~
In file included from ../drivers/net/dpaa/dpaa_ethdev.c:42:
../drivers/net/dpaa/rte_pmd_dpaa.h:32:1: note: previous declaration of ‘rte_pmd_dpaa_set_tx_loopback’ was here
   32 | rte_pmd_dpaa_set_tx_loopback(uint16_t port, uint8_t on);
      | ^~~~~~~~~~~~~~~~~~~~~~~~~~~~
[963/2389] Compiling C object 'drivers/a715181@@tmp_rte_pmd_cxgbe@sta/net_cxgbe_base_t4vf_hw.c.o'.
[964/2389] Generating rte_pmd_bnxt.sym_chk with a meson_exe.py custom command.
[965/2389] Compiling C object 'drivers/a715181@@tmp_rte_pmd_dpaa2@sta/net_dpaa2_dpaa2_mux.c.o'.
[966/2389] Compiling C object 'drivers/a715181@@tmp_rte_pmd_dpaa2@sta/net_dpaa2_base_dpaa2_hw_dpni.c.o'.
[967/2389] Compiling C object 'drivers/a715181@@tmp_rte_pmd_dpaa2@sta/net_dpaa2_dpaa2_sparser.c.o'.
[968/2389] Compiling C object 'drivers/a715181@@tmp_rte_pmd_dpaa2@sta/net_dpaa2_dpaa2_ethdev.c.o'.
[969/2389] Compiling C object 'lib/76b5a35@@rte_pipeline@sta/librte_pipeline_rte_table_action.c.o'.
[970/2389] Compiling C object 'drivers/a715181@@tmp_rte_pmd_cxgbe@sta/net_cxgbe_base_t4_hw.c.o'.
[971/2389] Compiling C object 'drivers/a715181@@tmp_rte_pmd_dpaa@sta/net_dpaa_dpaa_rxtx.c.o'.
[972/2389] Compiling C object 'drivers/a715181@@tmp_rte_pmd_dpaa2@sta/net_dpaa2_dpaa2_rxtx.c.o'.
[973/2389] Compiling C object 'drivers/a715181@@tmp_rte_pmd_dpaa2@sta/net_dpaa2_dpaa2_flow.c.o'.
ninja: build stopped: subcommand failed




*Meson Build Failed #3:
OS: SUSE15-64
Target:./build-gcc-static
FAILED: drivers/a715181@@tmp_rte_pmd_dpaa@sta/net_dpaa_dpaa_ethdev.c.o 
gcc -Idrivers/a715181@@tmp_rte_pmd_dpaa@sta -Idrivers -I../drivers -Idrivers/net/dpaa -I../drivers/net/dpaa -Ilib/librte_ethdev -I../lib/librte_ethdev -I. -I../ -Iconfig -I../config -Ilib/librte_eal/include -I../lib/librte_eal/include -Ilib/librte_eal/linux/include -I../lib/librte_eal/linux/include -Ilib/librte_eal/x86/include -I../lib/librte_eal/x86/include -Ilib/librte_eal/common -I../lib/librte_eal/common -Ilib/librte_eal -I../lib/librte_eal -Ilib/librte_kvargs -I../lib/librte_kvargs -Ilib/librte_telemetry/../librte_metrics -I../lib/librte_telemetry/../librte_metrics -Ilib/librte_telemetry -I../lib/librte_telemetry -Ilib/librte_net -I../lib/librte_net -Ilib/librte_mbuf -I../lib/librte_mbuf -Ilib/librte_mempool -I../lib/librte_mempool -Ilib/librte_ring -I../lib/librte_ring -Ilib/librte_meter -I../lib/librte_meter -Idrivers/bus/pci -I../drivers/bus/pci -I../drivers/bus/pci/linux -Ilib/librte_pci -I../lib/librte_pci -Idrivers/bus/vdev -I../drivers/bus/vdev -Idrivers/mempool/dpaa -I../drivers/mempool/dpaa -Idrivers/bus/dpaa -I../drivers/bus/dpaa -I../drivers/bus/dpaa/include -I../drivers/bus/dpaa/base/qbman -Idrivers/common/dpaax -I../drivers/common/dpaax -I../drivers/common/dpaax/caamflib -Ilib/librte_eventdev -I../lib/librte_eventdev -Ilib/librte_hash -I../lib/librte_hash -Ilib/librte_timer -I../lib/librte_timer -Ilib/librte_cryptodev -I../lib/librte_cryptodev -fdiagnostics-color=always -pipe -D_FILE_OFFSET_BITS=64 -Wall -Winvalid-pch -Werror -O2 -g -include rte_config.h -Wextra -Wcast-qual -Wdeprecated -Wformat-nonliteral -Wformat-security -Wmissing-declarations -Wmissing-prototypes -Wnested-externs -Wold-style-definition -Wpointer-arith -Wsign-compare -Wstrict-prototypes -Wundef -Wwrite-strings -Wno-missing-field-initializers -D_GNU_SOURCE -fPIC -march=native -DALLOW_EXPERIMENTAL_API -DALLOW_INTERNAL_API -Wno-format-truncation -Wno-pointer-arith -MD -MQ 'drivers/a715181@@tmp_rte_pmd_dpaa@sta/net_dpaa_dpaa_ethdev.c.o' -MF 'drivers/a715181@@tmp_rte_pmd_dpaa@sta/net_dpaa_dpaa_ethdev.c.o.d' -o 'drivers/a715181@@tmp_rte_pmd_dpaa@sta/net_dpaa_dpaa_ethdev.c.o' -c ../drivers/net/dpaa/dpaa_ethdev.c
../drivers/net/dpaa/dpaa_ethdev.c:1231:1: error: conflicting types for ‘rte_pmd_dpaa_set_tx_loopback’
 rte_pmd_dpaa_set_tx_loopback(uint8_t port, uint8_t on)
 ^~~~~~~~~~~~~~~~~~~~~~~~~~~~
In file included from ../drivers/net/dpaa/dpaa_ethdev.c:42:0:
../drivers/net/dpaa/rte_pmd_dpaa.h:32:1: note: previous declaration of ‘rte_pmd_dpaa_set_tx_loopback’ was here
 rte_pmd_dpaa_set_tx_loopback(uint16_t port, uint8_t on);
 ^~~~~~~~~~~~~~~~~~~~~~~~~~~~
[963/2283] Compiling C object 'drivers/a715181@@tmp_rte_pmd_cxgbe@sta/net_cxgbe_base_t4vf_hw.c.o'.
[964/2283] Generating rte_pmd_bnxt.pmd.c with a custom command.
[965/2283] Compiling C object 'drivers/a715181@@tmp_rte_pmd_dpaa2@sta/net_dpaa2_base_dpaa2_hw_dpni.c.o'.
[966/2283] Compiling C object 'drivers/a715181@@tmp_rte_pmd_dpaa2@sta/net_dpaa2_dpaa2_mux.c.o'.
[967/2283] Compiling C object 'drivers/a715181@@tmp_rte_pmd_cxgbe@sta/net_cxgbe_sge.c.o'.
[968/2283] Compiling C object 'drivers/a715181@@tmp_rte_pmd_cxgbe@sta/net_cxgbe_base_t4_hw.c.o'.
[969/2283] Compiling C object 'drivers/a715181@@tmp_rte_pmd_dpaa2@sta/net_dpaa2_dpaa2_ethdev.c.o'.
[970/2283] Compiling C object 'drivers/a715181@@tmp_rte_pmd_dpaa@sta/net_dpaa_dpaa_rxtx.c.o'.
[971/2283] Compiling C object 'drivers/a715181@@tmp_rte_pmd_dpaa2@sta/net_dpaa2_dpaa2_flow.c.o'.
ninja: build stopped: subcommand failed




*Meson Build Failed #4:
OS: UB1804-32
Target:./build-gcc-static
FAILED: drivers/a715181@@tmp_rte_pmd_dpaa@sta/net_dpaa_dpaa_ethdev.c.o 
gcc -Idrivers/a715181@@tmp_rte_pmd_dpaa@sta -Idrivers -I../drivers -Idrivers/net/dpaa -I../drivers/net/dpaa -Ilib/librte_ethdev -I../lib/librte_ethdev -I. -I../ -Iconfig -I../config -Ilib/librte_eal/include -I../lib/librte_eal/include -Ilib/librte_eal/linux/include -I../lib/librte_eal/linux/include -Ilib/librte_eal/x86/include -I../lib/librte_eal/x86/include -Ilib/librte_eal/common -I../lib/librte_eal/common -Ilib/librte_eal -I../lib/librte_eal -Ilib/librte_kvargs -I../lib/librte_kvargs -Ilib/librte_telemetry/../librte_metrics -I../lib/librte_telemetry/../librte_metrics -Ilib/librte_telemetry -I../lib/librte_telemetry -Ilib/librte_net -I../lib/librte_net -Ilib/librte_mbuf -I../lib/librte_mbuf -Ilib/librte_mempool -I../lib/librte_mempool -Ilib/librte_ring -I../lib/librte_ring -Ilib/librte_meter -I../lib/librte_meter -Idrivers/bus/pci -I../drivers/bus/pci -I../drivers/bus/pci/linux -Ilib/librte_pci -I../lib/librte_pci -Idrivers/bus/vdev -I../drivers/bus/vdev -Idrivers/mempool/dpaa -I../drivers/mempool/dpaa -Idrivers/bus/dpaa -I../drivers/bus/dpaa -I../drivers/bus/dpaa/include -I../drivers/bus/dpaa/base/qbman -Idrivers/common/dpaax -I../drivers/common/dpaax -I../drivers/common/dpaax/caamflib -Ilib/librte_eventdev -I../lib/librte_eventdev -Ilib/librte_hash -I../lib/librte_hash -Ilib/librte_timer -I../lib/librte_timer -Ilib/librte_cryptodev -I../lib/librte_cryptodev -fdiagnostics-color=always -pipe -D_FILE_OFFSET_BITS=64 -Wall -Winvalid-pch -Werror -O2 -g -include rte_config.h -Wextra -Wcast-qual -Wdeprecated -Wformat-nonliteral -Wformat-security -Wmissing-declarations -Wmissing-prototypes -Wnested-externs -Wold-style-definition -Wpointer-arith -Wsign-compare -Wstrict-prototypes -Wundef -Wwrite-strings -Wno-missing-field-initializers -Wno-pointer-to-int-cast -D_GNU_SOURCE -m32 -fPIC -march=native -DALLOW_EXPERIMENTAL_API -DALLOW_INTERNAL_API -Wno-format-truncation -Wno-pointer-arith -MD -MQ 'drivers/a715181@@tmp_rte_pmd_dpaa@sta/net_dpaa_dpaa_ethdev.c.o' -MF 'drivers/a715181@@tmp_rte_pmd_dpaa@sta/net_dpaa_dpaa_ethdev.c.o.d' -o 'drivers/a715181@@tmp_rte_pmd_dpaa@sta/net_dpaa_dpaa_ethdev.c.o' -c ../drivers/net/dpaa/dpaa_ethdev.c
../drivers/net/dpaa/dpaa_ethdev.c:1231:1: error: conflicting types for ‘rte_pmd_dpaa_set_tx_loopback’
 rte_pmd_dpaa_set_tx_loopback(uint8_t port, uint8_t on)
 ^~~~~~~~~~~~~~~~~~~~~~~~~~~~
In file included from ../drivers/net/dpaa/dpaa_ethdev.c:42:0:
../drivers/net/dpaa/rte_pmd_dpaa.h:32:1: note: previous declaration of ‘rte_pmd_dpaa_set_tx_loopback’ was here
 rte_pmd_dpaa_set_tx_loopback(uint16_t port, uint8_t on);
 ^~~~~~~~~~~~~~~~~~~~~~~~~~~~
[930/2129] Compiling C object 'drivers/a715181@@tmp_rte_pmd_cxgbe@sta/net_cxgbe_cxgbe_flow.c.o'.
[931/2129] Compiling C object 'drivers/a715181@@tmp_rte_pmd_cxgbe@sta/net_cxgbe_base_t4vf_hw.c.o'.
[932/2129] Generating rte_pmd_bnxt.pmd.c with a custom command.
[933/2129] Compiling C object 'drivers/a715181@@tmp_rte_pmd_cxgbe@sta/net_cxgbe_sge.c.o'.
[934/2129] Compiling C object 'drivers/a715181@@tmp_rte_pmd_cxgbe@sta/net_cxgbe_cxgbe_filter.c.o'.
[935/2129] Compiling C object 'drivers/a715181@@tmp_rte_pmd_dpaa2@sta/net_dpaa2_base_dpaa2_hw_dpni.c.o'.
[936/2129] Compiling C object 'drivers/a715181@@tmp_rte_pmd_dpaa2@sta/net_dpaa2_dpaa2_mux.c.o'.
[937/2129] Compiling C object 'drivers/a715181@@tmp_rte_pmd_cxgbe@sta/net_cxgbe_base_t4_hw.c.o'.
[938/2129] Compiling C object 'drivers/a715181@@tmp_rte_pmd_dpaa@sta/net_dpaa_dpaa_rxtx.c.o'.
[939/2129] Compiling C object 'drivers/a715181@@tmp_rte_pmd_dpaa2@sta/net_dpaa2_dpaa2_flow.c.o'.
[940/2129] Compiling C object 'lib/76b5a35@@rte_pipeline@sta/librte_pipeline_rte_table_action.c.o'.
ninja: build stopped: subcommand failed




*Meson Build Failed #5:
OS: UB2004-64
Target:./build-gcc-static
FAILED: drivers/a715181@@tmp_rte_pmd_dpaa@sta/net_dpaa_dpaa_ethdev.c.o 
gcc -Idrivers/a715181@@tmp_rte_pmd_dpaa@sta -Idrivers -I../drivers -Idrivers/net/dpaa -I../drivers/net/dpaa -Ilib/librte_ethdev -I../lib/librte_ethdev -I. -I../ -Iconfig -I../config -Ilib/librte_eal/include -I../lib/librte_eal/include -Ilib/librte_eal/linux/include -I../lib/librte_eal/linux/include -Ilib/librte_eal/x86/include -I../lib/librte_eal/x86/include -Ilib/librte_eal/common -I../lib/librte_eal/common -Ilib/librte_eal -I../lib/librte_eal -Ilib/librte_kvargs -I../lib/librte_kvargs -Ilib/librte_telemetry/../librte_metrics -I../lib/librte_telemetry/../librte_metrics -Ilib/librte_telemetry -I../lib/librte_telemetry -Ilib/librte_net -I../lib/librte_net -Ilib/librte_mbuf -I../lib/librte_mbuf -Ilib/librte_mempool -I../lib/librte_mempool -Ilib/librte_ring -I../lib/librte_ring -Ilib/librte_meter -I../lib/librte_meter -Idrivers/bus/pci -I../drivers/bus/pci -I../drivers/bus/pci/linux -Ilib/librte_pci -I../lib/librte_pci -Idrivers/bus/vdev -I../drivers/bus/vdev -Idrivers/mempool/dpaa -I../drivers/mempool/dpaa -Idrivers/bus/dpaa -I../drivers/bus/dpaa -I../drivers/bus/dpaa/include -I../drivers/bus/dpaa/base/qbman -Idrivers/common/dpaax -I../drivers/common/dpaax -I../drivers/common/dpaax/caamflib -Ilib/librte_eventdev -I../lib/librte_eventdev -Ilib/librte_hash -I../lib/librte_hash -Ilib/librte_timer -I../lib/librte_timer -Ilib/librte_cryptodev -I../lib/librte_cryptodev -fdiagnostics-color=always -pipe -D_FILE_OFFSET_BITS=64 -Wall -Winvalid-pch -Werror -O2 -g -include rte_config.h -Wextra -Wcast-qual -Wdeprecated -Wformat-nonliteral -Wformat-security -Wmissing-declarations -Wmissing-prototypes -Wnested-externs -Wold-style-definition -Wpointer-arith -Wsign-compare -Wstrict-prototypes -Wundef -Wwrite-strings -Wno-address-of-packed-member -Wno-packed-not-aligned -Wno-missing-field-initializers -D_GNU_SOURCE -fPIC -march=native -DALLOW_EXPERIMENTAL_API -DALLOW_INTERNAL_API -Wno-format-truncation -Wno-pointer-arith -MD -MQ 'drivers/a715181@@tmp_rte_pmd_dpaa@sta/net_dpaa_dpaa_ethdev.c.o' -MF 'drivers/a715181@@tmp_rte_pmd_dpaa@sta/net_dpaa_dpaa_ethdev.c.o.d' -o 'drivers/a715181@@tmp_rte_pmd_dpaa@sta/net_dpaa_dpaa_ethdev.c.o' -c ../drivers/net/dpaa/dpaa_ethdev.c
../drivers/net/dpaa/dpaa_ethdev.c:1231:1: error: conflicting types for ‘rte_pmd_dpaa_set_tx_loopback’
 1231 | rte_pmd_dpaa_set_tx_loopback(uint8_t port, uint8_t on)
      | ^~~~~~~~~~~~~~~~~~~~~~~~~~~~
In file included from ../drivers/net/dpaa/dpaa_ethdev.c:42:
../drivers/net/dpaa/rte_pmd_dpaa.h:32:1: note: previous declaration of ‘rte_pmd_dpaa_set_tx_loopback’ was here
   32 | rte_pmd_dpaa_set_tx_loopback(uint16_t port, uint8_t on);
      | ^~~~~~~~~~~~~~~~~~~~~~~~~~~~
[963/2379] Compiling C object 'drivers/a715181@@tmp_rte_pmd_cxgbe@sta/net_cxgbe_base_t4vf_hw.c.o'.
[964/2379] Compiling C object 'drivers/a715181@@tmp_rte_pmd_dpaa2@sta/net_dpaa2_dpaa2_mux.c.o'.
[965/2379] Generating rte_pmd_bnxt.pmd.c with a custom command.
[966/2379] Compiling C object 'drivers/a715181@@tmp_rte_pmd_dpaa2@sta/net_dpaa2_mc_dpkg.c.o'.
[967/2379] Generating symbol file 'lib/76b5a35@@rte_pipeline@sha/librte_pipeline.so.20.0.3.symbols'.
[968/2379] Compiling C object 'drivers/a715181@@tmp_rte_pmd_dpaa2@sta/net_dpaa2_base_dpaa2_hw_dpni.c.o'.
[969/2379] Compiling C object 'drivers/a715181@@tmp_rte_pmd_cxgbe@sta/net_cxgbe_base_t4_hw.c.o'.
[970/2379] Compiling C object 'drivers/a715181@@tmp_rte_pmd_dpaa2@sta/net_dpaa2_dpaa2_ethdev.c.o'.
[971/2379] Compiling C object 'drivers/a715181@@tmp_rte_pmd_dpaa@sta/net_dpaa_dpaa_rxtx.c.o'.
[972/2379] Compiling C object 'drivers/a715181@@tmp_rte_pmd_dpaa2@sta/net_dpaa2_dpaa2_rxtx.c.o'.
[973/2379] Compiling C object 'drivers/a715181@@tmp_rte_pmd_dpaa2@sta/net_dpaa2_dpaa2_flow.c.o'.
ninja: build stopped: subcommand failed



*Makefile Build Failed #1:
OS: CENTOS77-64
Target: x86_64-native-linuxapp-gcc
  CC bnx2x_ethdev.o.pmd.o
  LD bnx2x_ethdev.o
  CC cxgbevf_main.o
/root/CENTOS77-64_K3.10.0_GCC4.8.5/x86_64-native-linuxapp-gcc/05eb8bd802684e989f7218ee05e08042/dpdk/drivers/net/dpaa/dpaa_ethdev.c:1231:1: error: conflicting types for ‘rte_pmd_dpaa_set_tx_loopback’
 rte_pmd_dpaa_set_tx_loopback(uint8_t port, uint8_t on)
 ^
In file included from /root/CENTOS77-64_K3.10.0_GCC4.8.5/x86_64-native-linuxapp-gcc/05eb8bd802684e989f7218ee05e08042/dpdk/drivers/net/dpaa/dpaa_ethdev.c:42:0:
--
 rte_pmd_dpaa_set_tx_loopback(uint16_t port, uint8_t on);
 ^
cc1: warning: unrecognized command line option "-Wno-address-of-packed-member" [enabled by default]
make[6]: *** [dpaa_ethdev.o] Error 1
make[5]: *** [dpaa] Error 2
make[5]: *** Waiting for unfinished jobs....
  CC sge.o
  AR librte_pmd_qat.a
--
  AR librte_pmd_bnx2x.a
  INSTALL-LIB librte_pmd_bnx2x.a
make[6]: warning:  Clock skew detected.  Your build may be incomplete.
make[4]: *** [net] Error 2
make[4]: *** Waiting for unfinished jobs....
  AR librte_pmd_null_crypto.a
  CC caam_jr_capabilities.o
--
  INSTALL-LIB librte_pmd_dpaa_sec.a
make[6]: warning:  Clock skew detected.  Your build may be incomplete.
make[5]: warning:  Clock skew detected.  Your build may be incomplete.
make[3]: *** [drivers] Error 2
make[2]: *** [all] Error 2
make[1]: *** [pre_install] Error 2
make: *** [install] Error 2


*Makefile Build Failed #2:
OS: CENTOS82-64
Target: x86_64-native-linuxapp-gcc
make[6]: Warning: File '/root/CENTOS82-64_K4.18.0_GCC8.3.1/x86_64-native-linuxapp-gcc/05eb8bd802684e989f7218ee05e08042/dpdk/mk/internal/rte.build-post.mk' has modification time 37436 s in the future
  SYMLINK-FILE include/rte_pmd_dpaa2.h
  AR librte_pmd_bbdev_fpga_5gnr_fec.a
/root/CENTOS82-64_K4.18.0_GCC8.3.1/x86_64-native-linuxapp-gcc/05eb8bd802684e989f7218ee05e08042/dpdk/drivers/net/dpaa/dpaa_ethdev.c:1231:1: error: conflicting types for ‘rte_pmd_dpaa_set_tx_loopback’
 rte_pmd_dpaa_set_tx_loopback(uint8_t port, uint8_t on)
 ^~~~~~~~~~~~~~~~~~~~~~~~~~~~
In file included from /root/CENTOS82-64_K4.18.0_GCC8.3.1/x86_64-native-linuxapp-gcc/05eb8bd802684e989f7218ee05e08042/dpdk/drivers/net/dpaa/dpaa_ethdev.c:42:
--
  CC base/dpaa2_hw_dpni.o
  INSTALL-LIB librte_pmd_bbdev_fpga_5gnr_fec.a
cc1: warning: unrecognized command line option ‘-Wno-address-of-packed-member’
make[6]: *** [/root/CENTOS82-64_K4.18.0_GCC8.3.1/x86_64-native-linuxapp-gcc/05eb8bd802684e989f7218ee05e08042/dpdk/mk/internal/rte.compile-pre.mk:114: dpaa_ethdev.o] Error 1
make[5]: *** [/root/CENTOS82-64_K4.18.0_GCC8.3.1/x86_64-native-linuxapp-gcc/05eb8bd802684e989f7218ee05e08042/dpdk/mk/rte.subdir.mk:35: dpaa] Error 2
make[5]: *** Waiting for unfinished jobs....
make[6]: warning:  Clock skew detected.  Your build may be incomplete.
  CC dpaa2_rxtx.o
--
  CC virtio_cryptodev.o
  INSTALL-LIB librte_pmd_bnx2x.a
make[6]: warning:  Clock skew detected.  Your build may be incomplete.
make[4]: *** [/root/CENTOS82-64_K4.18.0_GCC8.3.1/x86_64-native-linuxapp-gcc/05eb8bd802684e989f7218ee05e08042/dpdk/mk/rte.subdir.mk:35: net] Error 2
make[4]: *** Waiting for unfinished jobs....
make[6]: Warning: File '/root/CENTOS82-64_K4.18.0_GCC8.3.1/x86_64-native-linuxapp-gcc/05eb8bd802684e989f7218ee05e08042/dpdk/mk/internal/rte.build-post.mk' has modification time 37427 s in the future
  CC caam_jr.o
--
  INSTALL-LIB librte_pmd_dpaa_sec.a
make[6]: warning:  Clock skew detected.  Your build may be incomplete.
make[5]: warning:  Clock skew detected.  Your build may be incomplete.
make[3]: *** [/root/CENTOS82-64_K4.18.0_GCC8.3.1/x86_64-native-linuxapp-gcc/05eb8bd802684e989f7218ee05e08042/dpdk/mk/rte.sdkbuild.mk:51: drivers] Error 2
make[2]: *** [/root/CENTOS82-64_K4.18.0_GCC8.3.1/x86_64-native-linuxapp-gcc/05eb8bd802684e989f7218ee05e08042/dpdk/mk/rte.sdkroot.mk:115: all] Error 2
make[1]: *** [/root/CENTOS82-64_K4.18.0_GCC8.3.1/x86_64-native-linuxapp-gcc/05eb8bd802684e989f7218ee05e08042/dpdk/mk/rte.sdkinstall.mk:61: pre_install] Error 2
make: *** [/root/CENTOS82-64_K4.18.0_GCC8.3.1/x86_64-native-linuxapp-gcc/05eb8bd802684e989f7218ee05e08042/dpdk/mk/rte.sdkroot.mk:92: install] Error 2


*Makefile Build Failed #3:
OS: CENTOS82-64
Target: x86_64-native-linuxapp-clang
  CC axgbe_rxtx_vec_sse.o
  CC rte_openssl_pmd.o
  SYMLINK-FILE include/rte_cryptodev_scheduler_operations.h
/root/CENTOS82-64_K4.18.0_Clang7.0.1/x86_64-native-linuxapp-clang/05eb8bd802684e989f7218ee05e08042/dpdk/drivers/net/dpaa/dpaa_ethdev.c:1231:1: error: conflicting types for 'rte_pmd_dpaa_set_tx_loopback'
rte_pmd_dpaa_set_tx_loopback(uint8_t port, uint8_t on)
^
/root/CENTOS82-64_K4.18.0_Clang7.0.1/x86_64-native-linuxapp-clang/05eb8bd802684e989f7218ee05e08042/dpdk/drivers/net/dpaa/rte_pmd_dpaa.h:32:1: note: previous declaration is here
--
^
  SYMLINK-FILE include/rte_cryptodev_scheduler.h
1 error generated.
make[6]: *** [/root/CENTOS82-64_K4.18.0_Clang7.0.1/x86_64-native-linuxapp-clang/05eb8bd802684e989f7218ee05e08042/dpdk/mk/internal/rte.compile-pre.mk:116: dpaa_ethdev.o] Error 1
make[6]: *** Waiting for unfinished jobs....
  PMDINFO rte_fpga_5gnr_fec.o.pmd.c
  CC rte_eth_bond_flow.o
--
  SYMLINK-FILE include/rte_pmd_dpaa2.h
  CC base/dpaa2_hw_dpni.o
  CC e1000_base.o
make[5]: *** [/root/CENTOS82-64_K4.18.0_Clang7.0.1/x86_64-native-linuxapp-clang/05eb8bd802684e989f7218ee05e08042/dpdk/mk/rte.subdir.mk:37: dpaa] Error 2
make[5]: *** Waiting for unfinished jobs....
  CC dpaa2_rxtx.o
  CC e1000_80003es2lan.o
--
  INSTALL-LIB librte_pmd_nitrox.a
  AR librte_pmd_cxgbe.a
  INSTALL-LIB librte_pmd_cxgbe.a
make[4]: *** [/root/CENTOS82-64_K4.18.0_Clang7.0.1/x86_64-native-linuxapp-clang/05eb8bd802684e989f7218ee05e08042/dpdk/mk/rte.subdir.mk:35: net] Error 2
make[4]: *** Waiting for unfinished jobs....
  PMDINFO virtio_cryptodev.o.pmd.c
  CC virtio_cryptodev.o.pmd.o
  LD virtio_cryptodev.o
  AR librte_pmd_virtio_crypto.a
  INSTALL-LIB librte_pmd_virtio_crypto.a
make[3]: *** [/root/CENTOS82-64_K4.18.0_Clang7.0.1/x86_64-native-linuxapp-clang/05eb8bd802684e989f7218ee05e08042/dpdk/mk/rte.sdkbuild.mk:51: drivers] Error 2
make[2]: *** [/root/CENTOS82-64_K4.18.0_Clang7.0.1/x86_64-native-linuxapp-clang/05eb8bd802684e989f7218ee05e08042/dpdk/mk/rte.sdkroot.mk:115: all] Error 2
make[1]: *** [/root/CENTOS82-64_K4.18.0_Clang7.0.1/x86_64-native-linuxapp-clang/05eb8bd802684e989f7218ee05e08042/dpdk/mk/rte.sdkinstall.mk:61: pre_install] Error 2
make: *** [/root/CENTOS82-64_K4.18.0_Clang7.0.1/x86_64-native-linuxapp-clang/05eb8bd802684e989f7218ee05e08042/dpdk/mk/rte.sdkroot.mk:92: install] Error 2


*Makefile Build Failed #4:
OS: CENTOS82-64
Target: x86_64-native-linuxapp-gcc+shared
  CC smt.o
  CC bnx2x_ethdev.o
  CC t4vf_hw.o
/root/CENTOS82-64_K4.18.0_GCC8.3.1/x86_64-native-linuxapp-gcc+shared/05eb8bd802684e989f7218ee05e08042/dpdk/drivers/net/dpaa/dpaa_ethdev.c:1231:1: error: conflicting types for ‘rte_pmd_dpaa_set_tx_loopback’
 rte_pmd_dpaa_set_tx_loopback(uint8_t port, uint8_t on)
 ^~~~~~~~~~~~~~~~~~~~~~~~~~~~
In file included from /root/CENTOS82-64_K4.18.0_GCC8.3.1/x86_64-native-linuxapp-gcc+shared/05eb8bd802684e989f7218ee05e08042/dpdk/drivers/net/dpaa/dpaa_ethdev.c:42:
--
  PMDINFO enetc_ethdev.o.pmd.c
  CC enetc_ethdev.o.pmd.o
cc1: warning: unrecognized command line option ‘-Wno-address-of-packed-member’
make[6]: *** [/root/CENTOS82-64_K4.18.0_GCC8.3.1/x86_64-native-linuxapp-gcc+shared/05eb8bd802684e989f7218ee05e08042/dpdk/mk/internal/rte.compile-pre.mk:116: dpaa_ethdev.o] Error 1
make[5]: *** [/root/CENTOS82-64_K4.18.0_GCC8.3.1/x86_64-native-linuxapp-gcc+shared/05eb8bd802684e989f7218ee05e08042/dpdk/mk/rte.subdir.mk:35: dpaa] Error 2
make[5]: *** Waiting for unfinished jobs....
  CC ecore_sp.o
  LD enetc_ethdev.o
--
  LD librte_pmd_e1000.so.20.0.3
  INSTALL-LIB librte_pmd_e1000.so.20.0.3
make[6]: warning:  Clock skew detected.  Your build may be incomplete.
make[4]: *** [/root/CENTOS82-64_K4.18.0_GCC8.3.1/x86_64-native-linuxapp-gcc+shared/05eb8bd802684e989f7218ee05e08042/dpdk/mk/rte.subdir.mk:35: net] Error 2
make[3]: *** [/root/CENTOS82-64_K4.18.0_GCC8.3.1/x86_64-native-linuxapp-gcc+shared/05eb8bd802684e989f7218ee05e08042/dpdk/mk/rte.sdkbuild.mk:51: drivers] Error 2
make[2]: *** [/root/CENTOS82-64_K4.18.0_GCC8.3.1/x86_64-native-linuxapp-gcc+shared/05eb8bd802684e989f7218ee05e08042/dpdk/mk/rte.sdkroot.mk:115: all] Error 2
make[1]: *** [/root/CENTOS82-64_K4.18.0_GCC8.3.1/x86_64-native-linuxapp-gcc+shared/05eb8bd802684e989f7218ee05e08042/dpdk/mk/rte.sdkinstall.mk:61: pre_install] Error 2
make: *** [/root/CENTOS82-64_K4.18.0_GCC8.3.1/x86_64-native-linuxapp-gcc+shared/05eb8bd802684e989f7218ee05e08042/dpdk/mk/rte.sdkroot.mk:92: install] Error 2


*Makefile Build Failed #5:
OS: CENTOS82-64
Target: x86_64-native-linuxapp-gcc+debug
make[6]: Warning: File '/root/CENTOS82-64_K4.18.0_GCC8.3.1/x86_64-native-linuxapp-gcc+debug/05eb8bd802684e989f7218ee05e08042/dpdk/mk/internal/rte.build-post.mk' has modification time 37502 s in the future
  SYMLINK-FILE include/rte_pmd_dpaa2.h
  CC base/dpaa2_hw_dpni.o
/root/CENTOS82-64_K4.18.0_GCC8.3.1/x86_64-native-linuxapp-gcc+debug/05eb8bd802684e989f7218ee05e08042/dpdk/drivers/net/dpaa/dpaa_ethdev.c:1231:1: error: conflicting types for ‘rte_pmd_dpaa_set_tx_loopback’
 rte_pmd_dpaa_set_tx_loopback(uint8_t port, uint8_t on)
 ^~~~~~~~~~~~~~~~~~~~~~~~~~~~
In file included from /root/CENTOS82-64_K4.18.0_GCC8.3.1/x86_64-native-linuxapp-gcc+debug/05eb8bd802684e989f7218ee05e08042/dpdk/drivers/net/dpaa/dpaa_ethdev.c:42:
--
  PMDINFO axgbe_ethdev.o.pmd.c
  CC axgbe_ethdev.o.pmd.o
  CC ena_ethdev.o
make[6]: *** [/root/CENTOS82-64_K4.18.0_GCC8.3.1/x86_64-native-linuxapp-gcc+debug/05eb8bd802684e989f7218ee05e08042/dpdk/mk/internal/rte.compile-pre.mk:114: dpaa_ethdev.o] Error 1
make[5]: *** [/root/CENTOS82-64_K4.18.0_GCC8.3.1/x86_64-native-linuxapp-gcc+debug/05eb8bd802684e989f7218ee05e08042/dpdk/mk/rte.subdir.mk:35: dpaa] Error 2
make[5]: *** Waiting for unfinished jobs....
  CC e1000_80003es2lan.o
  PMDINFO cxgbe_ethdev.o.pmd.c
--
  AR librte_pmd_bnx2x.a
  INSTALL-LIB librte_pmd_bnx2x.a
make[6]: warning:  Clock skew detected.  Your build may be incomplete.
make[4]: *** [/root/CENTOS82-64_K4.18.0_GCC8.3.1/x86_64-native-linuxapp-gcc+debug/05eb8bd802684e989f7218ee05e08042/dpdk/mk/rte.subdir.mk:35: net] Error 2
make[3]: *** [/root/CENTOS82-64_K4.18.0_GCC8.3.1/x86_64-native-linuxapp-gcc+debug/05eb8bd802684e989f7218ee05e08042/dpdk/mk/rte.sdkbuild.mk:51: drivers] Error 2
make[2]: *** [/root/CENTOS82-64_K4.18.0_GCC8.3.1/x86_64-native-linuxapp-gcc+debug/05eb8bd802684e989f7218ee05e08042/dpdk/mk/rte.sdkroot.mk:115: all] Error 2
make[1]: *** [/root/CENTOS82-64_K4.18.0_GCC8.3.1/x86_64-native-linuxapp-gcc+debug/05eb8bd802684e989f7218ee05e08042/dpdk/mk/rte.sdkinstall.mk:61: pre_install] Error 2
make: *** [/root/CENTOS82-64_K4.18.0_GCC8.3.1/x86_64-native-linuxapp-gcc+debug/05eb8bd802684e989f7218ee05e08042/dpdk/mk/rte.sdkroot.mk:92: install] Error 2


*Makefile Build Failed #6:
OS: FC32-64
Target: x86_64-native-linuxapp-gcc
  INSTALL-LIB librte_pmd_ark.a
make[6]: warning:  Clock skew detected.  Your build may be incomplete.
  CC otx2_cryptodev_hw_access.o
/root/FC32-64_K5.6.0_GCC10.0.1/x86_64-native-linuxapp-gcc/05eb8bd802684e989f7218ee05e08042/dpdk/drivers/net/dpaa/dpaa_ethdev.c:1231:1: error: conflicting types for ‘rte_pmd_dpaa_set_tx_loopback’
 1231 | rte_pmd_dpaa_set_tx_loopback(uint8_t port, uint8_t on)
      | ^~~~~~~~~~~~~~~~~~~~~~~~~~~~
In file included from /root/FC32-64_K5.6.0_GCC10.0.1/x86_64-native-linuxapp-gcc/05eb8bd802684e989f7218ee05e08042/dpdk/drivers/net/dpaa/dpaa_ethdev.c:42:
/root/FC32-64_K5.6.0_GCC10.0.1/x86_64-native-linuxapp-gcc/05eb8bd802684e989f7218ee05e08042/dpdk/drivers/net/dpaa/rte_pmd_dpaa.h:32:1: note: previous declaration of ‘rte_pmd_dpaa_set_tx_loopback’ was here
   32 | rte_pmd_dpaa_set_tx_loopback(uint16_t port, uint8_t on);
      | ^~~~~~~~~~~~~~~~~~~~~~~~~~~~
make[6]: *** [/root/FC32-64_K5.6.0_GCC10.0.1/x86_64-native-linuxapp-gcc/05eb8bd802684e989f7218ee05e08042/dpdk/mk/internal/rte.compile-pre.mk:114: dpaa_ethdev.o] Error 1
make[5]: *** [/root/FC32-64_K5.6.0_GCC10.0.1/x86_64-native-linuxapp-gcc/05eb8bd802684e989f7218ee05e08042/dpdk/mk/rte.subdir.mk:35: dpaa] Error 2
make[5]: *** Waiting for unfinished jobs....
  CC otx2_cryptodev_mbox.o
  CC otx2_cryptodev_ops.o
--
  LD nitrox_device.o
  INSTALL-LIB librte_pmd_bnx2x.a
make[6]: warning:  Clock skew detected.  Your build may be incomplete.
make[4]: *** [/root/FC32-64_K5.6.0_GCC10.0.1/x86_64-native-linuxapp-gcc/05eb8bd802684e989f7218ee05e08042/dpdk/mk/rte.subdir.mk:35: net] Error 2
make[4]: *** Waiting for unfinished jobs....
  CC caam_jr_uio.o
  CC nitrox_sym_capabilities.o
--
  INSTALL-LIB librte_pmd_dpaa2_sec.a
make[6]: warning:  Clock skew detected.  Your build may be incomplete.
make[5]: warning:  Clock skew detected.  Your build may be incomplete.
make[3]: *** [/root/FC32-64_K5.6.0_GCC10.0.1/x86_64-native-linuxapp-gcc/05eb8bd802684e989f7218ee05e08042/dpdk/mk/rte.sdkbuild.mk:51: drivers] Error 2
make[2]: *** [/root/FC32-64_K5.6.0_GCC10.0.1/x86_64-native-linuxapp-gcc/05eb8bd802684e989f7218ee05e08042/dpdk/mk/rte.sdkroot.mk:115: all] Error 2
make[1]: *** [/root/FC32-64_K5.6.0_GCC10.0.1/x86_64-native-linuxapp-gcc/05eb8bd802684e989f7218ee05e08042/dpdk/mk/rte.sdkinstall.mk:61: pre_install] Error 2
make: *** [/root/FC32-64_K5.6.0_GCC10.0.1/x86_64-native-linuxapp-gcc/05eb8bd802684e989f7218ee05e08042/dpdk/mk/rte.sdkroot.mk:92: install] Error 2


*Makefile Build Failed #7:
OS: FC32-64
Target: x86_64-native-linuxapp-clang
  CC dpaa_rxtx.o
  PMDINFO rte_fpga_5gnr_fec.o.pmd.c
  CC rte_fpga_5gnr_fec.o.pmd.o
/root/FC32-64_K5.6.0_Clang10.0.0/x86_64-native-linuxapp-clang/05eb8bd802684e989f7218ee05e08042/dpdk/drivers/net/dpaa/dpaa_ethdev.c:1231:1: error: conflicting types for 'rte_pmd_dpaa_set_tx_loopback'
rte_pmd_dpaa_set_tx_loopback(uint8_t port, uint8_t on)
^
/root/FC32-64_K5.6.0_Clang10.0.0/x86_64-native-linuxapp-clang/05eb8bd802684e989f7218ee05e08042/dpdk/drivers/net/dpaa/rte_pmd_dpaa.h:32:1: note: previous declaration is here
rte_pmd_dpaa_set_tx_loopback(uint16_t port, uint8_t on);
^
1 error generated.
make[6]: *** [/root/FC32-64_K5.6.0_Clang10.0.0/x86_64-native-linuxapp-clang/05eb8bd802684e989f7218ee05e08042/dpdk/mk/internal/rte.compile-pre.mk:116: dpaa_ethdev.o] Error 1
make[6]: *** Waiting for unfinished jobs....
  LD rte_fpga_5gnr_fec.o
  CC cxgbevf_main.o
--
  AR librte_pmd_octeontx_crypto.a
  INSTALL-LIB librte_pmd_octeontx_crypto.a
== Build drivers/crypto/scheduler
make[5]: *** [/root/FC32-64_K5.6.0_Clang10.0.0/x86_64-native-linuxapp-clang/05eb8bd802684e989f7218ee05e08042/dpdk/mk/rte.subdir.mk:35: dpaa] Error 2
make[5]: *** Waiting for unfinished jobs....
== Build drivers/crypto/null
  SYMLINK-FILE include/rte_cryptodev_scheduler_operations.h
--
  INSTALL-LIB librte_pmd_caam_jr.a
  AR librte_pmd_bnx2x.a
  INSTALL-LIB librte_pmd_bnx2x.a
make[4]: *** [/root/FC32-64_K5.6.0_Clang10.0.0/x86_64-native-linuxapp-clang/05eb8bd802684e989f7218ee05e08042/dpdk/mk/rte.subdir.mk:35: net] Error 2
make[4]: *** Waiting for unfinished jobs....
  AR librte_pmd_crypto_scheduler.a
  INSTALL-LIB librte_pmd_crypto_scheduler.a
--
  LD dpaa_sec.o
  AR librte_pmd_dpaa_sec.a
  INSTALL-LIB librte_pmd_dpaa_sec.a
make[3]: *** [/root/FC32-64_K5.6.0_Clang10.0.0/x86_64-native-linuxapp-clang/05eb8bd802684e989f7218ee05e08042/dpdk/mk/rte.sdkbuild.mk:51: drivers] Error 2
make[2]: *** [/root/FC32-64_K5.6.0_Clang10.0.0/x86_64-native-linuxapp-clang/05eb8bd802684e989f7218ee05e08042/dpdk/mk/rte.sdkroot.mk:115: all] Error 2
make[1]: *** [/root/FC32-64_K5.6.0_Clang10.0.0/x86_64-native-linuxapp-clang/05eb8bd802684e989f7218ee05e08042/dpdk/mk/rte.sdkinstall.mk:61: pre_install] Error 2
make: *** [/root/FC32-64_K5.6.0_Clang10.0.0/x86_64-native-linuxapp-clang/05eb8bd802684e989f7218ee05e08042/dpdk/mk/rte.sdkroot.mk:92: install] Error 2


*Makefile Build Failed #8:
OS: RHEL82-64
Target: x86_64-native-linuxapp-gcc
  CC sge.o
  CC cxgbe_filter.o
  CC cxgbe_flow.o
/root/RHEL82-64_K4.18.0_GCC8.3.1/x86_64-native-linuxapp-gcc/05eb8bd802684e989f7218ee05e08042/dpdk/drivers/net/dpaa/dpaa_ethdev.c:1231:1: error: conflicting types for ‘rte_pmd_dpaa_set_tx_loopback’
 rte_pmd_dpaa_set_tx_loopback(uint8_t port, uint8_t on)
 ^~~~~~~~~~~~~~~~~~~~~~~~~~~~
In file included from /root/RHEL82-64_K4.18.0_GCC8.3.1/x86_64-native-linuxapp-gcc/05eb8bd802684e989f7218ee05e08042/dpdk/drivers/net/dpaa/dpaa_ethdev.c:42:
--
 rte_pmd_dpaa_set_tx_loopback(uint16_t port, uint8_t on);
 ^~~~~~~~~~~~~~~~~~~~~~~~~~~~
cc1: warning: unrecognized command line option ‘-Wno-address-of-packed-member’
make[6]: *** [/root/RHEL82-64_K4.18.0_GCC8.3.1/x86_64-native-linuxapp-gcc/05eb8bd802684e989f7218ee05e08042/dpdk/mk/internal/rte.compile-pre.mk:116: dpaa_ethdev.o] Error 1
make[6]: *** Waiting for unfinished jobs....
  CC t4_hw.o
  CC rte_eth_bond_alb.o
--
  CC dpaa2_ethdev.o
  CC elink.o
  CC dpaa2_flow.o
make[5]: *** [/root/RHEL82-64_K4.18.0_GCC8.3.1/x86_64-native-linuxapp-gcc/05eb8bd802684e989f7218ee05e08042/dpdk/mk/rte.subdir.mk:35: dpaa] Error 2
make[5]: *** Waiting for unfinished jobs....
  CC dpaa2_mux.o
  CC dpaa2_sparser.o
--
  AR librte_pmd_bnx2x.a
  INSTALL-LIB librte_pmd_bnx2x.a
make[6]: warning:  Clock skew detected.  Your build may be incomplete.
make[4]: *** [/root/RHEL82-64_K4.18.0_GCC8.3.1/x86_64-native-linuxapp-gcc/05eb8bd802684e989f7218ee05e08042/dpdk/mk/rte.subdir.mk:35: net] Error 2
make[3]: *** [/root/RHEL82-64_K4.18.0_GCC8.3.1/x86_64-native-linuxapp-gcc/05eb8bd802684e989f7218ee05e08042/dpdk/mk/rte.sdkbuild.mk:51: drivers] Error 2
make[2]: *** [/root/RHEL82-64_K4.18.0_GCC8.3.1/x86_64-native-linuxapp-gcc/05eb8bd802684e989f7218ee05e08042/dpdk/mk/rte.sdkroot.mk:115: all] Error 2
make[1]: *** [/root/RHEL82-64_K4.18.0_GCC8.3.1/x86_64-native-linuxapp-gcc/05eb8bd802684e989f7218ee05e08042/dpdk/mk/rte.sdkinstall.mk:61: pre_install] Error 2
make: *** [/root/RHEL82-64_K4.18.0_GCC8.3.1/x86_64-native-linuxapp-gcc/05eb8bd802684e989f7218ee05e08042/dpdk/mk/rte.sdkroot.mk:92: install] Error 2


*Makefile Build Failed #9:
OS: SUSE15-64
Target: x86_64-native-linuxapp-clang
  CC bnx2x_ethdev.o
  CC rte_eth_bond_args.o
  CC rte_eth_bond_8023ad.o
/root/SUSE15-64_K4.12.14_Clang5.0.1/x86_64-native-linuxapp-clang/05eb8bd802684e989f7218ee05e08042/dpdk/drivers/net/dpaa/dpaa_ethdev.c:1231:1: error: conflicting types for 'rte_pmd_dpaa_set_tx_loopback'
rte_pmd_dpaa_set_tx_loopback(uint8_t port, uint8_t on)
^
/root/SUSE15-64_K4.12.14_Clang5.0.1/x86_64-native-linuxapp-clang/05eb8bd802684e989f7218ee05e08042/dpdk/drivers/net/dpaa/rte_pmd_dpaa.h:32:1: note: previous declaration is here
--
  CC axgbe_rxtx_vec_sse.o
== Build drivers/net/dpaa2
  CC scheduler_failover.o
make[6]: *** [/root/SUSE15-64_K4.12.14_Clang5.0.1/x86_64-native-linuxapp-clang/05eb8bd802684e989f7218ee05e08042/dpdk/mk/internal/rte.compile-pre.mk:116: dpaa_ethdev.o] Error 1
make[6]: *** Waiting for unfinished jobs....
  CC dpaa_rxtx.o
  CC ecore_sp.o
--
  CC scheduler_multicore.o
  CC bnx2x_vfpf.o
  CC rte_eth_bond_flow.o
make[5]: *** [/root/SUSE15-64_K4.12.14_Clang5.0.1/x86_64-native-linuxapp-clang/05eb8bd802684e989f7218ee05e08042/dpdk/mk/rte.subdir.mk:35: dpaa] Error 2
make[5]: *** Waiting for unfinished jobs....
  CC dpaa2_ethdev.o
== Build drivers/net/e1000
--
  LD igb_ethdev.o
  AR librte_pmd_e1000.a
  INSTALL-LIB librte_pmd_e1000.a
make[4]: *** [/root/SUSE15-64_K4.12.14_Clang5.0.1/x86_64-native-linuxapp-clang/05eb8bd802684e989f7218ee05e08042/dpdk/mk/rte.subdir.mk:35: net] Error 2
make[3]: *** [/root/SUSE15-64_K4.12.14_Clang5.0.1/x86_64-native-linuxapp-clang/05eb8bd802684e989f7218ee05e08042/dpdk/mk/rte.sdkbuild.mk:51: drivers] Error 2
make[2]: *** [/root/SUSE15-64_K4.12.14_Clang5.0.1/x86_64-native-linuxapp-clang/05eb8bd802684e989f7218ee05e08042/dpdk/mk/rte.sdkroot.mk:115: all] Error 2
make[1]: *** [/root/SUSE15-64_K4.12.14_Clang5.0.1/x86_64-native-linuxapp-clang/05eb8bd802684e989f7218ee05e08042/dpdk/mk/rte.sdkinstall.mk:61: pre_install] Error 2
make: *** [/root/SUSE15-64_K4.12.14_Clang5.0.1/x86_64-native-linuxapp-clang/05eb8bd802684e989f7218ee05e08042/dpdk/mk/rte.sdkroot.mk:92: install] Error 2


*Makefile Build Failed #10:
OS: SUSE15-64
Target: x86_64-native-linuxapp-gcc
== Build drivers/net/dpaa2
  INSTALL-LIB librte_pmd_bbdev_turbo_sw.a
== Build drivers/baseband/fpga_lte_fec
/root/SUSE15-64_K4.12.14_GCC7.3.1/x86_64-native-linuxapp-gcc/05eb8bd802684e989f7218ee05e08042/dpdk/drivers/net/dpaa/dpaa_ethdev.c:1231:1: error: conflicting types for ‘rte_pmd_dpaa_set_tx_loopback’
 rte_pmd_dpaa_set_tx_loopback(uint8_t port, uint8_t on)
 ^~~~~~~~~~~~~~~~~~~~~~~~~~~~
In file included from /root/SUSE15-64_K4.12.14_GCC7.3.1/x86_64-native-linuxapp-gcc/05eb8bd802684e989f7218ee05e08042/dpdk/drivers/net/dpaa/dpaa_ethdev.c:42:0:
--
 rte_pmd_dpaa_set_tx_loopback(uint16_t port, uint8_t on);
 ^~~~~~~~~~~~~~~~~~~~~~~~~~~~
cc1: warning: unrecognized command line option ‘-Wno-address-of-packed-member’
make[6]: *** [/root/SUSE15-64_K4.12.14_GCC7.3.1/x86_64-native-linuxapp-gcc/05eb8bd802684e989f7218ee05e08042/dpdk/mk/internal/rte.compile-pre.mk:116: dpaa_ethdev.o] Error 1
make[5]: *** [/root/SUSE15-64_K4.12.14_GCC7.3.1/x86_64-native-linuxapp-gcc/05eb8bd802684e989f7218ee05e08042/dpdk/mk/rte.subdir.mk:37: dpaa] Error 2
make[5]: *** Waiting for unfinished jobs....
== Build drivers/baseband/fpga_5gnr_fec
  AR librte_pmd_qat.a
--
== Build drivers/crypto/nitrox
  AR librte_pmd_dpaa2.a
  INSTALL-LIB librte_pmd_dpaa2.a
make[4]: *** [/root/SUSE15-64_K4.12.14_GCC7.3.1/x86_64-native-linuxapp-gcc/05eb8bd802684e989f7218ee05e08042/dpdk/mk/rte.subdir.mk:35: net] Error 2
make[4]: *** Waiting for unfinished jobs....
  CC dpaa_sec.o
  CC dpaa2_sec_dpseci.o
--
  LD dpaa2_sec_dpseci.o
  AR librte_pmd_dpaa2_sec.a
  INSTALL-LIB librte_pmd_dpaa2_sec.a
make[3]: *** [/root/SUSE15-64_K4.12.14_GCC7.3.1/x86_64-native-linuxapp-gcc/05eb8bd802684e989f7218ee05e08042/dpdk/mk/rte.sdkbuild.mk:51: drivers] Error 2
make[2]: *** [/root/SUSE15-64_K4.12.14_GCC7.3.1/x86_64-native-linuxapp-gcc/05eb8bd802684e989f7218ee05e08042/dpdk/mk/rte.sdkroot.mk:115: all] Error 2
make[1]: *** [/root/SUSE15-64_K4.12.14_GCC7.3.1/x86_64-native-linuxapp-gcc/05eb8bd802684e989f7218ee05e08042/dpdk/mk/rte.sdkinstall.mk:61: pre_install] Error 2
make: *** [/root/SUSE15-64_K4.12.14_GCC7.3.1/x86_64-native-linuxapp-gcc/05eb8bd802684e989f7218ee05e08042/dpdk/mk/rte.sdkroot.mk:92: install] Error 2


*Makefile Build Failed #11:
OS: UB1804-64
Target: x86_64-native-linuxapp-gcc
  PMDINFO zlib_pmd.o.pmd.c
  CC zlib_pmd.o.pmd.o
  LD zlib_pmd.o
/root/UB1804-64_K4.15.0_GCC7.3.0/x86_64-native-linuxapp-gcc/05eb8bd802684e989f7218ee05e08042/dpdk/drivers/net/dpaa/dpaa_ethdev.c:1231:1: error: conflicting types for ‘rte_pmd_dpaa_set_tx_loopback’
 rte_pmd_dpaa_set_tx_loopback(uint8_t port, uint8_t on)
 ^~~~~~~~~~~~~~~~~~~~~~~~~~~~
In file included from /root/UB1804-64_K4.15.0_GCC7.3.0/x86_64-native-linuxapp-gcc/05eb8bd802684e989f7218ee05e08042/dpdk/drivers/net/dpaa/dpaa_ethdev.c:42:0:
--
 rte_pmd_dpaa_set_tx_loopback(uint16_t port, uint8_t on);
 ^~~~~~~~~~~~~~~~~~~~~~~~~~~~
cc1: warning: unrecognized command line option ‘-Wno-address-of-packed-member’
/root/UB1804-64_K4.15.0_GCC7.3.0/x86_64-native-linuxapp-gcc/05eb8bd802684e989f7218ee05e08042/dpdk/mk/internal/rte.compile-pre.mk:114: recipe for target 'dpaa_ethdev.o' failed
make[6]: *** [dpaa_ethdev.o] Error 1
/root/UB1804-64_K4.15.0_GCC7.3.0/x86_64-native-linuxapp-gcc/05eb8bd802684e989f7218ee05e08042/dpdk/mk/rte.subdir.mk:35: recipe for target 'dpaa' failed
make[5]: *** [dpaa] Error 2
make[5]: *** Waiting for unfinished jobs....
  CC rte_eth_bond_alb.o
  AR librte_pmd_axgbe.a
--
  INSTALL-LIB librte_pmd_bnx2x.a
  INSTALL-LIB librte_pmd_null_crypto.a
  CC caam_jr_uio.o
/root/UB1804-64_K4.15.0_GCC7.3.0/x86_64-native-linuxapp-gcc/05eb8bd802684e989f7218ee05e08042/dpdk/mk/rte.subdir.mk:35: recipe for target 'net' failed
make[4]: *** [net] Error 2
make[4]: *** Waiting for unfinished jobs....
  PMDINFO nitrox_device.o.pmd.c
  CC nitrox_device.o.pmd.o
--
  LD dpaa2_sec_dpseci.o
  AR librte_pmd_dpaa2_sec.a
  INSTALL-LIB librte_pmd_dpaa2_sec.a
/root/UB1804-64_K4.15.0_GCC7.3.0/x86_64-native-linuxapp-gcc/05eb8bd802684e989f7218ee05e08042/dpdk/mk/rte.sdkbuild.mk:51: recipe for target 'drivers' failed
make[3]: *** [drivers] Error 2
/root/UB1804-64_K4.15.0_GCC7.3.0/x86_64-native-linuxapp-gcc/05eb8bd802684e989f7218ee05e08042/dpdk/mk/rte.sdkroot.mk:113: recipe for target 'all' failed
make[2]: *** [all] Error 2
/root/UB1804-64_K4.15.0_GCC7.3.0/x86_64-native-linuxapp-gcc/05eb8bd802684e989f7218ee05e08042/dpdk/mk/rte.sdkinstall.mk:60: recipe for target 'pre_install' failed
make[1]: *** [pre_install] Error 2
/root/UB1804-64_K4.15.0_GCC7.3.0/x86_64-native-linuxapp-gcc/05eb8bd802684e989f7218ee05e08042/dpdk/mk/rte.sdkroot.mk:92: recipe for target 'install' failed
make: *** [install] Error 2


*Makefile Build Failed #12:
OS: UB2004-32
Target: i686-native-linuxapp-gcc
  CC base/dpaa2_hw_dpni.o
  CC cxgbe_flow.o
  CC rte_eth_bond_flow.o
/root/UB2004-32_K4.15.0_GCC9.3.0/i686-native-linuxapp-gcc/05eb8bd802684e989f7218ee05e08042/dpdk/drivers/net/dpaa/dpaa_ethdev.c:1231:1: error: conflicting types for ‘rte_pmd_dpaa_set_tx_loopback’
 1231 | rte_pmd_dpaa_set_tx_loopback(uint8_t port, uint8_t on)
      | ^~~~~~~~~~~~~~~~~~~~~~~~~~~~
In file included from /root/UB2004-32_K4.15.0_GCC9.3.0/i686-native-linuxapp-gcc/05eb8bd802684e989f7218ee05e08042/dpdk/drivers/net/dpaa/dpaa_ethdev.c:42:
--
   32 | rte_pmd_dpaa_set_tx_loopback(uint16_t port, uint8_t on);
      | ^~~~~~~~~~~~~~~~~~~~~~~~~~~~
  CC t4_hw.o
make[6]: *** [/root/UB2004-32_K4.15.0_GCC9.3.0/i686-native-linuxapp-gcc/05eb8bd802684e989f7218ee05e08042/dpdk/mk/internal/rte.compile-pre.mk:114: dpaa_ethdev.o] Error 1
make[5]: *** [/root/UB2004-32_K4.15.0_GCC9.3.0/i686-native-linuxapp-gcc/05eb8bd802684e989f7218ee05e08042/dpdk/mk/rte.subdir.mk:37: dpaa] Error 2
make[5]: *** Waiting for unfinished jobs....
  CC clip_tbl.o
  CC mps_tcam.o
--
  CC virtio_rxtx.o
  AR librte_pmd_dpaa2.a
  INSTALL-LIB librte_pmd_dpaa2.a
make[4]: *** [/root/UB2004-32_K4.15.0_GCC9.3.0/i686-native-linuxapp-gcc/05eb8bd802684e989f7218ee05e08042/dpdk/mk/rte.subdir.mk:35: net] Error 2
make[4]: *** Waiting for unfinished jobs....
  CC mc/dpseci.o
  AR librte_pmd_null_crypto.a
--
  INSTALL-LIB librte_pmd_dpaa_sec.a
  AR librte_pmd_octeontx2_crypto.a
  INSTALL-LIB librte_pmd_octeontx2_crypto.a
make[3]: *** [/root/UB2004-32_K4.15.0_GCC9.3.0/i686-native-linuxapp-gcc/05eb8bd802684e989f7218ee05e08042/dpdk/mk/rte.sdkbuild.mk:53: drivers] Error 2
make[2]: *** [/root/UB2004-32_K4.15.0_GCC9.3.0/i686-native-linuxapp-gcc/05eb8bd802684e989f7218ee05e08042/dpdk/mk/rte.sdkroot.mk:115: all] Error 2
make[1]: *** [/root/UB2004-32_K4.15.0_GCC9.3.0/i686-native-linuxapp-gcc/05eb8bd802684e989f7218ee05e08042/dpdk/mk/rte.sdkinstall.mk:61: pre_install] Error 2
make: *** [/root/UB2004-32_K4.15.0_GCC9.3.0/i686-native-linuxapp-gcc/05eb8bd802684e989f7218ee05e08042/dpdk/mk/rte.sdkroot.mk:92: install] Error 2


*Makefile Build Failed #13:
OS: UB2004-64
Target: x86_64-native-linuxapp-clang
== Build drivers/net/e1000
  AR librte_pmd_bond.a
  INSTALL-LIB librte_pmd_bond.a
/root/UB2004-64_K5.4.0_Clang10.0.0/x86_64-native-linuxapp-clang/05eb8bd802684e989f7218ee05e08042/dpdk/drivers/net/dpaa/dpaa_ethdev.c:1231:1: error: conflicting types for 'rte_pmd_dpaa_set_tx_loopback'
rte_pmd_dpaa_set_tx_loopback(uint8_t port, uint8_t on)
^
/root/UB2004-64_K5.4.0_Clang10.0.0/x86_64-native-linuxapp-clang/05eb8bd802684e989f7218ee05e08042/dpdk/drivers/net/dpaa/rte_pmd_dpaa.h:32:1: note: previous declaration is here
--
  CC dpaa2_ethdev.o
1 error generated.
== Build drivers/net/ena
make[6]: *** [/root/UB2004-64_K5.4.0_Clang10.0.0/x86_64-native-linuxapp-clang/05eb8bd802684e989f7218ee05e08042/dpdk/mk/internal/rte.compile-pre.mk:116: dpaa_ethdev.o] Error 1
make[5]: *** [/root/UB2004-64_K5.4.0_Clang10.0.0/x86_64-native-linuxapp-clang/05eb8bd802684e989f7218ee05e08042/dpdk/mk/rte.subdir.mk:36: dpaa] Error 2
make[5]: *** Waiting for unfinished jobs....
  CC dpaa2_flow.o
  CC dpaa2_mux.o
--
  LD igb_ethdev.o
  AR librte_pmd_e1000.a
  INSTALL-LIB librte_pmd_e1000.a
make[4]: *** [/root/UB2004-64_K5.4.0_Clang10.0.0/x86_64-native-linuxapp-clang/05eb8bd802684e989f7218ee05e08042/dpdk/mk/rte.subdir.mk:35: net] Error 2
make[3]: *** [/root/UB2004-64_K5.4.0_Clang10.0.0/x86_64-native-linuxapp-clang/05eb8bd802684e989f7218ee05e08042/dpdk/mk/rte.sdkbuild.mk:51: drivers] Error 2
make[2]: *** [/root/UB2004-64_K5.4.0_Clang10.0.0/x86_64-native-linuxapp-clang/05eb8bd802684e989f7218ee05e08042/dpdk/mk/rte.sdkroot.mk:115: all] Error 2
make[1]: *** [/root/UB2004-64_K5.4.0_Clang10.0.0/x86_64-native-linuxapp-clang/05eb8bd802684e989f7218ee05e08042/dpdk/mk/rte.sdkinstall.mk:61: pre_install] Error 2
make: *** [/root/UB2004-64_K5.4.0_Clang10.0.0/x86_64-native-linuxapp-clang/05eb8bd802684e989f7218ee05e08042/dpdk/mk/rte.sdkroot.mk:92: install] Error 2


*Makefile Build Failed #14:
OS: UB2004-64
Target: x86_64-native-linuxapp-gcc
  AR librte_pmd_atlantic.a
  INSTALL-LIB librte_pmd_atlantic.a
== Build drivers/net/e1000
/root/UB2004-64_K5.4.0_GCC9.3.0/x86_64-native-linuxapp-gcc/05eb8bd802684e989f7218ee05e08042/dpdk/drivers/net/dpaa/dpaa_ethdev.c:1231:1: error: conflicting types for ‘rte_pmd_dpaa_set_tx_loopback’
 1231 | rte_pmd_dpaa_set_tx_loopback(uint8_t port, uint8_t on)
      | ^~~~~~~~~~~~~~~~~~~~~~~~~~~~
In file included from /root/UB2004-64_K5.4.0_GCC9.3.0/x86_64-native-linuxapp-gcc/05eb8bd802684e989f7218ee05e08042/dpdk/drivers/net/dpaa/dpaa_ethdev.c:42:
/root/UB2004-64_K5.4.0_GCC9.3.0/x86_64-native-linuxapp-gcc/05eb8bd802684e989f7218ee05e08042/dpdk/drivers/net/dpaa/rte_pmd_dpaa.h:32:1: note: previous declaration of ‘rte_pmd_dpaa_set_tx_loopback’ was here
   32 | rte_pmd_dpaa_set_tx_loopback(uint16_t port, uint8_t on);
      | ^~~~~~~~~~~~~~~~~~~~~~~~~~~~
make[6]: *** [/root/UB2004-64_K5.4.0_GCC9.3.0/x86_64-native-linuxapp-gcc/05eb8bd802684e989f7218ee05e08042/dpdk/mk/internal/rte.compile-pre.mk:114: dpaa_ethdev.o] Error 1
make[5]: *** [/root/UB2004-64_K5.4.0_GCC9.3.0/x86_64-native-linuxapp-gcc/05eb8bd802684e989f7218ee05e08042/dpdk/mk/rte.subdir.mk:37: dpaa] Error 2
make[5]: *** Waiting for unfinished jobs....
  CC cxgbevf_ethdev.o
  CC cxgbe_main.o
--
  AR librte_pmd_bnx2x.a
  CC scheduler_roundrobin.o
  INSTALL-LIB librte_pmd_bnx2x.a
make[4]: *** [/root/UB2004-64_K5.4.0_GCC9.3.0/x86_64-native-linuxapp-gcc/05eb8bd802684e989f7218ee05e08042/dpdk/mk/rte.subdir.mk:35: net] Error 2
make[4]: *** Waiting for unfinished jobs....
  CC scheduler_pkt_size_distr.o
  CC virtio_rxtx.o
--
  INSTALL-LIB librte_pmd_crypto_scheduler.a
  AR librte_pmd_octeontx2_crypto.a
  INSTALL-LIB librte_pmd_octeontx2_crypto.a
make[3]: *** [/root/UB2004-64_K5.4.0_GCC9.3.0/x86_64-native-linuxapp-gcc/05eb8bd802684e989f7218ee05e08042/dpdk/mk/rte.sdkbuild.mk:51: drivers] Error 2
make[2]: *** [/root/UB2004-64_K5.4.0_GCC9.3.0/x86_64-native-linuxapp-gcc/05eb8bd802684e989f7218ee05e08042/dpdk/mk/rte.sdkroot.mk:115: all] Error 2
make[1]: *** [/root/UB2004-64_K5.4.0_GCC9.3.0/x86_64-native-linuxapp-gcc/05eb8bd802684e989f7218ee05e08042/dpdk/mk/rte.sdkinstall.mk:61: pre_install] Error 2
make: *** [/root/UB2004-64_K5.4.0_GCC9.3.0/x86_64-native-linuxapp-gcc/05eb8bd802684e989f7218ee05e08042/dpdk/mk/rte.sdkroot.mk:92: install] Error 2
DPDK STV team

^ permalink raw reply	[flat|nested] 2+ messages in thread

end of thread, other threads:[~2020-07-12  2:27 UTC | newest]

Thread overview: 2+ messages (download: mbox.gz / follow: Atom feed)
-- links below jump to the message on this page --
2020-07-11  4:44 [dpdk-test-report] |FAILURE| pw(73784) [v20.11] net/dpaa: fix public API port ID type sys_stv
2020-07-12  2:27 sys_stv

automatic DPDK test reports

This inbox may be cloned and mirrored by anyone:

	git clone --mirror https://inbox.dpdk.org/test-report/0 test-report/git/0.git

	# If you have public-inbox 1.1+ installed, you may
	# initialize and index your mirror using the following commands:
	public-inbox-init -V2 test-report test-report/ https://inbox.dpdk.org/test-report \
		test-report@dpdk.org
	public-inbox-index test-report

Example config snippet for mirrors.
Newsgroup available over NNTP:
	nntp://inbox.dpdk.org/inbox.dpdk.test-report


AGPL code for this site: git clone https://public-inbox.org/public-inbox.git